{"text_format":"3","workbook":"xlsx","n_sheets":16,"sheets":["invullijst","Personeel","Jeugd","65+","Korps","wedstrijd 1A","wedstrijd 1B","wedstrijd 2A","wedstrijd 2B","wedstrijd 3A","wedstrijd 3B","wedstrijd 4A","wedstrijd 4B","wedstrijd 5A","wedstrijd 5B","blanco formulier"],"not_rendered":{"macros":1,"defined_names":5},"read":"whole","date_system":"1900"}

{"sheet":"invullijst","index":0,"n_rows":73,"n_cols":11,"rows_kept":73,"merged":[[0,5,0,6],[0,7,0,9],[1,5,1,6],[1,7,1,9],[2,5,2,10],[3,9,4,10]]}
[1,"Sint Ambrosius Baardwijk","Baardwijk",null,null,"Organisatie",null,"jaar",null,null,"nr"]
[2,"St. Crispinus & Crispinianus Besoijen","Besoijen",{"$nulls":4},"2023 - 2024",null,null,2]
[3,"O.L.V. Schuts Elshout","Elshout",null,null,{"$f":"IF(VLOOKUP($K2,invullijst!$A$1:$C$6,2,FALSE)=\"\",\"\",VLOOKUP($K2,invullijst!$A$1:$C$6,2,FALSE))","v":"St. Crispinus & Crispinianus Besoijen"}]
[4,"Sint Ambrosius Haarsteeg","Haarsteeg",{"$nulls":6},"versie 2020-1"]
[5,"Sint Jan Baptist Kaatsheuvel","Kaatsheuvel"]
[]
[]
["NR","NAAM","PLAATS","dis.","€","W 1","W 2","W 3","W 4","W 5","kampk"]
[0,0,0,0,0,0,0,0,0,0,0]
[0,0,0,0,{"v":0,"d":"0.00"},0,0,0,0,0,0]
[102,"John de Jong","Baardwijk","vr",null,null,74,61,65,77,37]
[103,"Norbert van Buul","Baardwijk","vr",null,null,64,53]
[105,"René Klijn","Baardwijk","vr",null,null,83,81,83,84,42]
[106,"René Pullens","Baardwijk","vr",null,null,84,84,79,88,44]
[108,"Bram Pullens","Baardwijk","vr",null,null,81,87,76,75,34]
[109,"Gijs Pullens","Baardwijk","J",null,null,83,92,83,78,44]
[111,"Frans van Buul","Baardwijk","65+",null,null,83,81,66,78,40]
[113,"Kees Coppens","Baardwijk","65+",null,null,84,88,68,85,36]
[201,"Sander Oome","Besoijen","vr",null,91,92,92,92,null,44]
[202,"Arco van Kuijk","Besoijen","vr",null,74,68,69,60,null,37]
[203,"Frank van den Houdt","Besoijen","vr",null,80,82,81,85,null,36]
[204,"Harry de Louw","Besoijen","vr",null,80,81,85,80,null,35]
[205,"Jos v/d Snepscheut","Besoijen","vr",null,79,83,79,82,null,40]
[206,"Kees van Hulten","Besoijen","vr",null,86,85,78,85,null,38]
[208,"Erin van Hulten","Besoijen","vr",null,78,80,79,81,null,39]
[209,"René van Kuijk","Besoijen","vr",null,76,80,87,82,null,42]
[210,"Nick de Vaan","Besoijen","vr",null,68,63,74,75,null,37]
[211,"Ad van den houdt","Besoijen","65+",null,96,88,92,90,null,41]
[212,"René Duquesnoy","Besoijen","65+",null,90,87,92,87,null,45]
[213,"Roland van Delft","Besoijen","vr",null,69,59,77,77,null,35]
[214,"André de Vaan","Besoijen","65+",null,87,89,91,96,null,45]
[215,"Pieter Laghuwitz","Besoijen","vr",null,79,74,86,83,null,38]
[216,"Hans Laghuwitz","Besoijen","vr",null,67,74,82,81,null,32]
[217,"Jānis Jākobsons","Besoijen","vr",null,65,72,81,79,null,40]
[301,"Arjen van Assem disp","Elshout","65+",2,91,null,93,89,89,42]
[302,"Freek de Jong","Elshout","vr",2,89,null,90,88,90,45]
[304,"Henk Bruurmijn ","Elshout","vr",2,71,null,78,68,68,40]
[305,"Johan Klerx","Elshout","vr",2,84,null,89,84,82,43]
[306,"Ron Groot","Elshout","vr",2,86,null,91,84,85,43]
[307,"Bert van Engelen","Elshout","65+",2,95,null,93,93,96,45]
[308,"Jan van Esch","Elshout","vr",2,60]
[309,"René de Jong","Elshout","65+",2,88,null,94,93,84,46]
[310,"Tini Boom","Elshout","65+",2,null,null,93,94,93,43]
[311,"Ton Kolmans","Elshout","vr",2,null,null,80,86,83,42]
[312,"Floor de Jong","Elshout","J",0,91,null,91,90,92,43]
[401,"Frans van Beurden","Haarsteeg","65+",null,95,97,null,94,94,46]
[402,"Daniëlle v/d Lee","Haarsteeg","vr",null,80,79,null,75,83,40]
[403,"Dorien de Kort","Haarsteeg","65+",null,92,null,null,94,87,46]
[404,"Gerard van Beurden","Haarsteeg","65+",null,93,97,null,98,94,46]
[405,"Jan de Vaan","Haarsteeg","vr",null,86,85,null,81,83,38]
[406,"Jeroen van Oss","Haarsteeg","vr",null,82,82,null,83,83,40]
[407,"Justin van Son","Haarsteeg","vr",null,84,85,null,79,80,39]
[408,"Rudy van Falier","Haarsteeg","vr",null,86,79,null,80,85,43]
[410,"Tonnie Koks","Haarsteeg","vr",null,85,84,null,82,84,43]
[412,"Francien v/d Wiel","Haarsteeg","65+",null,96,87,null,92,89,47]
[413,"Frans Mommersteeg","Haarsteeg","65+",null,96,98,null,95,94,48]
[415,"Wim de Gouw","Haarsteeg","65+",null,95,95,null,95,95,48]
[501,"Annette Vos","Kaatsheuvel","vr",null,80,89,83,null,83,40]
[502,"Diny Vos","Kaatsheuvel","vr",null,67,66,81,null,71,34]
[504,"Koen v/d Ven","Kaatsheuvel","vr",null,94,90,87,null,89,43]
[505,"Leo Wagemakers","Kaatsheuvel","65+",null,58,69,58,null,10,36]
[506,"Maikel Monden","Kaatsheuvel","vr",null,84,85,80,null,71,41]
[507,"Michael Blaauwbroek","Kaatsheuvel","vr",null,70,70,77,null,70,42]
[508,"Rowan Dobbelsteen","Kaatsheuvel","vr",null,80,79,83,null,80,39]
[509,"Adwan de Pinth","Kaatsheuvel","65+",null,95,96,95,null,92,49]
[]
[511,"Ton Stans","Kaatsheuvel","65+",null,85,83,82,null,84,38]
[512,"Hans Bergakker","Kaatsheuvel","vr",null,81,71,71,null,69,38]
[513,"Mark van Delft","Kaatsheuvel","vr",null,65,79]
[514,"Toon Ophorst","Kaatsheuvel","65+",null,49,67,75,null,63,18]
[515,"Ilona Bergakker disp","Kaatsheuvel","65+",null,92,93,89,null,null,46]
[516,"Henry Bergakker disp","Kaatsheuvel","65+",null,80,88,88,null,93,44]
[112,"Toon van Buul","Baardwijk","65+",{"$nulls":4},65,null,27]

{"sheet":"Personeel","index":1,"n_rows":55,"n_cols":13,"rows_kept":55,"merged":[[0,0,1,5],[0,6,0,9],[0,10,0,12],[1,6,1,12],[2,6,2,10]]}
["PERSONEEL",{"$nulls":5},{"$f":"invullijst!F1","v":"Organisatie"},{"$nulls":3},{"$f":"invullijst!H2","v":"2023 - 2024"}]
[{"$nulls":6},{"$f":"invullijst!F3","v":"St. Crispinus & Crispinianus Besoijen"}]
[{"$nulls":6},"wedstrijd",{"$nulls":5},"KAMP-"]
["KL.",null,"schutter",null,"NAAM","PLAATS",1,2,3,4,5,"TOTAAL","KAART"]
[null,1,201,{"$f":"IF(VLOOKUP($C5,invullijst!$A$11:$M$177,4,FALSE)=\"\",\"\",VLOOKUP($C5,invullijst!$A$11:$M$177,4,FALSE))","v":"vr"},{"$f":"IF(VLOOKUP($C5,invullijst!$A$11:$M$177,2,FALSE)=\"\",\"\",VLOOKUP($C5,invullijst!$A$11:$M$177,2,FALSE))","v":"Sander Oome"},{"$f":"IF(VLOOKUP($C5,invullijst!$A$11:$M$177,3,FALSE)=\"\",\"\",VLOOKUP($C5,invullijst!$A$11:$M$177,3,FALSE))","v":"Besoijen"},{"$f":"IF(VLOOKUP(C5,invullijst!$A$11:$M$177,6,FALSE)=\"\",\"\",VLOOKUP(C5,invullijst!$A$11:$M$177,6,FALSE))","v":91},{"$f":"IF(VLOOKUP($C5,invullijst!$A$11:$M$177,7,FALSE)=\"\",\"\",VLOOKUP($C5,invullijst!$A$11:$M$177,7,FALSE))","v":92},{"$f":"IF(VLOOKUP($C5,invullijst!$A$11:$M$177,8,FALSE)=\"\",\"\",VLOOKUP($C5,invullijst!$A$11:$M$177,8,FALSE))","v":92},{"$f":"IF(VLOOKUP($C5,invullijst!$A$11:$M$177,9,FALSE)=\"\",\"\",VLOOKUP($C5,invullijst!$A$11:$M$177,9,FALSE))","v":92},{"$f":"IF(VLOOKUP($C5,invullijst!$A$11:$M$177,10,FALSE)=\"\",\"\",VLOOKUP($C5,invullijst!$A$11:$M$177,10,FALSE))","v":""},{"$f":"SUM(G5:K5)","v":367},{"$f":"IF(VLOOKUP($C5,invullijst!$A$11:$M$177,11,FALSE)=\"\",\"\",VLOOKUP($C5,invullijst!$A$11:$M$177,11,FALSE))","v":44}]
[null,2,504,{"$f":"IF(VLOOKUP($C6,invullijst!$A$11:$M$177,4,FALSE)=\"\",\"\",VLOOKUP($C6,invullijst!$A$11:$M$177,4,FALSE))","v":"vr"},{"$f":"IF(VLOOKUP($C6,invullijst!$A$11:$M$177,2,FALSE)=\"\",\"\",VLOOKUP($C6,invullijst!$A$11:$M$177,2,FALSE))","v":"Koen v/d Ven"},{"$f":"IF(VLOOKUP($C6,invullijst!$A$11:$M$177,3,FALSE)=\"\",\"\",VLOOKUP($C6,invullijst!$A$11:$M$177,3,FALSE))","v":"Kaatsheuvel"},{"$f":"IF(VLOOKUP(C6,invullijst!$A$11:$M$177,6,FALSE)=\"\",\"\",VLOOKUP(C6,invullijst!$A$11:$M$177,6,FALSE))","v":94},{"$f":"IF(VLOOKUP($C6,invullijst!$A$11:$M$177,7,FALSE)=\"\",\"\",VLOOKUP($C6,invullijst!$A$11:$M$177,7,FALSE))","v":90},{"$f":"IF(VLOOKUP($C6,invullijst!$A$11:$M$177,8,FALSE)=\"\",\"\",VLOOKUP($C6,invullijst!$A$11:$M$177,8,FALSE))","v":87},{"$f":"IF(VLOOKUP($C6,invullijst!$A$11:$M$177,9,FALSE)=\"\",\"\",VLOOKUP($C6,invullijst!$A$11:$M$177,9,FALSE))","v":""},{"$f":"IF(VLOOKUP($C6,invullijst!$A$11:$M$177,10,FALSE)=\"\",\"\",VLOOKUP($C6,invullijst!$A$11:$M$177,10,FALSE))","v":89},360,{"$f":"IF(VLOOKUP($C6,invullijst!$A$11:$M$177,11,FALSE)=\"\",\"\",VLOOKUP($C6,invullijst!$A$11:$M$177,11,FALSE))","v":43}]
[null,3,302,{"$f":"IF(VLOOKUP($C7,invullijst!$A$11:$M$177,4,FALSE)=\"\",\"\",VLOOKUP($C7,invullijst!$A$11:$M$177,4,FALSE))","v":"vr"},{"$f":"IF(VLOOKUP($C7,invullijst!$A$11:$M$177,2,FALSE)=\"\",\"\",VLOOKUP($C7,invullijst!$A$11:$M$177,2,FALSE))","v":"Freek de Jong"},{"$f":"IF(VLOOKUP($C7,invullijst!$A$11:$M$177,3,FALSE)=\"\",\"\",VLOOKUP($C7,invullijst!$A$11:$M$177,3,FALSE))","v":"Elshout"},{"$f":"IF(VLOOKUP(C7,invullijst!$A$11:$M$177,6,FALSE)=\"\",\"\",VLOOKUP(C7,invullijst!$A$11:$M$177,6,FALSE))","v":89},{"$f":"IF(VLOOKUP($C7,invullijst!$A$11:$M$177,7,FALSE)=\"\",\"\",VLOOKUP($C7,invullijst!$A$11:$M$177,7,FALSE))","v":""},{"$f":"IF(VLOOKUP($C7,invullijst!$A$11:$M$177,8,FALSE)=\"\",\"\",VLOOKUP($C7,invullijst!$A$11:$M$177,8,FALSE))","v":90},{"$f":"IF(VLOOKUP($C7,invullijst!$A$11:$M$177,9,FALSE)=\"\",\"\",VLOOKUP($C7,invullijst!$A$11:$M$177,9,FALSE))","v":88},{"$f":"IF(VLOOKUP($C7,invullijst!$A$11:$M$177,10,FALSE)=\"\",\"\",VLOOKUP($C7,invullijst!$A$11:$M$177,10,FALSE))","v":90},357,{"$f":"IF(VLOOKUP($C7,invullijst!$A$11:$M$177,11,FALSE)=\"\",\"\",VLOOKUP($C7,invullijst!$A$11:$M$177,11,FALSE))","v":45}]
[null,4,305,{"$f":"IF(VLOOKUP($C8,invullijst!$A$11:$M$177,4,FALSE)=\"\",\"\",VLOOKUP($C8,invullijst!$A$11:$M$177,4,FALSE))","v":"vr"},{"$f":"IF(VLOOKUP($C8,invullijst!$A$11:$M$177,2,FALSE)=\"\",\"\",VLOOKUP($C8,invullijst!$A$11:$M$177,2,FALSE))","v":"Johan Klerx"},{"$f":"IF(VLOOKUP($C8,invullijst!$A$11:$M$177,3,FALSE)=\"\",\"\",VLOOKUP($C8,invullijst!$A$11:$M$177,3,FALSE))","v":"Elshout"},{"$f":"IF(VLOOKUP(C8,invullijst!$A$11:$M$177,6,FALSE)=\"\",\"\",VLOOKUP(C8,invullijst!$A$11:$M$177,6,FALSE))","v":84},{"$f":"IF(VLOOKUP($C8,invullijst!$A$11:$M$177,7,FALSE)=\"\",\"\",VLOOKUP($C8,invullijst!$A$11:$M$177,7,FALSE))","v":""},{"$f":"IF(VLOOKUP($C8,invullijst!$A$11:$M$177,8,FALSE)=\"\",\"\",VLOOKUP($C8,invullijst!$A$11:$M$177,8,FALSE))","v":89},{"$f":"IF(VLOOKUP($C8,invullijst!$A$11:$M$177,9,FALSE)=\"\",\"\",VLOOKUP($C8,invullijst!$A$11:$M$177,9,FALSE))","v":84},{"$f":"IF(VLOOKUP($C8,invullijst!$A$11:$M$177,10,FALSE)=\"\",\"\",VLOOKUP($C8,invullijst!$A$11:$M$177,10,FALSE))","v":82},339,{"$f":"IF(VLOOKUP($C8,invullijst!$A$11:$M$177,11,FALSE)=\"\",\"\",VLOOKUP($C8,invullijst!$A$11:$M$177,11,FALSE))","v":43}]
[null,5,106,{"$f":"IF(VLOOKUP($C9,invullijst!$A$11:$M$177,4,FALSE)=\"\",\"\",VLOOKUP($C9,invullijst!$A$11:$M$177,4,FALSE))","v":"vr"},{"$f":"IF(VLOOKUP($C9,invullijst!$A$11:$M$177,2,FALSE)=\"\",\"\",VLOOKUP($C9,invullijst!$A$11:$M$177,2,FALSE))","v":"René Pullens"},{"$f":"IF(VLOOKUP($C9,invullijst!$A$11:$M$177,3,FALSE)=\"\",\"\",VLOOKUP($C9,invullijst!$A$11:$M$177,3,FALSE))","v":"Baardwijk"},{"$f":"IF(VLOOKUP(C9,invullijst!$A$11:$M$177,6,FALSE)=\"\",\"\",VLOOKUP(C9,invullijst!$A$11:$M$177,6,FALSE))","v":""},{"$f":"IF(VLOOKUP($C9,invullijst!$A$11:$M$177,7,FALSE)=\"\",\"\",VLOOKUP($C9,invullijst!$A$11:$M$177,7,FALSE))","v":84},{"$f":"IF(VLOOKUP($C9,invullijst!$A$11:$M$177,8,FALSE)=\"\",\"\",VLOOKUP($C9,invullijst!$A$11:$M$177,8,FALSE))","v":84},{"$f":"IF(VLOOKUP($C9,invullijst!$A$11:$M$177,9,FALSE)=\"\",\"\",VLOOKUP($C9,invullijst!$A$11:$M$177,9,FALSE))","v":79},{"$f":"IF(VLOOKUP($C9,invullijst!$A$11:$M$177,10,FALSE)=\"\",\"\",VLOOKUP($C9,invullijst!$A$11:$M$177,10,FALSE))","v":88},335,{"$f":"IF(VLOOKUP($C9,invullijst!$A$11:$M$177,11,FALSE)=\"\",\"\",VLOOKUP($C9,invullijst!$A$11:$M$177,11,FALSE))","v":44}]
[null,6,410,{"$f":"IF(VLOOKUP($C10,invullijst!$A$11:$M$177,4,FALSE)=\"\",\"\",VLOOKUP($C10,invullijst!$A$11:$M$177,4,FALSE))","v":"vr"},{"$f":"IF(VLOOKUP($C10,invullijst!$A$11:$M$177,2,FALSE)=\"\",\"\",VLOOKUP($C10,invullijst!$A$11:$M$177,2,FALSE))","v":"Tonnie Koks"},{"$f":"IF(VLOOKUP($C10,invullijst!$A$11:$M$177,3,FALSE)=\"\",\"\",VLOOKUP($C10,invullijst!$A$11:$M$177,3,FALSE))","v":"Haarsteeg"},{"$f":"IF(VLOOKUP(C10,invullijst!$A$11:$M$177,6,FALSE)=\"\",\"\",VLOOKUP(C10,invullijst!$A$11:$M$177,6,FALSE))","v":85},{"$f":"IF(VLOOKUP($C10,invullijst!$A$11:$M$177,7,FALSE)=\"\",\"\",VLOOKUP($C10,invullijst!$A$11:$M$177,7,FALSE))","v":84},{"$f":"IF(VLOOKUP($C10,invullijst!$A$11:$M$177,8,FALSE)=\"\",\"\",VLOOKUP($C10,invullijst!$A$11:$M$177,8,FALSE))","v":""},{"$f":"IF(VLOOKUP($C10,invullijst!$A$11:$M$177,9,FALSE)=\"\",\"\",VLOOKUP($C10,invullijst!$A$11:$M$177,9,FALSE))","v":82},{"$f":"IF(VLOOKUP($C10,invullijst!$A$11:$M$177,10,FALSE)=\"\",\"\",VLOOKUP($C10,invullijst!$A$11:$M$177,10,FALSE))","v":84},335,{"$f":"IF(VLOOKUP($C10,invullijst!$A$11:$M$177,11,FALSE)=\"\",\"\",VLOOKUP($C10,invullijst!$A$11:$M$177,11,FALSE))","v":43}]
[null,7,501,{"$f":"IF(VLOOKUP($C11,invullijst!$A$11:$M$177,4,FALSE)=\"\",\"\",VLOOKUP($C11,invullijst!$A$11:$M$177,4,FALSE))","v":"vr"},{"$f":"IF(VLOOKUP($C11,invullijst!$A$11:$M$177,2,FALSE)=\"\",\"\",VLOOKUP($C11,invullijst!$A$11:$M$177,2,FALSE))","v":"Annette Vos"},{"$f":"IF(VLOOKUP($C11,invullijst!$A$11:$M$177,3,FALSE)=\"\",\"\",VLOOKUP($C11,invullijst!$A$11:$M$177,3,FALSE))","v":"Kaatsheuvel"},{"$f":"IF(VLOOKUP(C11,invullijst!$A$11:$M$177,6,FALSE)=\"\",\"\",VLOOKUP(C11,invullijst!$A$11:$M$177,6,FALSE))","v":80},{"$f":"IF(VLOOKUP($C11,invullijst!$A$11:$M$177,7,FALSE)=\"\",\"\",VLOOKUP($C11,invullijst!$A$11:$M$177,7,FALSE))","v":89},{"$f":"IF(VLOOKUP($C11,invullijst!$A$11:$M$177,8,FALSE)=\"\",\"\",VLOOKUP($C11,invullijst!$A$11:$M$177,8,FALSE))","v":83},{"$f":"IF(VLOOKUP($C11,invullijst!$A$11:$M$177,9,FALSE)=\"\",\"\",VLOOKUP($C11,invullijst!$A$11:$M$177,9,FALSE))","v":""},{"$f":"IF(VLOOKUP($C11,invullijst!$A$11:$M$177,10,FALSE)=\"\",\"\",VLOOKUP($C11,invullijst!$A$11:$M$177,10,FALSE))","v":83},335,{"$f":"IF(VLOOKUP($C11,invullijst!$A$11:$M$177,11,FALSE)=\"\",\"\",VLOOKUP($C11,invullijst!$A$11:$M$177,11,FALSE))","v":40}]
[null,8,405,{"$f":"IF(VLOOKUP($C12,invullijst!$A$11:$M$177,4,FALSE)=\"\",\"\",VLOOKUP($C12,invullijst!$A$11:$M$177,4,FALSE))","v":"vr"},{"$f":"IF(VLOOKUP($C12,invullijst!$A$11:$M$177,2,FALSE)=\"\",\"\",VLOOKUP($C12,invullijst!$A$11:$M$177,2,FALSE))","v":"Jan de Vaan"},{"$f":"IF(VLOOKUP($C12,invullijst!$A$11:$M$177,3,FALSE)=\"\",\"\",VLOOKUP($C12,invullijst!$A$11:$M$177,3,FALSE))","v":"Haarsteeg"},{"$f":"IF(VLOOKUP(C12,invullijst!$A$11:$M$177,6,FALSE)=\"\",\"\",VLOOKUP(C12,invullijst!$A$11:$M$177,6,FALSE))","v":86},{"$f":"IF(VLOOKUP($C12,invullijst!$A$11:$M$177,7,FALSE)=\"\",\"\",VLOOKUP($C12,invullijst!$A$11:$M$177,7,FALSE))","v":85},{"$f":"IF(VLOOKUP($C12,invullijst!$A$11:$M$177,8,FALSE)=\"\",\"\",VLOOKUP($C12,invullijst!$A$11:$M$177,8,FALSE))","v":""},{"$f":"IF(VLOOKUP($C12,invullijst!$A$11:$M$177,9,FALSE)=\"\",\"\",VLOOKUP($C12,invullijst!$A$11:$M$177,9,FALSE))","v":81},{"$f":"IF(VLOOKUP($C12,invullijst!$A$11:$M$177,10,FALSE)=\"\",\"\",VLOOKUP($C12,invullijst!$A$11:$M$177,10,FALSE))","v":83},335,{"$f":"IF(VLOOKUP($C12,invullijst!$A$11:$M$177,11,FALSE)=\"\",\"\",VLOOKUP($C12,invullijst!$A$11:$M$177,11,FALSE))","v":38}]
[null,9,206,{"$f":"IF(VLOOKUP($C13,invullijst!$A$11:$M$177,4,FALSE)=\"\",\"\",VLOOKUP($C13,invullijst!$A$11:$M$177,4,FALSE))","v":"vr"},{"$f":"IF(VLOOKUP($C13,invullijst!$A$11:$M$177,2,FALSE)=\"\",\"\",VLOOKUP($C13,invullijst!$A$11:$M$177,2,FALSE))","v":"Kees van Hulten"},{"$f":"IF(VLOOKUP($C13,invullijst!$A$11:$M$177,3,FALSE)=\"\",\"\",VLOOKUP($C13,invullijst!$A$11:$M$177,3,FALSE))","v":"Besoijen"},{"$f":"IF(VLOOKUP(C13,invullijst!$A$11:$M$177,6,FALSE)=\"\",\"\",VLOOKUP(C13,invullijst!$A$11:$M$177,6,FALSE))","v":86},{"$f":"IF(VLOOKUP($C13,invullijst!$A$11:$M$177,7,FALSE)=\"\",\"\",VLOOKUP($C13,invullijst!$A$11:$M$177,7,FALSE))","v":85},{"$f":"IF(VLOOKUP($C13,invullijst!$A$11:$M$177,8,FALSE)=\"\",\"\",VLOOKUP($C13,invullijst!$A$11:$M$177,8,FALSE))","v":78},{"$f":"IF(VLOOKUP($C13,invullijst!$A$11:$M$177,9,FALSE)=\"\",\"\",VLOOKUP($C13,invullijst!$A$11:$M$177,9,FALSE))","v":85},{"$f":"IF(VLOOKUP($C13,invullijst!$A$11:$M$177,10,FALSE)=\"\",\"\",VLOOKUP($C13,invullijst!$A$11:$M$177,10,FALSE))","v":""},334,{"$f":"IF(VLOOKUP($C13,invullijst!$A$11:$M$177,11,FALSE)=\"\",\"\",VLOOKUP($C13,invullijst!$A$11:$M$177,11,FALSE))","v":38}]
[null,10,105,{"$f":"IF(VLOOKUP($C14,invullijst!$A$11:$M$177,4,FALSE)=\"\",\"\",VLOOKUP($C14,invullijst!$A$11:$M$177,4,FALSE))","v":"vr"},{"$f":"IF(VLOOKUP($C14,invullijst!$A$11:$M$177,2,FALSE)=\"\",\"\",VLOOKUP($C14,invullijst!$A$11:$M$177,2,FALSE))","v":"René Klijn"},{"$f":"IF(VLOOKUP($C14,invullijst!$A$11:$M$177,3,FALSE)=\"\",\"\",VLOOKUP($C14,invullijst!$A$11:$M$177,3,FALSE))","v":"Baardwijk"},{"$f":"IF(VLOOKUP(C14,invullijst!$A$11:$M$177,6,FALSE)=\"\",\"\",VLOOKUP(C14,invullijst!$A$11:$M$177,6,FALSE))","v":""},{"$f":"IF(VLOOKUP($C14,invullijst!$A$11:$M$177,7,FALSE)=\"\",\"\",VLOOKUP($C14,invullijst!$A$11:$M$177,7,FALSE))","v":83},{"$f":"IF(VLOOKUP($C14,invullijst!$A$11:$M$177,8,FALSE)=\"\",\"\",VLOOKUP($C14,invullijst!$A$11:$M$177,8,FALSE))","v":81},{"$f":"IF(VLOOKUP($C14,invullijst!$A$11:$M$177,9,FALSE)=\"\",\"\",VLOOKUP($C14,invullijst!$A$11:$M$177,9,FALSE))","v":83},{"$f":"IF(VLOOKUP($C14,invullijst!$A$11:$M$177,10,FALSE)=\"\",\"\",VLOOKUP($C14,invullijst!$A$11:$M$177,10,FALSE))","v":84},331,{"$f":"IF(VLOOKUP($C14,invullijst!$A$11:$M$177,11,FALSE)=\"\",\"\",VLOOKUP($C14,invullijst!$A$11:$M$177,11,FALSE))","v":42}]
[null,11,408,{"$f":"IF(VLOOKUP($C15,invullijst!$A$11:$M$177,4,FALSE)=\"\",\"\",VLOOKUP($C15,invullijst!$A$11:$M$177,4,FALSE))","v":"vr"},{"$f":"IF(VLOOKUP($C15,invullijst!$A$11:$M$177,2,FALSE)=\"\",\"\",VLOOKUP($C15,invullijst!$A$11:$M$177,2,FALSE))","v":"Rudy van Falier"},{"$f":"IF(VLOOKUP($C15,invullijst!$A$11:$M$177,3,FALSE)=\"\",\"\",VLOOKUP($C15,invullijst!$A$11:$M$177,3,FALSE))","v":"Haarsteeg"},{"$f":"IF(VLOOKUP(C15,invullijst!$A$11:$M$177,6,FALSE)=\"\",\"\",VLOOKUP(C15,invullijst!$A$11:$M$177,6,FALSE))","v":86},{"$f":"IF(VLOOKUP($C15,invullijst!$A$11:$M$177,7,FALSE)=\"\",\"\",VLOOKUP($C15,invullijst!$A$11:$M$177,7,FALSE))","v":79},{"$f":"IF(VLOOKUP($C15,invullijst!$A$11:$M$177,8,FALSE)=\"\",\"\",VLOOKUP($C15,invullijst!$A$11:$M$177,8,FALSE))","v":""},{"$f":"IF(VLOOKUP($C15,invullijst!$A$11:$M$177,9,FALSE)=\"\",\"\",VLOOKUP($C15,invullijst!$A$11:$M$177,9,FALSE))","v":80},{"$f":"IF(VLOOKUP($C15,invullijst!$A$11:$M$177,10,FALSE)=\"\",\"\",VLOOKUP($C15,invullijst!$A$11:$M$177,10,FALSE))","v":85},330,{"$f":"IF(VLOOKUP($C15,invullijst!$A$11:$M$177,11,FALSE)=\"\",\"\",VLOOKUP($C15,invullijst!$A$11:$M$177,11,FALSE))","v":43}]
[null,12,406,{"$f":"IF(VLOOKUP($C16,invullijst!$A$11:$M$177,4,FALSE)=\"\",\"\",VLOOKUP($C16,invullijst!$A$11:$M$177,4,FALSE))","v":"vr"},{"$f":"IF(VLOOKUP($C16,invullijst!$A$11:$M$177,2,FALSE)=\"\",\"\",VLOOKUP($C16,invullijst!$A$11:$M$177,2,FALSE))","v":"Jeroen van Oss"},{"$f":"IF(VLOOKUP($C16,invullijst!$A$11:$M$177,3,FALSE)=\"\",\"\",VLOOKUP($C16,invullijst!$A$11:$M$177,3,FALSE))","v":"Haarsteeg"},{"$f":"IF(VLOOKUP(C16,invullijst!$A$11:$M$177,6,FALSE)=\"\",\"\",VLOOKUP(C16,invullijst!$A$11:$M$177,6,FALSE))","v":82},{"$f":"IF(VLOOKUP($C16,invullijst!$A$11:$M$177,7,FALSE)=\"\",\"\",VLOOKUP($C16,invullijst!$A$11:$M$177,7,FALSE))","v":82},{"$f":"IF(VLOOKUP($C16,invullijst!$A$11:$M$177,8,FALSE)=\"\",\"\",VLOOKUP($C16,invullijst!$A$11:$M$177,8,FALSE))","v":""},{"$f":"IF(VLOOKUP($C16,invullijst!$A$11:$M$177,9,FALSE)=\"\",\"\",VLOOKUP($C16,invullijst!$A$11:$M$177,9,FALSE))","v":83},{"$f":"IF(VLOOKUP($C16,invullijst!$A$11:$M$177,10,FALSE)=\"\",\"\",VLOOKUP($C16,invullijst!$A$11:$M$177,10,FALSE))","v":83},330,{"$f":"IF(VLOOKUP($C16,invullijst!$A$11:$M$177,11,FALSE)=\"\",\"\",VLOOKUP($C16,invullijst!$A$11:$M$177,11,FALSE))","v":40}]
[null,13,407,{"$f":"IF(VLOOKUP($C17,invullijst!$A$11:$M$177,4,FALSE)=\"\",\"\",VLOOKUP($C17,invullijst!$A$11:$M$177,4,FALSE))","v":"vr"},{"$f":"IF(VLOOKUP($C17,invullijst!$A$11:$M$177,2,FALSE)=\"\",\"\",VLOOKUP($C17,invullijst!$A$11:$M$177,2,FALSE))","v":"Justin van Son"},{"$f":"IF(VLOOKUP($C17,invullijst!$A$11:$M$177,3,FALSE)=\"\",\"\",VLOOKUP($C17,invullijst!$A$11:$M$177,3,FALSE))","v":"Haarsteeg"},{"$f":"IF(VLOOKUP(C17,invullijst!$A$11:$M$177,6,FALSE)=\"\",\"\",VLOOKUP(C17,invullijst!$A$11:$M$177,6,FALSE))","v":84},{"$f":"IF(VLOOKUP($C17,invullijst!$A$11:$M$177,7,FALSE)=\"\",\"\",VLOOKUP($C17,invullijst!$A$11:$M$177,7,FALSE))","v":85},{"$f":"IF(VLOOKUP($C17,invullijst!$A$11:$M$177,8,FALSE)=\"\",\"\",VLOOKUP($C17,invullijst!$A$11:$M$177,8,FALSE))","v":""},{"$f":"IF(VLOOKUP($C17,invullijst!$A$11:$M$177,9,FALSE)=\"\",\"\",VLOOKUP($C17,invullijst!$A$11:$M$177,9,FALSE))","v":79},{"$f":"IF(VLOOKUP($C17,invullijst!$A$11:$M$177,10,FALSE)=\"\",\"\",VLOOKUP($C17,invullijst!$A$11:$M$177,10,FALSE))","v":80},328,{"$f":"IF(VLOOKUP($C17,invullijst!$A$11:$M$177,11,FALSE)=\"\",\"\",VLOOKUP($C17,invullijst!$A$11:$M$177,11,FALSE))","v":39}]
[null,14,203,{"$f":"IF(VLOOKUP($C18,invullijst!$A$11:$M$177,4,FALSE)=\"\",\"\",VLOOKUP($C18,invullijst!$A$11:$M$177,4,FALSE))","v":"vr"},{"$f":"IF(VLOOKUP($C18,invullijst!$A$11:$M$177,2,FALSE)=\"\",\"\",VLOOKUP($C18,invullijst!$A$11:$M$177,2,FALSE))","v":"Frank van den Houdt"},{"$f":"IF(VLOOKUP($C18,invullijst!$A$11:$M$177,3,FALSE)=\"\",\"\",VLOOKUP($C18,invullijst!$A$11:$M$177,3,FALSE))","v":"Besoijen"},{"$f":"IF(VLOOKUP(C18,invullijst!$A$11:$M$177,6,FALSE)=\"\",\"\",VLOOKUP(C18,invullijst!$A$11:$M$177,6,FALSE))","v":80},{"$f":"IF(VLOOKUP($C18,invullijst!$A$11:$M$177,7,FALSE)=\"\",\"\",VLOOKUP($C18,invullijst!$A$11:$M$177,7,FALSE))","v":82},{"$f":"IF(VLOOKUP($C18,invullijst!$A$11:$M$177,8,FALSE)=\"\",\"\",VLOOKUP($C18,invullijst!$A$11:$M$177,8,FALSE))","v":81},{"$f":"IF(VLOOKUP($C18,invullijst!$A$11:$M$177,9,FALSE)=\"\",\"\",VLOOKUP($C18,invullijst!$A$11:$M$177,9,FALSE))","v":85},{"$f":"IF(VLOOKUP($C18,invullijst!$A$11:$M$177,10,FALSE)=\"\",\"\",VLOOKUP($C18,invullijst!$A$11:$M$177,10,FALSE))","v":""},328,{"$f":"IF(VLOOKUP($C18,invullijst!$A$11:$M$177,11,FALSE)=\"\",\"\",VLOOKUP($C18,invullijst!$A$11:$M$177,11,FALSE))","v":36}]
[null,15,204,{"$f":"IF(VLOOKUP($C19,invullijst!$A$11:$M$177,4,FALSE)=\"\",\"\",VLOOKUP($C19,invullijst!$A$11:$M$177,4,FALSE))","v":"vr"},{"$f":"IF(VLOOKUP($C19,invullijst!$A$11:$M$177,2,FALSE)=\"\",\"\",VLOOKUP($C19,invullijst!$A$11:$M$177,2,FALSE))","v":"Harry de Louw"},{"$f":"IF(VLOOKUP($C19,invullijst!$A$11:$M$177,3,FALSE)=\"\",\"\",VLOOKUP($C19,invullijst!$A$11:$M$177,3,FALSE))","v":"Besoijen"},{"$f":"IF(VLOOKUP(C19,invullijst!$A$11:$M$177,6,FALSE)=\"\",\"\",VLOOKUP(C19,invullijst!$A$11:$M$177,6,FALSE))","v":80},{"$f":"IF(VLOOKUP($C19,invullijst!$A$11:$M$177,7,FALSE)=\"\",\"\",VLOOKUP($C19,invullijst!$A$11:$M$177,7,FALSE))","v":81},{"$f":"IF(VLOOKUP($C19,invullijst!$A$11:$M$177,8,FALSE)=\"\",\"\",VLOOKUP($C19,invullijst!$A$11:$M$177,8,FALSE))","v":85},{"$f":"IF(VLOOKUP($C19,invullijst!$A$11:$M$177,9,FALSE)=\"\",\"\",VLOOKUP($C19,invullijst!$A$11:$M$177,9,FALSE))","v":80},{"$f":"IF(VLOOKUP($C19,invullijst!$A$11:$M$177,10,FALSE)=\"\",\"\",VLOOKUP($C19,invullijst!$A$11:$M$177,10,FALSE))","v":""},326,{"$f":"IF(VLOOKUP($C19,invullijst!$A$11:$M$177,11,FALSE)=\"\",\"\",VLOOKUP($C19,invullijst!$A$11:$M$177,11,FALSE))","v":35}]
[null,16,209,{"$f":"IF(VLOOKUP($C20,invullijst!$A$11:$M$177,4,FALSE)=\"\",\"\",VLOOKUP($C20,invullijst!$A$11:$M$177,4,FALSE))","v":"vr"},{"$f":"IF(VLOOKUP($C20,invullijst!$A$11:$M$177,2,FALSE)=\"\",\"\",VLOOKUP($C20,invullijst!$A$11:$M$177,2,FALSE))","v":"René van Kuijk"},{"$f":"IF(VLOOKUP($C20,invullijst!$A$11:$M$177,3,FALSE)=\"\",\"\",VLOOKUP($C20,invullijst!$A$11:$M$177,3,FALSE))","v":"Besoijen"},{"$f":"IF(VLOOKUP(C20,invullijst!$A$11:$M$177,6,FALSE)=\"\",\"\",VLOOKUP(C20,invullijst!$A$11:$M$177,6,FALSE))","v":76},{"$f":"IF(VLOOKUP($C20,invullijst!$A$11:$M$177,7,FALSE)=\"\",\"\",VLOOKUP($C20,invullijst!$A$11:$M$177,7,FALSE))","v":80},{"$f":"IF(VLOOKUP($C20,invullijst!$A$11:$M$177,8,FALSE)=\"\",\"\",VLOOKUP($C20,invullijst!$A$11:$M$177,8,FALSE))","v":87},{"$f":"IF(VLOOKUP($C20,invullijst!$A$11:$M$177,9,FALSE)=\"\",\"\",VLOOKUP($C20,invullijst!$A$11:$M$177,9,FALSE))","v":82},{"$f":"IF(VLOOKUP($C20,invullijst!$A$11:$M$177,10,FALSE)=\"\",\"\",VLOOKUP($C20,invullijst!$A$11:$M$177,10,FALSE))","v":""},325,{"$f":"IF(VLOOKUP($C20,invullijst!$A$11:$M$177,11,FALSE)=\"\",\"\",VLOOKUP($C20,invullijst!$A$11:$M$177,11,FALSE))","v":42}]
[null,17,205,{"$f":"IF(VLOOKUP($C21,invullijst!$A$11:$M$177,4,FALSE)=\"\",\"\",VLOOKUP($C21,invullijst!$A$11:$M$177,4,FALSE))","v":"vr"},{"$f":"IF(VLOOKUP($C21,invullijst!$A$11:$M$177,2,FALSE)=\"\",\"\",VLOOKUP($C21,invullijst!$A$11:$M$177,2,FALSE))","v":"Jos v/d Snepscheut"},{"$f":"IF(VLOOKUP($C21,invullijst!$A$11:$M$177,3,FALSE)=\"\",\"\",VLOOKUP($C21,invullijst!$A$11:$M$177,3,FALSE))","v":"Besoijen"},{"$f":"IF(VLOOKUP(C21,invullijst!$A$11:$M$177,6,FALSE)=\"\",\"\",VLOOKUP(C21,invullijst!$A$11:$M$177,6,FALSE))","v":79},{"$f":"IF(VLOOKUP($C21,invullijst!$A$11:$M$177,7,FALSE)=\"\",\"\",VLOOKUP($C21,invullijst!$A$11:$M$177,7,FALSE))","v":83},{"$f":"IF(VLOOKUP($C21,invullijst!$A$11:$M$177,8,FALSE)=\"\",\"\",VLOOKUP($C21,invullijst!$A$11:$M$177,8,FALSE))","v":79},{"$f":"IF(VLOOKUP($C21,invullijst!$A$11:$M$177,9,FALSE)=\"\",\"\",VLOOKUP($C21,invullijst!$A$11:$M$177,9,FALSE))","v":82},{"$f":"IF(VLOOKUP($C21,invullijst!$A$11:$M$177,10,FALSE)=\"\",\"\",VLOOKUP($C21,invullijst!$A$11:$M$177,10,FALSE))","v":""},323,{"$f":"IF(VLOOKUP($C21,invullijst!$A$11:$M$177,11,FALSE)=\"\",\"\",VLOOKUP($C21,invullijst!$A$11:$M$177,11,FALSE))","v":40}]
[null,18,508,{"$f":"IF(VLOOKUP($C22,invullijst!$A$11:$M$177,4,FALSE)=\"\",\"\",VLOOKUP($C22,invullijst!$A$11:$M$177,4,FALSE))","v":"vr"},{"$f":"IF(VLOOKUP($C22,invullijst!$A$11:$M$177,2,FALSE)=\"\",\"\",VLOOKUP($C22,invullijst!$A$11:$M$177,2,FALSE))","v":"Rowan Dobbelsteen"},{"$f":"IF(VLOOKUP($C22,invullijst!$A$11:$M$177,3,FALSE)=\"\",\"\",VLOOKUP($C22,invullijst!$A$11:$M$177,3,FALSE))","v":"Kaatsheuvel"},{"$f":"IF(VLOOKUP(C22,invullijst!$A$11:$M$177,6,FALSE)=\"\",\"\",VLOOKUP(C22,invullijst!$A$11:$M$177,6,FALSE))","v":80},{"$f":"IF(VLOOKUP($C22,invullijst!$A$11:$M$177,7,FALSE)=\"\",\"\",VLOOKUP($C22,invullijst!$A$11:$M$177,7,FALSE))","v":79},{"$f":"IF(VLOOKUP($C22,invullijst!$A$11:$M$177,8,FALSE)=\"\",\"\",VLOOKUP($C22,invullijst!$A$11:$M$177,8,FALSE))","v":83},{"$f":"IF(VLOOKUP($C22,invullijst!$A$11:$M$177,9,FALSE)=\"\",\"\",VLOOKUP($C22,invullijst!$A$11:$M$177,9,FALSE))","v":""},{"$f":"IF(VLOOKUP($C22,invullijst!$A$11:$M$177,10,FALSE)=\"\",\"\",VLOOKUP($C22,invullijst!$A$11:$M$177,10,FALSE))","v":80},322,{"$f":"IF(VLOOKUP($C22,invullijst!$A$11:$M$177,11,FALSE)=\"\",\"\",VLOOKUP($C22,invullijst!$A$11:$M$177,11,FALSE))","v":39}]
["B",1,215,{"$f":"IF(VLOOKUP($C23,invullijst!$A$11:$M$177,4,FALSE)=\"\",\"\",VLOOKUP($C23,invullijst!$A$11:$M$177,4,FALSE))","v":"vr"},{"$f":"IF(VLOOKUP($C23,invullijst!$A$11:$M$177,2,FALSE)=\"\",\"\",VLOOKUP($C23,invullijst!$A$11:$M$177,2,FALSE))","v":"Pieter Laghuwitz"},{"$f":"IF(VLOOKUP($C23,invullijst!$A$11:$M$177,3,FALSE)=\"\",\"\",VLOOKUP($C23,invullijst!$A$11:$M$177,3,FALSE))","v":"Besoijen"},{"$f":"IF(VLOOKUP(C23,invullijst!$A$11:$M$177,6,FALSE)=\"\",\"\",VLOOKUP(C23,invullijst!$A$11:$M$177,6,FALSE))","v":79},{"$f":"IF(VLOOKUP($C23,invullijst!$A$11:$M$177,7,FALSE)=\"\",\"\",VLOOKUP($C23,invullijst!$A$11:$M$177,7,FALSE))","v":74},{"$f":"IF(VLOOKUP($C23,invullijst!$A$11:$M$177,8,FALSE)=\"\",\"\",VLOOKUP($C23,invullijst!$A$11:$M$177,8,FALSE))","v":86},{"$f":"IF(VLOOKUP($C23,invullijst!$A$11:$M$177,9,FALSE)=\"\",\"\",VLOOKUP($C23,invullijst!$A$11:$M$177,9,FALSE))","v":83},{"$f":"IF(VLOOKUP($C23,invullijst!$A$11:$M$177,10,FALSE)=\"\",\"\",VLOOKUP($C23,invullijst!$A$11:$M$177,10,FALSE))","v":""},322,{"$f":"IF(VLOOKUP($C23,invullijst!$A$11:$M$177,11,FALSE)=\"\",\"\",VLOOKUP($C23,invullijst!$A$11:$M$177,11,FALSE))","v":38}]
[null,2,506,{"$f":"IF(VLOOKUP($C24,invullijst!$A$11:$M$177,4,FALSE)=\"\",\"\",VLOOKUP($C24,invullijst!$A$11:$M$177,4,FALSE))","v":"vr"},{"$f":"IF(VLOOKUP($C24,invullijst!$A$11:$M$177,2,FALSE)=\"\",\"\",VLOOKUP($C24,invullijst!$A$11:$M$177,2,FALSE))","v":"Maikel Monden"},{"$f":"IF(VLOOKUP($C24,invullijst!$A$11:$M$177,3,FALSE)=\"\",\"\",VLOOKUP($C24,invullijst!$A$11:$M$177,3,FALSE))","v":"Kaatsheuvel"},{"$f":"IF(VLOOKUP(C24,invullijst!$A$11:$M$177,6,FALSE)=\"\",\"\",VLOOKUP(C24,invullijst!$A$11:$M$177,6,FALSE))","v":84},{"$f":"IF(VLOOKUP($C24,invullijst!$A$11:$M$177,7,FALSE)=\"\",\"\",VLOOKUP($C24,invullijst!$A$11:$M$177,7,FALSE))","v":85},{"$f":"IF(VLOOKUP($C24,invullijst!$A$11:$M$177,8,FALSE)=\"\",\"\",VLOOKUP($C24,invullijst!$A$11:$M$177,8,FALSE))","v":80},{"$f":"IF(VLOOKUP($C24,invullijst!$A$11:$M$177,9,FALSE)=\"\",\"\",VLOOKUP($C24,invullijst!$A$11:$M$177,9,FALSE))","v":""},{"$f":"IF(VLOOKUP($C24,invullijst!$A$11:$M$177,10,FALSE)=\"\",\"\",VLOOKUP($C24,invullijst!$A$11:$M$177,10,FALSE))","v":71},320,{"$f":"IF(VLOOKUP($C24,invullijst!$A$11:$M$177,11,FALSE)=\"\",\"\",VLOOKUP($C24,invullijst!$A$11:$M$177,11,FALSE))","v":41}]
[null,3,108,{"$f":"IF(VLOOKUP($C25,invullijst!$A$11:$M$177,4,FALSE)=\"\",\"\",VLOOKUP($C25,invullijst!$A$11:$M$177,4,FALSE))","v":"vr"},{"$f":"IF(VLOOKUP($C25,invullijst!$A$11:$M$177,2,FALSE)=\"\",\"\",VLOOKUP($C25,invullijst!$A$11:$M$177,2,FALSE))","v":"Bram Pullens"},{"$f":"IF(VLOOKUP($C25,invullijst!$A$11:$M$177,3,FALSE)=\"\",\"\",VLOOKUP($C25,invullijst!$A$11:$M$177,3,FALSE))","v":"Baardwijk"},{"$f":"IF(VLOOKUP(C25,invullijst!$A$11:$M$177,6,FALSE)=\"\",\"\",VLOOKUP(C25,invullijst!$A$11:$M$177,6,FALSE))","v":""},{"$f":"IF(VLOOKUP($C25,invullijst!$A$11:$M$177,7,FALSE)=\"\",\"\",VLOOKUP($C25,invullijst!$A$11:$M$177,7,FALSE))","v":81},{"$f":"IF(VLOOKUP($C25,invullijst!$A$11:$M$177,8,FALSE)=\"\",\"\",VLOOKUP($C25,invullijst!$A$11:$M$177,8,FALSE))","v":87},{"$f":"IF(VLOOKUP($C25,invullijst!$A$11:$M$177,9,FALSE)=\"\",\"\",VLOOKUP($C25,invullijst!$A$11:$M$177,9,FALSE))","v":76},{"$f":"IF(VLOOKUP($C25,invullijst!$A$11:$M$177,10,FALSE)=\"\",\"\",VLOOKUP($C25,invullijst!$A$11:$M$177,10,FALSE))","v":75},319,{"$f":"IF(VLOOKUP($C25,invullijst!$A$11:$M$177,11,FALSE)=\"\",\"\",VLOOKUP($C25,invullijst!$A$11:$M$177,11,FALSE))","v":34}]
[null,4,208,{"$f":"IF(VLOOKUP($C26,invullijst!$A$11:$M$177,4,FALSE)=\"\",\"\",VLOOKUP($C26,invullijst!$A$11:$M$177,4,FALSE))","v":"vr"},{"$f":"IF(VLOOKUP($C26,invullijst!$A$11:$M$177,2,FALSE)=\"\",\"\",VLOOKUP($C26,invullijst!$A$11:$M$177,2,FALSE))","v":"Erin van Hulten"},{"$f":"IF(VLOOKUP($C26,invullijst!$A$11:$M$177,3,FALSE)=\"\",\"\",VLOOKUP($C26,invullijst!$A$11:$M$177,3,FALSE))","v":"Besoijen"},{"$f":"IF(VLOOKUP(C26,invullijst!$A$11:$M$177,6,FALSE)=\"\",\"\",VLOOKUP(C26,invullijst!$A$11:$M$177,6,FALSE))","v":78},{"$f":"IF(VLOOKUP($C26,invullijst!$A$11:$M$177,7,FALSE)=\"\",\"\",VLOOKUP($C26,invullijst!$A$11:$M$177,7,FALSE))","v":80},{"$f":"IF(VLOOKUP($C26,invullijst!$A$11:$M$177,8,FALSE)=\"\",\"\",VLOOKUP($C26,invullijst!$A$11:$M$177,8,FALSE))","v":79},{"$f":"IF(VLOOKUP($C26,invullijst!$A$11:$M$177,9,FALSE)=\"\",\"\",VLOOKUP($C26,invullijst!$A$11:$M$177,9,FALSE))","v":81},{"$f":"IF(VLOOKUP($C26,invullijst!$A$11:$M$177,10,FALSE)=\"\",\"\",VLOOKUP($C26,invullijst!$A$11:$M$177,10,FALSE))","v":""},318,{"$f":"IF(VLOOKUP($C26,invullijst!$A$11:$M$177,11,FALSE)=\"\",\"\",VLOOKUP($C26,invullijst!$A$11:$M$177,11,FALSE))","v":39}]
[null,5,402,{"$f":"IF(VLOOKUP($C27,invullijst!$A$11:$M$177,4,FALSE)=\"\",\"\",VLOOKUP($C27,invullijst!$A$11:$M$177,4,FALSE))","v":"vr"},{"$f":"IF(VLOOKUP($C27,invullijst!$A$11:$M$177,2,FALSE)=\"\",\"\",VLOOKUP($C27,invullijst!$A$11:$M$177,2,FALSE))","v":"Daniëlle v/d Lee"},{"$f":"IF(VLOOKUP($C27,invullijst!$A$11:$M$177,3,FALSE)=\"\",\"\",VLOOKUP($C27,invullijst!$A$11:$M$177,3,FALSE))","v":"Haarsteeg"},{"$f":"IF(VLOOKUP(C27,invullijst!$A$11:$M$177,6,FALSE)=\"\",\"\",VLOOKUP(C27,invullijst!$A$11:$M$177,6,FALSE))","v":80},{"$f":"IF(VLOOKUP($C27,invullijst!$A$11:$M$177,7,FALSE)=\"\",\"\",VLOOKUP($C27,invullijst!$A$11:$M$177,7,FALSE))","v":79},{"$f":"IF(VLOOKUP($C27,invullijst!$A$11:$M$177,8,FALSE)=\"\",\"\",VLOOKUP($C27,invullijst!$A$11:$M$177,8,FALSE))","v":""},{"$f":"IF(VLOOKUP($C27,invullijst!$A$11:$M$177,9,FALSE)=\"\",\"\",VLOOKUP($C27,invullijst!$A$11:$M$177,9,FALSE))","v":75},{"$f":"IF(VLOOKUP($C27,invullijst!$A$11:$M$177,10,FALSE)=\"\",\"\",VLOOKUP($C27,invullijst!$A$11:$M$177,10,FALSE))","v":83},317,{"$f":"IF(VLOOKUP($C27,invullijst!$A$11:$M$177,11,FALSE)=\"\",\"\",VLOOKUP($C27,invullijst!$A$11:$M$177,11,FALSE))","v":40}]
[null,6,216,{"$f":"IF(VLOOKUP($C28,invullijst!$A$11:$M$177,4,FALSE)=\"\",\"\",VLOOKUP($C28,invullijst!$A$11:$M$177,4,FALSE))","v":"vr"},{"$f":"IF(VLOOKUP($C28,invullijst!$A$11:$M$177,2,FALSE)=\"\",\"\",VLOOKUP($C28,invullijst!$A$11:$M$177,2,FALSE))","v":"Hans Laghuwitz"},{"$f":"IF(VLOOKUP($C28,invullijst!$A$11:$M$177,3,FALSE)=\"\",\"\",VLOOKUP($C28,invullijst!$A$11:$M$177,3,FALSE))","v":"Besoijen"},{"$f":"IF(VLOOKUP(C28,invullijst!$A$11:$M$177,6,FALSE)=\"\",\"\",VLOOKUP(C28,invullijst!$A$11:$M$177,6,FALSE))","v":67},{"$f":"IF(VLOOKUP($C28,invullijst!$A$11:$M$177,7,FALSE)=\"\",\"\",VLOOKUP($C28,invullijst!$A$11:$M$177,7,FALSE))","v":74},{"$f":"IF(VLOOKUP($C28,invullijst!$A$11:$M$177,8,FALSE)=\"\",\"\",VLOOKUP($C28,invullijst!$A$11:$M$177,8,FALSE))","v":82},{"$f":"IF(VLOOKUP($C28,invullijst!$A$11:$M$177,9,FALSE)=\"\",\"\",VLOOKUP($C28,invullijst!$A$11:$M$177,9,FALSE))","v":81},{"$f":"IF(VLOOKUP($C28,invullijst!$A$11:$M$177,10,FALSE)=\"\",\"\",VLOOKUP($C28,invullijst!$A$11:$M$177,10,FALSE))","v":""},304,{"$f":"IF(VLOOKUP($C28,invullijst!$A$11:$M$177,11,FALSE)=\"\",\"\",VLOOKUP($C28,invullijst!$A$11:$M$177,11,FALSE))","v":32}]
[null,7,217,{"$f":"IF(VLOOKUP($C29,invullijst!$A$11:$M$177,4,FALSE)=\"\",\"\",VLOOKUP($C29,invullijst!$A$11:$M$177,4,FALSE))","v":"vr"},{"$f":"IF(VLOOKUP($C29,invullijst!$A$11:$M$177,2,FALSE)=\"\",\"\",VLOOKUP($C29,invullijst!$A$11:$M$177,2,FALSE))","v":"Jānis Jākobsons"},{"$f":"IF(VLOOKUP($C29,invullijst!$A$11:$M$177,3,FALSE)=\"\",\"\",VLOOKUP($C29,invullijst!$A$11:$M$177,3,FALSE))","v":"Besoijen"},{"$f":"IF(VLOOKUP(C29,invullijst!$A$11:$M$177,6,FALSE)=\"\",\"\",VLOOKUP(C29,invullijst!$A$11:$M$177,6,FALSE))","v":65},{"$f":"IF(VLOOKUP($C29,invullijst!$A$11:$M$177,7,FALSE)=\"\",\"\",VLOOKUP($C29,invullijst!$A$11:$M$177,7,FALSE))","v":72},{"$f":"IF(VLOOKUP($C29,invullijst!$A$11:$M$177,8,FALSE)=\"\",\"\",VLOOKUP($C29,invullijst!$A$11:$M$177,8,FALSE))","v":81},{"$f":"IF(VLOOKUP($C29,invullijst!$A$11:$M$177,9,FALSE)=\"\",\"\",VLOOKUP($C29,invullijst!$A$11:$M$177,9,FALSE))","v":79},{"$f":"IF(VLOOKUP($C29,invullijst!$A$11:$M$177,10,FALSE)=\"\",\"\",VLOOKUP($C29,invullijst!$A$11:$M$177,10,FALSE))","v":""},297,{"$f":"IF(VLOOKUP($C29,invullijst!$A$11:$M$177,11,FALSE)=\"\",\"\",VLOOKUP($C29,invullijst!$A$11:$M$177,11,FALSE))","v":40}]
[null,8,512,{"$f":"IF(VLOOKUP($C30,invullijst!$A$11:$M$177,4,FALSE)=\"\",\"\",VLOOKUP($C30,invullijst!$A$11:$M$177,4,FALSE))","v":"vr"},{"$f":"IF(VLOOKUP($C30,invullijst!$A$11:$M$177,2,FALSE)=\"\",\"\",VLOOKUP($C30,invullijst!$A$11:$M$177,2,FALSE))","v":"Hans Bergakker"},{"$f":"IF(VLOOKUP($C30,invullijst!$A$11:$M$177,3,FALSE)=\"\",\"\",VLOOKUP($C30,invullijst!$A$11:$M$177,3,FALSE))","v":"Kaatsheuvel"},{"$f":"IF(VLOOKUP(C30,invullijst!$A$11:$M$177,6,FALSE)=\"\",\"\",VLOOKUP(C30,invullijst!$A$11:$M$177,6,FALSE))","v":81},{"$f":"IF(VLOOKUP($C30,invullijst!$A$11:$M$177,7,FALSE)=\"\",\"\",VLOOKUP($C30,invullijst!$A$11:$M$177,7,FALSE))","v":71},{"$f":"IF(VLOOKUP($C30,invullijst!$A$11:$M$177,8,FALSE)=\"\",\"\",VLOOKUP($C30,invullijst!$A$11:$M$177,8,FALSE))","v":71},{"$f":"IF(VLOOKUP($C30,invullijst!$A$11:$M$177,9,FALSE)=\"\",\"\",VLOOKUP($C30,invullijst!$A$11:$M$177,9,FALSE))","v":""},{"$f":"IF(VLOOKUP($C30,invullijst!$A$11:$M$177,10,FALSE)=\"\",\"\",VLOOKUP($C30,invullijst!$A$11:$M$177,10,FALSE))","v":69},292,{"$f":"IF(VLOOKUP($C30,invullijst!$A$11:$M$177,11,FALSE)=\"\",\"\",VLOOKUP($C30,invullijst!$A$11:$M$177,11,FALSE))","v":38}]
[null,9,507,{"$f":"IF(VLOOKUP($C31,invullijst!$A$11:$M$177,4,FALSE)=\"\",\"\",VLOOKUP($C31,invullijst!$A$11:$M$177,4,FALSE))","v":"vr"},{"$f":"IF(VLOOKUP($C31,invullijst!$A$11:$M$177,2,FALSE)=\"\",\"\",VLOOKUP($C31,invullijst!$A$11:$M$177,2,FALSE))","v":"Michael Blaauwbroek"},{"$f":"IF(VLOOKUP($C31,invullijst!$A$11:$M$177,3,FALSE)=\"\",\"\",VLOOKUP($C31,invullijst!$A$11:$M$177,3,FALSE))","v":"Kaatsheuvel"},{"$f":"IF(VLOOKUP(C31,invullijst!$A$11:$M$177,6,FALSE)=\"\",\"\",VLOOKUP(C31,invullijst!$A$11:$M$177,6,FALSE))","v":70},{"$f":"IF(VLOOKUP($C31,invullijst!$A$11:$M$177,7,FALSE)=\"\",\"\",VLOOKUP($C31,invullijst!$A$11:$M$177,7,FALSE))","v":70},{"$f":"IF(VLOOKUP($C31,invullijst!$A$11:$M$177,8,FALSE)=\"\",\"\",VLOOKUP($C31,invullijst!$A$11:$M$177,8,FALSE))","v":77},{"$f":"IF(VLOOKUP($C31,invullijst!$A$11:$M$177,9,FALSE)=\"\",\"\",VLOOKUP($C31,invullijst!$A$11:$M$177,9,FALSE))","v":""},{"$f":"IF(VLOOKUP($C31,invullijst!$A$11:$M$177,10,FALSE)=\"\",\"\",VLOOKUP($C31,invullijst!$A$11:$M$177,10,FALSE))","v":70},287,{"$f":"IF(VLOOKUP($C31,invullijst!$A$11:$M$177,11,FALSE)=\"\",\"\",VLOOKUP($C31,invullijst!$A$11:$M$177,11,FALSE))","v":42}]
[null,10,304,{"$f":"IF(VLOOKUP($C32,invullijst!$A$11:$M$177,4,FALSE)=\"\",\"\",VLOOKUP($C32,invullijst!$A$11:$M$177,4,FALSE))","v":"vr"},{"$f":"IF(VLOOKUP($C32,invullijst!$A$11:$M$177,2,FALSE)=\"\",\"\",VLOOKUP($C32,invullijst!$A$11:$M$177,2,FALSE))","v":"Henk Bruurmijn "},{"$f":"IF(VLOOKUP($C32,invullijst!$A$11:$M$177,3,FALSE)=\"\",\"\",VLOOKUP($C32,invullijst!$A$11:$M$177,3,FALSE))","v":"Elshout"},{"$f":"IF(VLOOKUP(C32,invullijst!$A$11:$M$177,6,FALSE)=\"\",\"\",VLOOKUP(C32,invullijst!$A$11:$M$177,6,FALSE))","v":71},{"$f":"IF(VLOOKUP($C32,invullijst!$A$11:$M$177,7,FALSE)=\"\",\"\",VLOOKUP($C32,invullijst!$A$11:$M$177,7,FALSE))","v":""},{"$f":"IF(VLOOKUP($C32,invullijst!$A$11:$M$177,8,FALSE)=\"\",\"\",VLOOKUP($C32,invullijst!$A$11:$M$177,8,FALSE))","v":78},{"$f":"IF(VLOOKUP($C32,invullijst!$A$11:$M$177,9,FALSE)=\"\",\"\",VLOOKUP($C32,invullijst!$A$11:$M$177,9,FALSE))","v":68},{"$f":"IF(VLOOKUP($C32,invullijst!$A$11:$M$177,10,FALSE)=\"\",\"\",VLOOKUP($C32,invullijst!$A$11:$M$177,10,FALSE))","v":68},285,{"$f":"IF(VLOOKUP($C32,invullijst!$A$11:$M$177,11,FALSE)=\"\",\"\",VLOOKUP($C32,invullijst!$A$11:$M$177,11,FALSE))","v":40}]
[null,11,502,{"$f":"IF(VLOOKUP($C33,invullijst!$A$11:$M$177,4,FALSE)=\"\",\"\",VLOOKUP($C33,invullijst!$A$11:$M$177,4,FALSE))","v":"vr"},{"$f":"IF(VLOOKUP($C33,invullijst!$A$11:$M$177,2,FALSE)=\"\",\"\",VLOOKUP($C33,invullijst!$A$11:$M$177,2,FALSE))","v":"Diny Vos"},{"$f":"IF(VLOOKUP($C33,invullijst!$A$11:$M$177,3,FALSE)=\"\",\"\",VLOOKUP($C33,invullijst!$A$11:$M$177,3,FALSE))","v":"Kaatsheuvel"},{"$f":"IF(VLOOKUP(C33,invullijst!$A$11:$M$177,6,FALSE)=\"\",\"\",VLOOKUP(C33,invullijst!$A$11:$M$177,6,FALSE))","v":67},{"$f":"IF(VLOOKUP($C33,invullijst!$A$11:$M$177,7,FALSE)=\"\",\"\",VLOOKUP($C33,invullijst!$A$11:$M$177,7,FALSE))","v":66},{"$f":"IF(VLOOKUP($C33,invullijst!$A$11:$M$177,8,FALSE)=\"\",\"\",VLOOKUP($C33,invullijst!$A$11:$M$177,8,FALSE))","v":81},{"$f":"IF(VLOOKUP($C33,invullijst!$A$11:$M$177,9,FALSE)=\"\",\"\",VLOOKUP($C33,invullijst!$A$11:$M$177,9,FALSE))","v":""},{"$f":"IF(VLOOKUP($C33,invullijst!$A$11:$M$177,10,FALSE)=\"\",\"\",VLOOKUP($C33,invullijst!$A$11:$M$177,10,FALSE))","v":71},285,{"$f":"IF(VLOOKUP($C33,invullijst!$A$11:$M$177,11,FALSE)=\"\",\"\",VLOOKUP($C33,invullijst!$A$11:$M$177,11,FALSE))","v":34}]
[null,12,213,{"$f":"IF(VLOOKUP($C34,invullijst!$A$11:$M$177,4,FALSE)=\"\",\"\",VLOOKUP($C34,invullijst!$A$11:$M$177,4,FALSE))","v":"vr"},{"$f":"IF(VLOOKUP($C34,invullijst!$A$11:$M$177,2,FALSE)=\"\",\"\",VLOOKUP($C34,invullijst!$A$11:$M$177,2,FALSE))","v":"Roland van Delft"},{"$f":"IF(VLOOKUP($C34,invullijst!$A$11:$M$177,3,FALSE)=\"\",\"\",VLOOKUP($C34,invullijst!$A$11:$M$177,3,FALSE))","v":"Besoijen"},{"$f":"IF(VLOOKUP(C34,invullijst!$A$11:$M$177,6,FALSE)=\"\",\"\",VLOOKUP(C34,invullijst!$A$11:$M$177,6,FALSE))","v":69},{"$f":"IF(VLOOKUP($C34,invullijst!$A$11:$M$177,7,FALSE)=\"\",\"\",VLOOKUP($C34,invullijst!$A$11:$M$177,7,FALSE))","v":59},{"$f":"IF(VLOOKUP($C34,invullijst!$A$11:$M$177,8,FALSE)=\"\",\"\",VLOOKUP($C34,invullijst!$A$11:$M$177,8,FALSE))","v":77},{"$f":"IF(VLOOKUP($C34,invullijst!$A$11:$M$177,9,FALSE)=\"\",\"\",VLOOKUP($C34,invullijst!$A$11:$M$177,9,FALSE))","v":77},{"$f":"IF(VLOOKUP($C34,invullijst!$A$11:$M$177,10,FALSE)=\"\",\"\",VLOOKUP($C34,invullijst!$A$11:$M$177,10,FALSE))","v":""},282,{"$f":"IF(VLOOKUP($C34,invullijst!$A$11:$M$177,11,FALSE)=\"\",\"\",VLOOKUP($C34,invullijst!$A$11:$M$177,11,FALSE))","v":35}]
[null,13,210,{"$f":"IF(VLOOKUP($C35,invullijst!$A$11:$M$177,4,FALSE)=\"\",\"\",VLOOKUP($C35,invullijst!$A$11:$M$177,4,FALSE))","v":"vr"},{"$f":"IF(VLOOKUP($C35,invullijst!$A$11:$M$177,2,FALSE)=\"\",\"\",VLOOKUP($C35,invullijst!$A$11:$M$177,2,FALSE))","v":"Nick de Vaan"},{"$f":"IF(VLOOKUP($C35,invullijst!$A$11:$M$177,3,FALSE)=\"\",\"\",VLOOKUP($C35,invullijst!$A$11:$M$177,3,FALSE))","v":"Besoijen"},{"$f":"IF(VLOOKUP(C35,invullijst!$A$11:$M$177,6,FALSE)=\"\",\"\",VLOOKUP(C35,invullijst!$A$11:$M$177,6,FALSE))","v":68},{"$f":"IF(VLOOKUP($C35,invullijst!$A$11:$M$177,7,FALSE)=\"\",\"\",VLOOKUP($C35,invullijst!$A$11:$M$177,7,FALSE))","v":63},{"$f":"IF(VLOOKUP($C35,invullijst!$A$11:$M$177,8,FALSE)=\"\",\"\",VLOOKUP($C35,invullijst!$A$11:$M$177,8,FALSE))","v":74},{"$f":"IF(VLOOKUP($C35,invullijst!$A$11:$M$177,9,FALSE)=\"\",\"\",VLOOKUP($C35,invullijst!$A$11:$M$177,9,FALSE))","v":75},{"$f":"IF(VLOOKUP($C35,invullijst!$A$11:$M$177,10,FALSE)=\"\",\"\",VLOOKUP($C35,invullijst!$A$11:$M$177,10,FALSE))","v":""},280,{"$f":"IF(VLOOKUP($C35,invullijst!$A$11:$M$177,11,FALSE)=\"\",\"\",VLOOKUP($C35,invullijst!$A$11:$M$177,11,FALSE))","v":37}]
[null,14,102,{"$f":"IF(VLOOKUP($C36,invullijst!$A$11:$M$177,4,FALSE)=\"\",\"\",VLOOKUP($C36,invullijst!$A$11:$M$177,4,FALSE))","v":"vr"},{"$f":"IF(VLOOKUP($C36,invullijst!$A$11:$M$177,2,FALSE)=\"\",\"\",VLOOKUP($C36,invullijst!$A$11:$M$177,2,FALSE))","v":"John de Jong"},{"$f":"IF(VLOOKUP($C36,invullijst!$A$11:$M$177,3,FALSE)=\"\",\"\",VLOOKUP($C36,invullijst!$A$11:$M$177,3,FALSE))","v":"Baardwijk"},{"$f":"IF(VLOOKUP(C36,invullijst!$A$11:$M$177,6,FALSE)=\"\",\"\",VLOOKUP(C36,invullijst!$A$11:$M$177,6,FALSE))","v":""},{"$f":"IF(VLOOKUP($C36,invullijst!$A$11:$M$177,7,FALSE)=\"\",\"\",VLOOKUP($C36,invullijst!$A$11:$M$177,7,FALSE))","v":74},{"$f":"IF(VLOOKUP($C36,invullijst!$A$11:$M$177,8,FALSE)=\"\",\"\",VLOOKUP($C36,invullijst!$A$11:$M$177,8,FALSE))","v":61},{"$f":"IF(VLOOKUP($C36,invullijst!$A$11:$M$177,9,FALSE)=\"\",\"\",VLOOKUP($C36,invullijst!$A$11:$M$177,9,FALSE))","v":65},{"$f":"IF(VLOOKUP($C36,invullijst!$A$11:$M$177,10,FALSE)=\"\",\"\",VLOOKUP($C36,invullijst!$A$11:$M$177,10,FALSE))","v":77},277,{"$f":"IF(VLOOKUP($C36,invullijst!$A$11:$M$177,11,FALSE)=\"\",\"\",VLOOKUP($C36,invullijst!$A$11:$M$177,11,FALSE))","v":37}]
[null,15,202,{"$f":"IF(VLOOKUP($C37,invullijst!$A$11:$M$177,4,FALSE)=\"\",\"\",VLOOKUP($C37,invullijst!$A$11:$M$177,4,FALSE))","v":"vr"},{"$f":"IF(VLOOKUP($C37,invullijst!$A$11:$M$177,2,FALSE)=\"\",\"\",VLOOKUP($C37,invullijst!$A$11:$M$177,2,FALSE))","v":"Arco van Kuijk"},{"$f":"IF(VLOOKUP($C37,invullijst!$A$11:$M$177,3,FALSE)=\"\",\"\",VLOOKUP($C37,invullijst!$A$11:$M$177,3,FALSE))","v":"Besoijen"},{"$f":"IF(VLOOKUP($C37,invullijst!$A$11:$M$177,6,FALSE)=\"\",\"\",VLOOKUP($C37,invullijst!$A$11:$M$177,6,FALSE))","v":74},{"$f":"IF(VLOOKUP($C37,invullijst!$A$11:$M$177,7,FALSE)=\"\",\"\",VLOOKUP($C37,invullijst!$A$11:$M$177,7,FALSE))","v":68},{"$f":"IF(VLOOKUP($C37,invullijst!$A$11:$M$177,8,FALSE)=\"\",\"\",VLOOKUP($C37,invullijst!$A$11:$M$177,8,FALSE))","v":69},{"$f":"IF(VLOOKUP($C37,invullijst!$A$11:$M$177,9,FALSE)=\"\",\"\",VLOOKUP($C37,invullijst!$A$11:$M$177,9,FALSE))","v":60},{"$f":"IF(VLOOKUP($C37,invullijst!$A$11:$M$177,10,FALSE)=\"\",\"\",VLOOKUP($C37,invullijst!$A$11:$M$177,10,FALSE))","v":""},271,{"$f":"IF(VLOOKUP($C37,invullijst!$A$11:$M$177,11,FALSE)=\"\",\"\",VLOOKUP($C37,invullijst!$A$11:$M$177,11,FALSE))","v":37}]
[null,16,513,{"$f":"IF(VLOOKUP($C38,invullijst!$A$11:$M$177,4,FALSE)=\"\",\"\",VLOOKUP($C38,invullijst!$A$11:$M$177,4,FALSE))","v":"vr"},{"$f":"IF(VLOOKUP($C38,invullijst!$A$11:$M$177,2,FALSE)=\"\",\"\",VLOOKUP($C38,invullijst!$A$11:$M$177,2,FALSE))","v":"Mark van Delft"},{"$f":"IF(VLOOKUP($C38,invullijst!$A$11:$M$177,3,FALSE)=\"\",\"\",VLOOKUP($C38,invullijst!$A$11:$M$177,3,FALSE))","v":"Kaatsheuvel"},{"$f":"IF(VLOOKUP(C38,invullijst!$A$11:$M$177,6,FALSE)=\"\",\"\",VLOOKUP(C38,invullijst!$A$11:$M$177,6,FALSE))","v":65},{"$f":"IF(VLOOKUP($C38,invullijst!$A$11:$M$177,7,FALSE)=\"\",\"\",VLOOKUP($C38,invullijst!$A$11:$M$177,7,FALSE))","v":79},{"$f":"IF(VLOOKUP($C38,invullijst!$A$11:$M$177,8,FALSE)=\"\",\"\",VLOOKUP($C38,invullijst!$A$11:$M$177,8,FALSE))","v":""},{"$f":"IF(VLOOKUP($C38,invullijst!$A$11:$M$177,9,FALSE)=\"\",\"\",VLOOKUP($C38,invullijst!$A$11:$M$177,9,FALSE))","v":""},{"$f":"IF(VLOOKUP($C38,invullijst!$A$11:$M$177,10,FALSE)=\"\",\"\",VLOOKUP($C38,invullijst!$A$11:$M$177,10,FALSE))","v":""},144,{"$f":"IF(VLOOKUP($C38,invullijst!$A$11:$M$177,11,FALSE)=\"\",\"\",VLOOKUP($C38,invullijst!$A$11:$M$177,11,FALSE))","v":""}]
[null,17,103,{"$f":"IF(VLOOKUP($C39,invullijst!$A$11:$M$177,4,FALSE)=\"\",\"\",VLOOKUP($C39,invullijst!$A$11:$M$177,4,FALSE))","v":"vr"},{"$f":"IF(VLOOKUP($C39,invullijst!$A$11:$M$177,2,FALSE)=\"\",\"\",VLOOKUP($C39,invullijst!$A$11:$M$177,2,FALSE))","v":"Norbert van Buul"},{"$f":"IF(VLOOKUP($C39,invullijst!$A$11:$M$177,3,FALSE)=\"\",\"\",VLOOKUP($C39,invullijst!$A$11:$M$177,3,FALSE))","v":"Baardwijk"},{"$f":"IF(VLOOKUP(C39,invullijst!$A$11:$M$177,6,FALSE)=\"\",\"\",VLOOKUP(C39,invullijst!$A$11:$M$177,6,FALSE))","v":""},{"$f":"IF(VLOOKUP($C39,invullijst!$A$11:$M$177,7,FALSE)=\"\",\"\",VLOOKUP($C39,invullijst!$A$11:$M$177,7,FALSE))","v":64},{"$f":"IF(VLOOKUP($C39,invullijst!$A$11:$M$177,8,FALSE)=\"\",\"\",VLOOKUP($C39,invullijst!$A$11:$M$177,8,FALSE))","v":53},{"$f":"IF(VLOOKUP($C39,invullijst!$A$11:$M$177,9,FALSE)=\"\",\"\",VLOOKUP($C39,invullijst!$A$11:$M$177,9,FALSE))","v":""},{"$f":"IF(VLOOKUP($C39,invullijst!$A$11:$M$177,10,FALSE)=\"\",\"\",VLOOKUP($C39,invullijst!$A$11:$M$177,10,FALSE))","v":""},117,{"$f":"IF(VLOOKUP($C39,invullijst!$A$11:$M$177,11,FALSE)=\"\",\"\",VLOOKUP($C39,invullijst!$A$11:$M$177,11,FALSE))","v":""}]
[null,18,308,{"$f":"IF(VLOOKUP($C40,invullijst!$A$11:$M$177,4,FALSE)=\"\",\"\",VLOOKUP($C40,invullijst!$A$11:$M$177,4,FALSE))","v":"vr"},{"$f":"IF(VLOOKUP($C40,invullijst!$A$11:$M$177,2,FALSE)=\"\",\"\",VLOOKUP($C40,invullijst!$A$11:$M$177,2,FALSE))","v":"Jan van Esch"},{"$f":"IF(VLOOKUP($C40,invullijst!$A$11:$M$177,3,FALSE)=\"\",\"\",VLOOKUP($C40,invullijst!$A$11:$M$177,3,FALSE))","v":"Elshout"},{"$f":"IF(VLOOKUP(C40,invullijst!$A$11:$M$177,6,FALSE)=\"\",\"\",VLOOKUP(C40,invullijst!$A$11:$M$177,6,FALSE))","v":60},{"$f":"IF(VLOOKUP($C40,invullijst!$A$11:$M$177,7,FALSE)=\"\",\"\",VLOOKUP($C40,invullijst!$A$11:$M$177,7,FALSE))","v":""},{"$f":"IF(VLOOKUP($C40,invullijst!$A$11:$M$177,8,FALSE)=\"\",\"\",VLOOKUP($C40,invullijst!$A$11:$M$177,8,FALSE))","v":""},{"$f":"IF(VLOOKUP($C40,invullijst!$A$11:$M$177,9,FALSE)=\"\",\"\",VLOOKUP($C40,invullijst!$A$11:$M$177,9,FALSE))","v":""},{"$f":"IF(VLOOKUP($C40,invullijst!$A$11:$M$177,10,FALSE)=\"\",\"\",VLOOKUP($C40,invullijst!$A$11:$M$177,10,FALSE))","v":""},60,{"$f":"IF(VLOOKUP($C40,invullijst!$A$11:$M$177,11,FALSE)=\"\",\"\",VLOOKUP($C40,invullijst!$A$11:$M$177,11,FALSE))","v":""}]
[{"$nulls":3},{"$f":"IF(VLOOKUP($C41,invullijst!$A$10:$M$177,4,FALSE)=\"\",\"\",VLOOKUP($C41,invullijst!$A$10:$M$177,4,FALSE))","v":0},{"$f":"IF(VLOOKUP($C41,invullijst!$A$10:$M$177,2,FALSE)=\"\",\"\",VLOOKUP($C41,invullijst!$A$10:$M$177,2,FALSE))","v":0},{"$f":"IF(VLOOKUP($C41,invullijst!$A$10:$M$177,3,FALSE)=\"\",\"\",VLOOKUP($C41,invullijst!$A$10:$M$177,3,FALSE))","v":0},{"$f":"IF(VLOOKUP(C41,invullijst!$A$10:$M$177,6,FALSE)=\"\",\"\",VLOOKUP(C41,invullijst!$A$10:$M$177,6,FALSE))","v":0},{"$f":"IF(VLOOKUP($C41,invullijst!$A$10:$M$177,7,FALSE)=\"\",\"\",VLOOKUP($C41,invullijst!$A$10:$M$177,7,FALSE))","v":0},{"$f":"IF(VLOOKUP($C41,invullijst!$A$10:$M$177,8,FALSE)=\"\",\"\",VLOOKUP($C41,invullijst!$A$10:$M$177,8,FALSE))","v":0},{"$f":"IF(VLOOKUP($C41,invullijst!$A$10:$M$177,9,FALSE)=\"\",\"\",VLOOKUP($C41,invullijst!$A$10:$M$177,9,FALSE))","v":0},{"$f":"IF(VLOOKUP($C41,invullijst!$A$10:$M$177,10,FALSE)=\"\",\"\",VLOOKUP($C41,invullijst!$A$10:$M$177,10,FALSE))","v":0},{"$f":"SUM(G41:K41)","v":0},{"$f":"IF(VLOOKUP($C41,invullijst!$A$10:$M$177,11,FALSE)=\"\",\"\",VLOOKUP($C41,invullijst!$A$10:$M$177,11,FALSE))","v":0}]
[{"$nulls":3},{"$f":"IF(VLOOKUP($C42,invullijst!$A$10:$M$177,4,FALSE)=\"\",\"\",VLOOKUP($C42,invullijst!$A$10:$M$177,4,FALSE))","v":0},{"$f":"IF(VLOOKUP($C42,invullijst!$A$10:$M$177,2,FALSE)=\"\",\"\",VLOOKUP($C42,invullijst!$A$10:$M$177,2,FALSE))","v":0},{"$f":"IF(VLOOKUP($C42,invullijst!$A$10:$M$177,3,FALSE)=\"\",\"\",VLOOKUP($C42,invullijst!$A$10:$M$177,3,FALSE))","v":0},{"$f":"IF(VLOOKUP(C42,invullijst!$A$10:$M$177,6,FALSE)=\"\",\"\",VLOOKUP(C42,invullijst!$A$10:$M$177,6,FALSE))","v":0},{"$f":"IF(VLOOKUP($C42,invullijst!$A$10:$M$177,7,FALSE)=\"\",\"\",VLOOKUP($C42,invullijst!$A$10:$M$177,7,FALSE))","v":0},{"$f":"IF(VLOOKUP($C42,invullijst!$A$10:$M$177,8,FALSE)=\"\",\"\",VLOOKUP($C42,invullijst!$A$10:$M$177,8,FALSE))","v":0},{"$f":"IF(VLOOKUP($C42,invullijst!$A$10:$M$177,9,FALSE)=\"\",\"\",VLOOKUP($C42,invullijst!$A$10:$M$177,9,FALSE))","v":0},{"$f":"IF(VLOOKUP($C42,invullijst!$A$10:$M$177,10,FALSE)=\"\",\"\",VLOOKUP($C42,invullijst!$A$10:$M$177,10,FALSE))","v":0},0,{"$f":"IF(VLOOKUP($C42,invullijst!$A$10:$M$177,11,FALSE)=\"\",\"\",VLOOKUP($C42,invullijst!$A$10:$M$177,11,FALSE))","v":0}]
[{"$nulls":3},{"$f":"IF(VLOOKUP($C43,invullijst!$A$10:$M$177,4,FALSE)=\"\",\"\",VLOOKUP($C43,invullijst!$A$10:$M$177,4,FALSE))","v":0},{"$f":"IF(VLOOKUP($C43,invullijst!$A$10:$M$177,2,FALSE)=\"\",\"\",VLOOKUP($C43,invullijst!$A$10:$M$177,2,FALSE))","v":0},{"$f":"IF(VLOOKUP($C43,invullijst!$A$10:$M$177,3,FALSE)=\"\",\"\",VLOOKUP($C43,invullijst!$A$10:$M$177,3,FALSE))","v":0},{"$f":"IF(VLOOKUP(C43,invullijst!$A$10:$M$177,6,FALSE)=\"\",\"\",VLOOKUP(C43,invullijst!$A$10:$M$177,6,FALSE))","v":0},{"$f":"IF(VLOOKUP($C43,invullijst!$A$10:$M$177,7,FALSE)=\"\",\"\",VLOOKUP($C43,invullijst!$A$10:$M$177,7,FALSE))","v":0},{"$f":"IF(VLOOKUP($C43,invullijst!$A$10:$M$177,8,FALSE)=\"\",\"\",VLOOKUP($C43,invullijst!$A$10:$M$177,8,FALSE))","v":0},{"$f":"IF(VLOOKUP($C43,invullijst!$A$10:$M$177,9,FALSE)=\"\",\"\",VLOOKUP($C43,invullijst!$A$10:$M$177,9,FALSE))","v":0},{"$f":"IF(VLOOKUP($C43,invullijst!$A$10:$M$177,10,FALSE)=\"\",\"\",VLOOKUP($C43,invullijst!$A$10:$M$177,10,FALSE))","v":0},0,{"$f":"IF(VLOOKUP($C43,invullijst!$A$10:$M$177,11,FALSE)=\"\",\"\",VLOOKUP($C43,invullijst!$A$10:$M$177,11,FALSE))","v":0}]
[{"$nulls":3},{"$f":"IF(VLOOKUP($C44,invullijst!$A$10:$M$177,4,FALSE)=\"\",\"\",VLOOKUP($C44,invullijst!$A$10:$M$177,4,FALSE))","v":0},{"$f":"IF(VLOOKUP($C44,invullijst!$A$10:$M$177,2,FALSE)=\"\",\"\",VLOOKUP($C44,invullijst!$A$10:$M$177,2,FALSE))","v":0},{"$f":"IF(VLOOKUP($C44,invullijst!$A$10:$M$177,3,FALSE)=\"\",\"\",VLOOKUP($C44,invullijst!$A$10:$M$177,3,FALSE))","v":0},{"$f":"IF(VLOOKUP(C44,invullijst!$A$10:$M$177,6,FALSE)=\"\",\"\",VLOOKUP(C44,invullijst!$A$10:$M$177,6,FALSE))","v":0},{"$f":"IF(VLOOKUP($C44,invullijst!$A$10:$M$177,7,FALSE)=\"\",\"\",VLOOKUP($C44,invullijst!$A$10:$M$177,7,FALSE))","v":0},{"$f":"IF(VLOOKUP($C44,invullijst!$A$10:$M$177,8,FALSE)=\"\",\"\",VLOOKUP($C44,invullijst!$A$10:$M$177,8,FALSE))","v":0},{"$f":"IF(VLOOKUP($C44,invullijst!$A$10:$M$177,9,FALSE)=\"\",\"\",VLOOKUP($C44,invullijst!$A$10:$M$177,9,FALSE))","v":0},{"$f":"IF(VLOOKUP($C44,invullijst!$A$10:$M$177,10,FALSE)=\"\",\"\",VLOOKUP($C44,invullijst!$A$10:$M$177,10,FALSE))","v":0},0,{"$f":"IF(VLOOKUP($C44,invullijst!$A$10:$M$177,11,FALSE)=\"\",\"\",VLOOKUP($C44,invullijst!$A$10:$M$177,11,FALSE))","v":0}]
[{"$nulls":3},{"$f":"IF(VLOOKUP($C45,invullijst!$A$10:$M$177,4,FALSE)=\"\",\"\",VLOOKUP($C45,invullijst!$A$10:$M$177,4,FALSE))","v":0},{"$f":"IF(VLOOKUP($C45,invullijst!$A$10:$M$177,2,FALSE)=\"\",\"\",VLOOKUP($C45,invullijst!$A$10:$M$177,2,FALSE))","v":0},{"$f":"IF(VLOOKUP($C45,invullijst!$A$10:$M$177,3,FALSE)=\"\",\"\",VLOOKUP($C45,invullijst!$A$10:$M$177,3,FALSE))","v":0},{"$f":"IF(VLOOKUP(C45,invullijst!$A$10:$M$177,6,FALSE)=\"\",\"\",VLOOKUP(C45,invullijst!$A$10:$M$177,6,FALSE))","v":0},{"$f":"IF(VLOOKUP($C45,invullijst!$A$10:$M$177,7,FALSE)=\"\",\"\",VLOOKUP($C45,invullijst!$A$10:$M$177,7,FALSE))","v":0},{"$f":"IF(VLOOKUP($C45,invullijst!$A$10:$M$177,8,FALSE)=\"\",\"\",VLOOKUP($C45,invullijst!$A$10:$M$177,8,FALSE))","v":0},{"$f":"IF(VLOOKUP($C45,invullijst!$A$10:$M$177,9,FALSE)=\"\",\"\",VLOOKUP($C45,invullijst!$A$10:$M$177,9,FALSE))","v":0},{"$f":"IF(VLOOKUP($C45,invullijst!$A$10:$M$177,10,FALSE)=\"\",\"\",VLOOKUP($C45,invullijst!$A$10:$M$177,10,FALSE))","v":0},0,{"$f":"IF(VLOOKUP($C45,invullijst!$A$10:$M$177,11,FALSE)=\"\",\"\",VLOOKUP($C45,invullijst!$A$10:$M$177,11,FALSE))","v":0}]
[{"$nulls":3},{"$f":"IF(VLOOKUP($C46,invullijst!$A$10:$M$177,4,FALSE)=\"\",\"\",VLOOKUP($C46,invullijst!$A$10:$M$177,4,FALSE))","v":0},{"$f":"IF(VLOOKUP($C46,invullijst!$A$10:$M$177,2,FALSE)=\"\",\"\",VLOOKUP($C46,invullijst!$A$10:$M$177,2,FALSE))","v":0},{"$f":"IF(VLOOKUP($C46,invullijst!$A$10:$M$177,3,FALSE)=\"\",\"\",VLOOKUP($C46,invullijst!$A$10:$M$177,3,FALSE))","v":0},{"$f":"IF(VLOOKUP(C46,invullijst!$A$10:$M$177,6,FALSE)=\"\",\"\",VLOOKUP(C46,invullijst!$A$10:$M$177,6,FALSE))","v":0},{"$f":"IF(VLOOKUP($C46,invullijst!$A$10:$M$177,7,FALSE)=\"\",\"\",VLOOKUP($C46,invullijst!$A$10:$M$177,7,FALSE))","v":0},{"$f":"IF(VLOOKUP($C46,invullijst!$A$10:$M$177,8,FALSE)=\"\",\"\",VLOOKUP($C46,invullijst!$A$10:$M$177,8,FALSE))","v":0},{"$f":"IF(VLOOKUP($C46,invullijst!$A$10:$M$177,9,FALSE)=\"\",\"\",VLOOKUP($C46,invullijst!$A$10:$M$177,9,FALSE))","v":0},{"$f":"IF(VLOOKUP($C46,invullijst!$A$10:$M$177,10,FALSE)=\"\",\"\",VLOOKUP($C46,invullijst!$A$10:$M$177,10,FALSE))","v":0},0,{"$f":"IF(VLOOKUP($C46,invullijst!$A$10:$M$177,11,FALSE)=\"\",\"\",VLOOKUP($C46,invullijst!$A$10:$M$177,11,FALSE))","v":0}]
[{"$nulls":3},{"$f":"IF(VLOOKUP($C47,invullijst!$A$10:$M$177,4,FALSE)=\"\",\"\",VLOOKUP($C47,invullijst!$A$10:$M$177,4,FALSE))","v":0},{"$f":"IF(VLOOKUP($C47,invullijst!$A$10:$M$177,2,FALSE)=\"\",\"\",VLOOKUP($C47,invullijst!$A$10:$M$177,2,FALSE))","v":0},{"$f":"IF(VLOOKUP($C47,invullijst!$A$10:$M$177,3,FALSE)=\"\",\"\",VLOOKUP($C47,invullijst!$A$10:$M$177,3,FALSE))","v":0},{"$f":"IF(VLOOKUP(C47,invullijst!$A$10:$M$177,6,FALSE)=\"\",\"\",VLOOKUP(C47,invullijst!$A$10:$M$177,6,FALSE))","v":0},{"$f":"IF(VLOOKUP($C47,invullijst!$A$10:$M$177,7,FALSE)=\"\",\"\",VLOOKUP($C47,invullijst!$A$10:$M$177,7,FALSE))","v":0},{"$f":"IF(VLOOKUP($C47,invullijst!$A$10:$M$177,8,FALSE)=\"\",\"\",VLOOKUP($C47,invullijst!$A$10:$M$177,8,FALSE))","v":0},{"$f":"IF(VLOOKUP($C47,invullijst!$A$10:$M$177,9,FALSE)=\"\",\"\",VLOOKUP($C47,invullijst!$A$10:$M$177,9,FALSE))","v":0},{"$f":"IF(VLOOKUP($C47,invullijst!$A$10:$M$177,10,FALSE)=\"\",\"\",VLOOKUP($C47,invullijst!$A$10:$M$177,10,FALSE))","v":0},0,{"$f":"IF(VLOOKUP($C47,invullijst!$A$10:$M$177,11,FALSE)=\"\",\"\",VLOOKUP($C47,invullijst!$A$10:$M$177,11,FALSE))","v":0}]
[{"$nulls":3},{"$f":"IF(VLOOKUP($C48,invullijst!$A$10:$M$177,4,FALSE)=\"\",\"\",VLOOKUP($C48,invullijst!$A$10:$M$177,4,FALSE))","v":0},{"$f":"IF(VLOOKUP($C48,invullijst!$A$10:$M$177,2,FALSE)=\"\",\"\",VLOOKUP($C48,invullijst!$A$10:$M$177,2,FALSE))","v":0},{"$f":"IF(VLOOKUP($C48,invullijst!$A$10:$M$177,3,FALSE)=\"\",\"\",VLOOKUP($C48,invullijst!$A$10:$M$177,3,FALSE))","v":0},{"$f":"IF(VLOOKUP(C48,invullijst!$A$10:$M$177,6,FALSE)=\"\",\"\",VLOOKUP(C48,invullijst!$A$10:$M$177,6,FALSE))","v":0},{"$f":"IF(VLOOKUP($C48,invullijst!$A$10:$M$177,7,FALSE)=\"\",\"\",VLOOKUP($C48,invullijst!$A$10:$M$177,7,FALSE))","v":0},{"$f":"IF(VLOOKUP($C48,invullijst!$A$10:$M$177,8,FALSE)=\"\",\"\",VLOOKUP($C48,invullijst!$A$10:$M$177,8,FALSE))","v":0},{"$f":"IF(VLOOKUP($C48,invullijst!$A$10:$M$177,9,FALSE)=\"\",\"\",VLOOKUP($C48,invullijst!$A$10:$M$177,9,FALSE))","v":0},{"$f":"IF(VLOOKUP($C48,invullijst!$A$10:$M$177,10,FALSE)=\"\",\"\",VLOOKUP($C48,invullijst!$A$10:$M$177,10,FALSE))","v":0},0,{"$f":"IF(VLOOKUP($C48,invullijst!$A$10:$M$177,11,FALSE)=\"\",\"\",VLOOKUP($C48,invullijst!$A$10:$M$177,11,FALSE))","v":0}]
[{"$nulls":3},{"$f":"IF(VLOOKUP($C49,invullijst!$A$10:$M$177,4,FALSE)=\"\",\"\",VLOOKUP($C49,invullijst!$A$10:$M$177,4,FALSE))","v":0},{"$f":"IF(VLOOKUP($C49,invullijst!$A$10:$M$177,2,FALSE)=\"\",\"\",VLOOKUP($C49,invullijst!$A$10:$M$177,2,FALSE))","v":0},{"$f":"IF(VLOOKUP($C49,invullijst!$A$10:$M$177,3,FALSE)=\"\",\"\",VLOOKUP($C49,invullijst!$A$10:$M$177,3,FALSE))","v":0},{"$f":"IF(VLOOKUP(C49,invullijst!$A$10:$M$177,6,FALSE)=\"\",\"\",VLOOKUP(C49,invullijst!$A$10:$M$177,6,FALSE))","v":0},{"$f":"IF(VLOOKUP($C49,invullijst!$A$10:$M$177,7,FALSE)=\"\",\"\",VLOOKUP($C49,invullijst!$A$10:$M$177,7,FALSE))","v":0},{"$f":"IF(VLOOKUP($C49,invullijst!$A$10:$M$177,8,FALSE)=\"\",\"\",VLOOKUP($C49,invullijst!$A$10:$M$177,8,FALSE))","v":0},{"$f":"IF(VLOOKUP($C49,invullijst!$A$10:$M$177,9,FALSE)=\"\",\"\",VLOOKUP($C49,invullijst!$A$10:$M$177,9,FALSE))","v":0},{"$f":"IF(VLOOKUP($C49,invullijst!$A$10:$M$177,10,FALSE)=\"\",\"\",VLOOKUP($C49,invullijst!$A$10:$M$177,10,FALSE))","v":0},0,{"$f":"IF(VLOOKUP($C49,invullijst!$A$10:$M$177,11,FALSE)=\"\",\"\",VLOOKUP($C49,invullijst!$A$10:$M$177,11,FALSE))","v":0}]
[{"$nulls":3},{"$f":"IF(VLOOKUP($C50,invullijst!$A$10:$M$177,4,FALSE)=\"\",\"\",VLOOKUP($C50,invullijst!$A$10:$M$177,4,FALSE))","v":0},{"$f":"IF(VLOOKUP($C50,invullijst!$A$10:$M$177,2,FALSE)=\"\",\"\",VLOOKUP($C50,invullijst!$A$10:$M$177,2,FALSE))","v":0},{"$f":"IF(VLOOKUP($C50,invullijst!$A$10:$M$177,3,FALSE)=\"\",\"\",VLOOKUP($C50,invullijst!$A$10:$M$177,3,FALSE))","v":0},{"$f":"IF(VLOOKUP(C50,invullijst!$A$10:$M$177,6,FALSE)=\"\",\"\",VLOOKUP(C50,invullijst!$A$10:$M$177,6,FALSE))","v":0},{"$f":"IF(VLOOKUP($C50,invullijst!$A$10:$M$177,7,FALSE)=\"\",\"\",VLOOKUP($C50,invullijst!$A$10:$M$177,7,FALSE))","v":0},{"$f":"IF(VLOOKUP($C50,invullijst!$A$10:$M$177,8,FALSE)=\"\",\"\",VLOOKUP($C50,invullijst!$A$10:$M$177,8,FALSE))","v":0},{"$f":"IF(VLOOKUP($C50,invullijst!$A$10:$M$177,9,FALSE)=\"\",\"\",VLOOKUP($C50,invullijst!$A$10:$M$177,9,FALSE))","v":0},{"$f":"IF(VLOOKUP($C50,invullijst!$A$10:$M$177,10,FALSE)=\"\",\"\",VLOOKUP($C50,invullijst!$A$10:$M$177,10,FALSE))","v":0},0,{"$f":"IF(VLOOKUP($C50,invullijst!$A$10:$M$177,11,FALSE)=\"\",\"\",VLOOKUP($C50,invullijst!$A$10:$M$177,11,FALSE))","v":0}]
[{"$nulls":3},{"$f":"IF(VLOOKUP($C51,invullijst!$A$10:$M$177,4,FALSE)=\"\",\"\",VLOOKUP($C51,invullijst!$A$10:$M$177,4,FALSE))","v":0},{"$f":"IF(VLOOKUP($C51,invullijst!$A$10:$M$177,2,FALSE)=\"\",\"\",VLOOKUP($C51,invullijst!$A$10:$M$177,2,FALSE))","v":0},{"$f":"IF(VLOOKUP($C51,invullijst!$A$10:$M$177,3,FALSE)=\"\",\"\",VLOOKUP($C51,invullijst!$A$10:$M$177,3,FALSE))","v":0},{"$f":"IF(VLOOKUP(C51,invullijst!$A$10:$M$177,6,FALSE)=\"\",\"\",VLOOKUP(C51,invullijst!$A$10:$M$177,6,FALSE))","v":0},{"$f":"IF(VLOOKUP($C51,invullijst!$A$10:$M$177,7,FALSE)=\"\",\"\",VLOOKUP($C51,invullijst!$A$10:$M$177,7,FALSE))","v":0},{"$f":"IF(VLOOKUP($C51,invullijst!$A$10:$M$177,8,FALSE)=\"\",\"\",VLOOKUP($C51,invullijst!$A$10:$M$177,8,FALSE))","v":0},{"$f":"IF(VLOOKUP($C51,invullijst!$A$10:$M$177,9,FALSE)=\"\",\"\",VLOOKUP($C51,invullijst!$A$10:$M$177,9,FALSE))","v":0},{"$f":"IF(VLOOKUP($C51,invullijst!$A$10:$M$177,10,FALSE)=\"\",\"\",VLOOKUP($C51,invullijst!$A$10:$M$177,10,FALSE))","v":0},0,{"$f":"IF(VLOOKUP($C51,invullijst!$A$10:$M$177,11,FALSE)=\"\",\"\",VLOOKUP($C51,invullijst!$A$10:$M$177,11,FALSE))","v":0}]
[{"$nulls":3},{"$f":"IF(VLOOKUP($C52,invullijst!$A$10:$M$177,4,FALSE)=\"\",\"\",VLOOKUP($C52,invullijst!$A$10:$M$177,4,FALSE))","v":0},{"$f":"IF(VLOOKUP($C52,invullijst!$A$10:$M$177,2,FALSE)=\"\",\"\",VLOOKUP($C52,invullijst!$A$10:$M$177,2,FALSE))","v":0},{"$f":"IF(VLOOKUP($C52,invullijst!$A$10:$M$177,3,FALSE)=\"\",\"\",VLOOKUP($C52,invullijst!$A$10:$M$177,3,FALSE))","v":0},{"$f":"IF(VLOOKUP(C52,invullijst!$A$10:$M$177,6,FALSE)=\"\",\"\",VLOOKUP(C52,invullijst!$A$10:$M$177,6,FALSE))","v":0},{"$f":"IF(VLOOKUP($C52,invullijst!$A$10:$M$177,7,FALSE)=\"\",\"\",VLOOKUP($C52,invullijst!$A$10:$M$177,7,FALSE))","v":0},{"$f":"IF(VLOOKUP($C52,invullijst!$A$10:$M$177,8,FALSE)=\"\",\"\",VLOOKUP($C52,invullijst!$A$10:$M$177,8,FALSE))","v":0},{"$f":"IF(VLOOKUP($C52,invullijst!$A$10:$M$177,9,FALSE)=\"\",\"\",VLOOKUP($C52,invullijst!$A$10:$M$177,9,FALSE))","v":0},{"$f":"IF(VLOOKUP($C52,invullijst!$A$10:$M$177,10,FALSE)=\"\",\"\",VLOOKUP($C52,invullijst!$A$10:$M$177,10,FALSE))","v":0},0,{"$f":"IF(VLOOKUP($C52,invullijst!$A$10:$M$177,11,FALSE)=\"\",\"\",VLOOKUP($C52,invullijst!$A$10:$M$177,11,FALSE))","v":0}]
[{"$nulls":3},{"$f":"IF(VLOOKUP($C53,invullijst!$A$10:$M$177,4,FALSE)=\"\",\"\",VLOOKUP($C53,invullijst!$A$10:$M$177,4,FALSE))","v":0},{"$f":"IF(VLOOKUP($C53,invullijst!$A$10:$M$177,2,FALSE)=\"\",\"\",VLOOKUP($C53,invullijst!$A$10:$M$177,2,FALSE))","v":0},{"$f":"IF(VLOOKUP($C53,invullijst!$A$10:$M$177,3,FALSE)=\"\",\"\",VLOOKUP($C53,invullijst!$A$10:$M$177,3,FALSE))","v":0},{"$f":"IF(VLOOKUP(C53,invullijst!$A$10:$M$177,6,FALSE)=\"\",\"\",VLOOKUP(C53,invullijst!$A$10:$M$177,6,FALSE))","v":0},{"$f":"IF(VLOOKUP($C53,invullijst!$A$10:$M$177,7,FALSE)=\"\",\"\",VLOOKUP($C53,invullijst!$A$10:$M$177,7,FALSE))","v":0},{"$f":"IF(VLOOKUP($C53,invullijst!$A$10:$M$177,8,FALSE)=\"\",\"\",VLOOKUP($C53,invullijst!$A$10:$M$177,8,FALSE))","v":0},{"$f":"IF(VLOOKUP($C53,invullijst!$A$10:$M$177,9,FALSE)=\"\",\"\",VLOOKUP($C53,invullijst!$A$10:$M$177,9,FALSE))","v":0},{"$f":"IF(VLOOKUP($C53,invullijst!$A$10:$M$177,10,FALSE)=\"\",\"\",VLOOKUP($C53,invullijst!$A$10:$M$177,10,FALSE))","v":0},0,{"$f":"IF(VLOOKUP($C53,invullijst!$A$10:$M$177,11,FALSE)=\"\",\"\",VLOOKUP($C53,invullijst!$A$10:$M$177,11,FALSE))","v":0}]
[{"$nulls":3},{"$f":"IF(VLOOKUP($C54,invullijst!$A$10:$M$177,4,FALSE)=\"\",\"\",VLOOKUP($C54,invullijst!$A$10:$M$177,4,FALSE))","v":0},{"$f":"IF(VLOOKUP($C54,invullijst!$A$10:$M$177,2,FALSE)=\"\",\"\",VLOOKUP($C54,invullijst!$A$10:$M$177,2,FALSE))","v":0},{"$f":"IF(VLOOKUP($C54,invullijst!$A$10:$M$177,3,FALSE)=\"\",\"\",VLOOKUP($C54,invullijst!$A$10:$M$177,3,FALSE))","v":0},{"$f":"IF(VLOOKUP(C54,invullijst!$A$10:$M$177,6,FALSE)=\"\",\"\",VLOOKUP(C54,invullijst!$A$10:$M$177,6,FALSE))","v":0},{"$f":"IF(VLOOKUP($C54,invullijst!$A$10:$M$177,7,FALSE)=\"\",\"\",VLOOKUP($C54,invullijst!$A$10:$M$177,7,FALSE))","v":0},{"$f":"IF(VLOOKUP($C54,invullijst!$A$10:$M$177,8,FALSE)=\"\",\"\",VLOOKUP($C54,invullijst!$A$10:$M$177,8,FALSE))","v":0},{"$f":"IF(VLOOKUP($C54,invullijst!$A$10:$M$177,9,FALSE)=\"\",\"\",VLOOKUP($C54,invullijst!$A$10:$M$177,9,FALSE))","v":0},{"$f":"IF(VLOOKUP($C54,invullijst!$A$10:$M$177,10,FALSE)=\"\",\"\",VLOOKUP($C54,invullijst!$A$10:$M$177,10,FALSE))","v":0},0,{"$f":"IF(VLOOKUP($C54,invullijst!$A$10:$M$177,11,FALSE)=\"\",\"\",VLOOKUP($C54,invullijst!$A$10:$M$177,11,FALSE))","v":0}]
[{"$nulls":3},{"$f":"IF(VLOOKUP($C55,invullijst!$A$10:$M$177,4,FALSE)=\"\",\"\",VLOOKUP($C55,invullijst!$A$10:$M$177,4,FALSE))","v":0},{"$f":"IF(VLOOKUP($C55,invullijst!$A$10:$M$177,2,FALSE)=\"\",\"\",VLOOKUP($C55,invullijst!$A$10:$M$177,2,FALSE))","v":0},{"$f":"IF(VLOOKUP($C55,invullijst!$A$10:$M$177,3,FALSE)=\"\",\"\",VLOOKUP($C55,invullijst!$A$10:$M$177,3,FALSE))","v":0},{"$f":"IF(VLOOKUP(C55,invullijst!$A$10:$M$177,6,FALSE)=\"\",\"\",VLOOKUP(C55,invullijst!$A$10:$M$177,6,FALSE))","v":0},{"$f":"IF(VLOOKUP($C55,invullijst!$A$10:$M$177,7,FALSE)=\"\",\"\",VLOOKUP($C55,invullijst!$A$10:$M$177,7,FALSE))","v":0},{"$f":"IF(VLOOKUP($C55,invullijst!$A$10:$M$177,8,FALSE)=\"\",\"\",VLOOKUP($C55,invullijst!$A$10:$M$177,8,FALSE))","v":0},{"$f":"IF(VLOOKUP($C55,invullijst!$A$10:$M$177,9,FALSE)=\"\",\"\",VLOOKUP($C55,invullijst!$A$10:$M$177,9,FALSE))","v":0},{"$f":"IF(VLOOKUP($C55,invullijst!$A$10:$M$177,10,FALSE)=\"\",\"\",VLOOKUP($C55,invullijst!$A$10:$M$177,10,FALSE))","v":0},0,{"$f":"IF(VLOOKUP($C55,invullijst!$A$10:$M$177,11,FALSE)=\"\",\"\",VLOOKUP($C55,invullijst!$A$10:$M$177,11,FALSE))","v":0}]

{"sheet":"Jeugd","index":2,"n_rows":14,"n_cols":13,"rows_kept":14,"merged":[[0,0,1,5],[0,6,0,9],[0,10,0,12],[1,6,1,12],[2,6,2,10]]}
["JEUGD",{"$nulls":5},{"$f":"invullijst!F1","v":"Organisatie"},{"$nulls":3},{"$f":"invullijst!H2","v":"2023 - 2024"}]
[{"$nulls":6},{"$f":"invullijst!F3","v":"St. Crispinus & Crispinianus Besoijen"}]
[{"$nulls":6},"wedstrijd",{"$nulls":5},"KAMP-"]
["KL",null,"schutter",null,"NAAM","PLAATS",1,2,3,4,5,"TOTAAL","KAART"]
["A",1,312,{"$f":"IF(VLOOKUP($C5,invullijst!$A$11:$M$177,4,FALSE)=\"\",\"\",VLOOKUP($C5,invullijst!$A$11:$M$177,4,FALSE))","v":"J"},{"$f":"IF(VLOOKUP($C5,invullijst!$A$11:$M$177,2,FALSE)=\"\",\"\",VLOOKUP($C5,invullijst!$A$11:$M$177,2,FALSE))","v":"Floor de Jong"},{"$f":"IF(VLOOKUP($C5,invullijst!$A$11:$M$177,3,FALSE)=\"\",\"\",VLOOKUP($C5,invullijst!$A$11:$M$177,3,FALSE))","v":"Elshout"},{"$f":"IF(VLOOKUP($C5,invullijst!$A$11:$M$177,6,FALSE)=\"\",\"\",VLOOKUP($C5,invullijst!$A$11:$M$177,6,FALSE))","v":91},{"$f":"IF(VLOOKUP($C5,invullijst!$A$11:$M$177,7,FALSE)=\"\",\"\",VLOOKUP($C5,invullijst!$A$11:$M$177,7,FALSE))","v":""},{"$f":"IF(VLOOKUP($C5,invullijst!$A$11:$M$177,8,FALSE)=\"\",\"\",VLOOKUP($C5,invullijst!$A$11:$M$177,8,FALSE))","v":91},{"$f":"IF(VLOOKUP($C5,invullijst!$A$11:$M$177,9,FALSE)=\"\",\"\",VLOOKUP($C5,invullijst!$A$11:$M$177,9,FALSE))","v":90},{"$f":"IF(VLOOKUP($C5,invullijst!$A$11:$M$177,10,FALSE)=\"\",\"\",VLOOKUP($C5,invullijst!$A$11:$M$177,10,FALSE))","v":92},{"$f":"SUM(G5:K5)","v":364},{"$f":"IF(VLOOKUP($C5,invullijst!$A$11:$M$177,11,FALSE)=\"\",\"\",VLOOKUP($C5,invullijst!$A$11:$M$177,11,FALSE))","v":43}]
[null,2,109,{"$f":"IF(VLOOKUP($C6,invullijst!$A$11:$M$177,4,FALSE)=\"\",\"\",VLOOKUP($C6,invullijst!$A$11:$M$177,4,FALSE))","v":"J"},{"$f":"IF(VLOOKUP($C6,invullijst!$A$11:$M$177,2,FALSE)=\"\",\"\",VLOOKUP($C6,invullijst!$A$11:$M$177,2,FALSE))","v":"Gijs Pullens"},{"$f":"IF(VLOOKUP($C6,invullijst!$A$11:$M$177,3,FALSE)=\"\",\"\",VLOOKUP($C6,invullijst!$A$11:$M$177,3,FALSE))","v":"Baardwijk"},{"$f":"IF(VLOOKUP($C6,invullijst!$A$11:$M$177,6,FALSE)=\"\",\"\",VLOOKUP($C6,invullijst!$A$11:$M$177,6,FALSE))","v":""},{"$f":"IF(VLOOKUP($C6,invullijst!$A$11:$M$177,7,FALSE)=\"\",\"\",VLOOKUP($C6,invullijst!$A$11:$M$177,7,FALSE))","v":83},{"$f":"IF(VLOOKUP($C6,invullijst!$A$11:$M$177,8,FALSE)=\"\",\"\",VLOOKUP($C6,invullijst!$A$11:$M$177,8,FALSE))","v":92},{"$f":"IF(VLOOKUP($C6,invullijst!$A$11:$M$177,9,FALSE)=\"\",\"\",VLOOKUP($C6,invullijst!$A$11:$M$177,9,FALSE))","v":83},{"$f":"IF(VLOOKUP($C6,invullijst!$A$11:$M$177,10,FALSE)=\"\",\"\",VLOOKUP($C6,invullijst!$A$11:$M$177,10,FALSE))","v":78},{"$f":"SUM(G6:K6)","v":336},{"$f":"IF(VLOOKUP($C6,invullijst!$A$11:$M$177,11,FALSE)=\"\",\"\",VLOOKUP($C6,invullijst!$A$11:$M$177,11,FALSE))","v":44}]
[null,3,null,{"$f":"IF(VLOOKUP($C7,invullijst!$A$10:$M$177,4,FALSE)=\"\",\"\",VLOOKUP($C7,invullijst!$A$10:$M$177,4,FALSE))","v":0},{"$f":"IF(VLOOKUP($C7,invullijst!$A$10:$M$177,2,FALSE)=\"\",\"\",VLOOKUP($C7,invullijst!$A$10:$M$177,2,FALSE))","v":0},{"$f":"IF(VLOOKUP($C7,invullijst!$A$10:$M$177,3,FALSE)=\"\",\"\",VLOOKUP($C7,invullijst!$A$10:$M$177,3,FALSE))","v":0},{"$f":"IF(VLOOKUP($C7,invullijst!$A$10:$M$177,6,FALSE)=\"\",\"\",VLOOKUP($C7,invullijst!$A$10:$M$177,6,FALSE))","v":0},{"$f":"IF(VLOOKUP($C7,invullijst!$A$10:$M$177,7,FALSE)=\"\",\"\",VLOOKUP($C7,invullijst!$A$10:$M$177,7,FALSE))","v":0},{"$f":"IF(VLOOKUP($C7,invullijst!$A$10:$M$177,8,FALSE)=\"\",\"\",VLOOKUP($C7,invullijst!$A$10:$M$177,8,FALSE))","v":0},{"$f":"IF(VLOOKUP($C7,invullijst!$A$10:$M$177,9,FALSE)=\"\",\"\",VLOOKUP($C7,invullijst!$A$10:$M$177,9,FALSE))","v":0},{"$f":"IF(VLOOKUP($C7,invullijst!$A$10:$M$177,10,FALSE)=\"\",\"\",VLOOKUP($C7,invullijst!$A$10:$M$177,10,FALSE))","v":0},{"$f":"SUM(G7:K7)","v":0},{"$f":"IF(VLOOKUP($C7,invullijst!$A$10:$M$177,11,FALSE)=\"\",\"\",VLOOKUP($C7,invullijst!$A$10:$M$177,11,FALSE))","v":0}]
[null,4,null,{"$f":"IF(VLOOKUP($C8,invullijst!$A$10:$M$177,4,FALSE)=\"\",\"\",VLOOKUP($C8,invullijst!$A$10:$M$177,4,FALSE))","v":0},{"$f":"IF(VLOOKUP($C8,invullijst!$A$10:$M$177,2,FALSE)=\"\",\"\",VLOOKUP($C8,invullijst!$A$10:$M$177,2,FALSE))","v":0},{"$f":"IF(VLOOKUP($C8,invullijst!$A$10:$M$177,3,FALSE)=\"\",\"\",VLOOKUP($C8,invullijst!$A$10:$M$177,3,FALSE))","v":0},{"$f":"IF(VLOOKUP($C8,invullijst!$A$10:$M$177,6,FALSE)=\"\",\"\",VLOOKUP($C8,invullijst!$A$10:$M$177,6,FALSE))","v":0},{"$f":"IF(VLOOKUP($C8,invullijst!$A$10:$M$177,7,FALSE)=\"\",\"\",VLOOKUP($C8,invullijst!$A$10:$M$177,7,FALSE))","v":0},{"$f":"IF(VLOOKUP($C8,invullijst!$A$10:$M$177,8,FALSE)=\"\",\"\",VLOOKUP($C8,invullijst!$A$10:$M$177,8,FALSE))","v":0},{"$f":"IF(VLOOKUP($C8,invullijst!$A$10:$M$177,9,FALSE)=\"\",\"\",VLOOKUP($C8,invullijst!$A$10:$M$177,9,FALSE))","v":0},{"$f":"IF(VLOOKUP($C8,invullijst!$A$10:$M$177,10,FALSE)=\"\",\"\",VLOOKUP($C8,invullijst!$A$10:$M$177,10,FALSE))","v":0},{"$f":"SUM(G8:K8)","v":0},{"$f":"IF(VLOOKUP($C8,invullijst!$A$10:$M$177,11,FALSE)=\"\",\"\",VLOOKUP($C8,invullijst!$A$10:$M$177,11,FALSE))","v":0}]
[{"$nulls":3},{"$f":"IF(VLOOKUP($C9,invullijst!$A$10:$M$177,4,FALSE)=\"\",\"\",VLOOKUP($C9,invullijst!$A$10:$M$177,4,FALSE))","v":0},{"$f":"IF(VLOOKUP($C9,invullijst!$A$10:$M$177,2,FALSE)=\"\",\"\",VLOOKUP($C9,invullijst!$A$10:$M$177,2,FALSE))","v":0},{"$f":"IF(VLOOKUP($C9,invullijst!$A$10:$M$177,3,FALSE)=\"\",\"\",VLOOKUP($C9,invullijst!$A$10:$M$177,3,FALSE))","v":0},{"$f":"IF(VLOOKUP($C9,invullijst!$A$10:$M$177,6,FALSE)=\"\",\"\",VLOOKUP($C9,invullijst!$A$10:$M$177,6,FALSE))","v":0},{"$f":"IF(VLOOKUP($C9,invullijst!$A$10:$M$177,7,FALSE)=\"\",\"\",VLOOKUP($C9,invullijst!$A$10:$M$177,7,FALSE))","v":0},{"$f":"IF(VLOOKUP($C9,invullijst!$A$10:$M$177,8,FALSE)=\"\",\"\",VLOOKUP($C9,invullijst!$A$10:$M$177,8,FALSE))","v":0},{"$f":"IF(VLOOKUP($C9,invullijst!$A$10:$M$177,9,FALSE)=\"\",\"\",VLOOKUP($C9,invullijst!$A$10:$M$177,9,FALSE))","v":0},{"$f":"IF(VLOOKUP($C9,invullijst!$A$10:$M$177,10,FALSE)=\"\",\"\",VLOOKUP($C9,invullijst!$A$10:$M$177,10,FALSE))","v":0},0,{"$f":"IF(VLOOKUP($C9,invullijst!$A$10:$M$177,11,FALSE)=\"\",\"\",VLOOKUP($C9,invullijst!$A$10:$M$177,11,FALSE))","v":0}]
[{"$nulls":3},{"$f":"IF(VLOOKUP($C10,invullijst!$A$10:$M$177,4,FALSE)=\"\",\"\",VLOOKUP($C10,invullijst!$A$10:$M$177,4,FALSE))","v":0},{"$f":"IF(VLOOKUP($C10,invullijst!$A$10:$M$177,2,FALSE)=\"\",\"\",VLOOKUP($C10,invullijst!$A$10:$M$177,2,FALSE))","v":0},{"$f":"IF(VLOOKUP($C10,invullijst!$A$10:$M$177,3,FALSE)=\"\",\"\",VLOOKUP($C10,invullijst!$A$10:$M$177,3,FALSE))","v":0},{"$f":"IF(VLOOKUP($C10,invullijst!$A$10:$M$177,6,FALSE)=\"\",\"\",VLOOKUP($C10,invullijst!$A$10:$M$177,6,FALSE))","v":0},{"$f":"IF(VLOOKUP($C10,invullijst!$A$10:$M$177,7,FALSE)=\"\",\"\",VLOOKUP($C10,invullijst!$A$10:$M$177,7,FALSE))","v":0},{"$f":"IF(VLOOKUP($C10,invullijst!$A$10:$M$177,8,FALSE)=\"\",\"\",VLOOKUP($C10,invullijst!$A$10:$M$177,8,FALSE))","v":0},{"$f":"IF(VLOOKUP($C10,invullijst!$A$10:$M$177,9,FALSE)=\"\",\"\",VLOOKUP($C10,invullijst!$A$10:$M$177,9,FALSE))","v":0},{"$f":"IF(VLOOKUP($C10,invullijst!$A$10:$M$177,10,FALSE)=\"\",\"\",VLOOKUP($C10,invullijst!$A$10:$M$177,10,FALSE))","v":0},0,{"$f":"IF(VLOOKUP($C10,invullijst!$A$10:$M$177,11,FALSE)=\"\",\"\",VLOOKUP($C10,invullijst!$A$10:$M$177,11,FALSE))","v":0}]
[{"$nulls":3},{"$f":"IF(VLOOKUP($C11,invullijst!$A$10:$M$177,4,FALSE)=\"\",\"\",VLOOKUP($C11,invullijst!$A$10:$M$177,4,FALSE))","v":0},{"$f":"IF(VLOOKUP($C11,invullijst!$A$10:$M$177,2,FALSE)=\"\",\"\",VLOOKUP($C11,invullijst!$A$10:$M$177,2,FALSE))","v":0},{"$f":"IF(VLOOKUP($C11,invullijst!$A$10:$M$177,3,FALSE)=\"\",\"\",VLOOKUP($C11,invullijst!$A$10:$M$177,3,FALSE))","v":0},{"$f":"IF(VLOOKUP($C11,invullijst!$A$10:$M$177,6,FALSE)=\"\",\"\",VLOOKUP($C11,invullijst!$A$10:$M$177,6,FALSE))","v":0},{"$f":"IF(VLOOKUP($C11,invullijst!$A$10:$M$177,7,FALSE)=\"\",\"\",VLOOKUP($C11,invullijst!$A$10:$M$177,7,FALSE))","v":0},{"$f":"IF(VLOOKUP($C11,invullijst!$A$10:$M$177,8,FALSE)=\"\",\"\",VLOOKUP($C11,invullijst!$A$10:$M$177,8,FALSE))","v":0},{"$f":"IF(VLOOKUP($C11,invullijst!$A$10:$M$177,9,FALSE)=\"\",\"\",VLOOKUP($C11,invullijst!$A$10:$M$177,9,FALSE))","v":0},{"$f":"IF(VLOOKUP($C11,invullijst!$A$10:$M$177,10,FALSE)=\"\",\"\",VLOOKUP($C11,invullijst!$A$10:$M$177,10,FALSE))","v":0},0,{"$f":"IF(VLOOKUP($C11,invullijst!$A$10:$M$177,11,FALSE)=\"\",\"\",VLOOKUP($C11,invullijst!$A$10:$M$177,11,FALSE))","v":0}]
[{"$nulls":3},{"$f":"IF(VLOOKUP($C12,invullijst!$A$10:$M$177,4,FALSE)=\"\",\"\",VLOOKUP($C12,invullijst!$A$10:$M$177,4,FALSE))","v":0},{"$f":"IF(VLOOKUP($C12,invullijst!$A$10:$M$177,2,FALSE)=\"\",\"\",VLOOKUP($C12,invullijst!$A$10:$M$177,2,FALSE))","v":0},{"$f":"IF(VLOOKUP($C12,invullijst!$A$10:$M$177,3,FALSE)=\"\",\"\",VLOOKUP($C12,invullijst!$A$10:$M$177,3,FALSE))","v":0},{"$f":"IF(VLOOKUP($C12,invullijst!$A$10:$M$177,6,FALSE)=\"\",\"\",VLOOKUP($C12,invullijst!$A$10:$M$177,6,FALSE))","v":0},{"$f":"IF(VLOOKUP($C12,invullijst!$A$10:$M$177,7,FALSE)=\"\",\"\",VLOOKUP($C12,invullijst!$A$10:$M$177,7,FALSE))","v":0},{"$f":"IF(VLOOKUP($C12,invullijst!$A$10:$M$177,8,FALSE)=\"\",\"\",VLOOKUP($C12,invullijst!$A$10:$M$177,8,FALSE))","v":0},{"$f":"IF(VLOOKUP($C12,invullijst!$A$10:$M$177,9,FALSE)=\"\",\"\",VLOOKUP($C12,invullijst!$A$10:$M$177,9,FALSE))","v":0},{"$f":"IF(VLOOKUP($C12,invullijst!$A$10:$M$177,10,FALSE)=\"\",\"\",VLOOKUP($C12,invullijst!$A$10:$M$177,10,FALSE))","v":0},0,{"$f":"IF(VLOOKUP($C12,invullijst!$A$10:$M$177,11,FALSE)=\"\",\"\",VLOOKUP($C12,invullijst!$A$10:$M$177,11,FALSE))","v":0}]
[{"$nulls":3},{"$f":"IF(VLOOKUP($C13,invullijst!$A$10:$M$177,4,FALSE)=\"\",\"\",VLOOKUP($C13,invullijst!$A$10:$M$177,4,FALSE))","v":0},{"$f":"IF(VLOOKUP($C13,invullijst!$A$10:$M$177,2,FALSE)=\"\",\"\",VLOOKUP($C13,invullijst!$A$10:$M$177,2,FALSE))","v":0},{"$f":"IF(VLOOKUP($C13,invullijst!$A$10:$M$177,3,FALSE)=\"\",\"\",VLOOKUP($C13,invullijst!$A$10:$M$177,3,FALSE))","v":0},{"$f":"IF(VLOOKUP($C13,invullijst!$A$10:$M$177,6,FALSE)=\"\",\"\",VLOOKUP($C13,invullijst!$A$10:$M$177,6,FALSE))","v":0},{"$f":"IF(VLOOKUP($C13,invullijst!$A$10:$M$177,7,FALSE)=\"\",\"\",VLOOKUP($C13,invullijst!$A$10:$M$177,7,FALSE))","v":0},{"$f":"IF(VLOOKUP($C13,invullijst!$A$10:$M$177,8,FALSE)=\"\",\"\",VLOOKUP($C13,invullijst!$A$10:$M$177,8,FALSE))","v":0},{"$f":"IF(VLOOKUP($C13,invullijst!$A$10:$M$177,9,FALSE)=\"\",\"\",VLOOKUP($C13,invullijst!$A$10:$M$177,9,FALSE))","v":0},{"$f":"IF(VLOOKUP($C13,invullijst!$A$10:$M$177,10,FALSE)=\"\",\"\",VLOOKUP($C13,invullijst!$A$10:$M$177,10,FALSE))","v":0},0,{"$f":"IF(VLOOKUP($C13,invullijst!$A$10:$M$177,11,FALSE)=\"\",\"\",VLOOKUP($C13,invullijst!$A$10:$M$177,11,FALSE))","v":0}]
[{"$nulls":3},{"$f":"IF(VLOOKUP($C14,invullijst!$A$10:$M$177,4,FALSE)=\"\",\"\",VLOOKUP($C14,invullijst!$A$10:$M$177,4,FALSE))","v":0},{"$f":"IF(VLOOKUP($C14,invullijst!$A$10:$M$177,2,FALSE)=\"\",\"\",VLOOKUP($C14,invullijst!$A$10:$M$177,2,FALSE))","v":0},{"$f":"IF(VLOOKUP($C14,invullijst!$A$10:$M$177,3,FALSE)=\"\",\"\",VLOOKUP($C14,invullijst!$A$10:$M$177,3,FALSE))","v":0},{"$f":"IF(VLOOKUP($C14,invullijst!$A$10:$M$177,6,FALSE)=\"\",\"\",VLOOKUP($C14,invullijst!$A$10:$M$177,6,FALSE))","v":0},{"$f":"IF(VLOOKUP($C14,invullijst!$A$10:$M$177,7,FALSE)=\"\",\"\",VLOOKUP($C14,invullijst!$A$10:$M$177,7,FALSE))","v":0},{"$f":"IF(VLOOKUP($C14,invullijst!$A$10:$M$177,8,FALSE)=\"\",\"\",VLOOKUP($C14,invullijst!$A$10:$M$177,8,FALSE))","v":0},{"$f":"IF(VLOOKUP($C14,invullijst!$A$10:$M$177,9,FALSE)=\"\",\"\",VLOOKUP($C14,invullijst!$A$10:$M$177,9,FALSE))","v":0},{"$f":"IF(VLOOKUP($C14,invullijst!$A$10:$M$177,10,FALSE)=\"\",\"\",VLOOKUP($C14,invullijst!$A$10:$M$177,10,FALSE))","v":0},0,{"$f":"IF(VLOOKUP($C14,invullijst!$A$10:$M$177,11,FALSE)=\"\",\"\",VLOOKUP($C14,invullijst!$A$10:$M$177,11,FALSE))","v":0}]

{"sheet":"65+","index":3,"n_rows":34,"n_cols":13,"rows_kept":34,"merged":[[0,0,1,5],[0,6,0,9],[0,10,0,12],[1,6,1,12],[2,6,2,10]]}
["65+",{"$nulls":5},{"$f":"invullijst!F1","v":"Organisatie"},{"$nulls":3},{"$f":"invullijst!H2","v":"2023 - 2024"}]
[{"$nulls":6},{"$f":"invullijst!F3","v":"St. Crispinus & Crispinianus Besoijen"}]
[{"$nulls":6},"wedstrijd",{"$nulls":5},"KAMP-"]
["KL.",null,"schutter",null,"NAAM","PLAATS",1,2,3,4,5,"TOTAAL","KAART"]
["A",1,413,{"$f":"IF(VLOOKUP($C5,invullijst!$A$10:$M188,4,FALSE)=\"\",\"\",VLOOKUP($C5,invullijst!$A$10:$M188,4,FALSE))","v":"65+"},{"$f":"IF(VLOOKUP($C5,invullijst!$A$10:$M179,2,FALSE)=\"\",\"\",VLOOKUP($C5,invullijst!$A$10:$M179,2,FALSE))","v":"Frans Mommersteeg"},{"$f":"IF(VLOOKUP($C5,invullijst!$A$10:$M$177,3,FALSE)=\"\",\"\",VLOOKUP($C5,invullijst!$A$10:$M$177,3,FALSE))","v":"Haarsteeg"},{"$f":"IF(VLOOKUP($C5,invullijst!$A$10:$M$177,6,FALSE)=\"\",\"\",VLOOKUP($C5,invullijst!$A$10:$M$177,6,FALSE))","v":96},{"$f":"IF(VLOOKUP($C5,invullijst!$A$10:$M$177,7,FALSE)=\"\",\"\",VLOOKUP($C5,invullijst!$A$10:$M$177,7,FALSE))","v":98},{"$f":"IF(VLOOKUP($C5,invullijst!$A$10:$M$177,8,FALSE)=\"\",\"\",VLOOKUP($C5,invullijst!$A$10:$M$177,8,FALSE))","v":""},{"$f":"IF(VLOOKUP($C5,invullijst!$A$10:$M$177,9,FALSE)=\"\",\"\",VLOOKUP($C5,invullijst!$A$10:$M$177,9,FALSE))","v":95},{"$f":"IF(VLOOKUP($C5,invullijst!$A$10:$M$177,10,FALSE)=\"\",\"\",VLOOKUP($C5,invullijst!$A$10:$M$177,10,FALSE))","v":94},{"$f":"SUM(G5:K5)","v":383},{"$f":"IF(VLOOKUP($C5,invullijst!$A$10:$M$177,11,FALSE)=\"\",\"\",VLOOKUP($C5,invullijst!$A$10:$M$177,11,FALSE))","v":48}]
[null,2,404,{"$f":"IF(VLOOKUP($C6,invullijst!$A$10:$M181,4,FALSE)=\"\",\"\",VLOOKUP($C6,invullijst!$A$10:$M181,4,FALSE))","v":"65+"},{"$f":"IF(VLOOKUP($C6,invullijst!$A$10:$M181,2,FALSE)=\"\",\"\",VLOOKUP($C6,invullijst!$A$10:$M181,2,FALSE))","v":"Gerard van Beurden"},{"$f":"IF(VLOOKUP($C6,invullijst!$A$10:$M$177,3,FALSE)=\"\",\"\",VLOOKUP($C6,invullijst!$A$10:$M$177,3,FALSE))","v":"Haarsteeg"},{"$f":"IF(VLOOKUP($C6,invullijst!$A$10:$M$177,6,FALSE)=\"\",\"\",VLOOKUP($C6,invullijst!$A$10:$M$177,6,FALSE))","v":93},{"$f":"IF(VLOOKUP($C6,invullijst!$A$10:$M$177,7,FALSE)=\"\",\"\",VLOOKUP($C6,invullijst!$A$10:$M$177,7,FALSE))","v":97},{"$f":"IF(VLOOKUP($C6,invullijst!$A$10:$M$177,8,FALSE)=\"\",\"\",VLOOKUP($C6,invullijst!$A$10:$M$177,8,FALSE))","v":""},{"$f":"IF(VLOOKUP($C6,invullijst!$A$10:$M$177,9,FALSE)=\"\",\"\",VLOOKUP($C6,invullijst!$A$10:$M$177,9,FALSE))","v":98},{"$f":"IF(VLOOKUP($C6,invullijst!$A$10:$M$177,10,FALSE)=\"\",\"\",VLOOKUP($C6,invullijst!$A$10:$M$177,10,FALSE))","v":94},382,{"$f":"IF(VLOOKUP($C6,invullijst!$A$10:$M$177,11,FALSE)=\"\",\"\",VLOOKUP($C6,invullijst!$A$10:$M$177,11,FALSE))","v":46}]
[null,3,415,{"$f":"IF(VLOOKUP($C7,invullijst!$A$10:$M186,4,FALSE)=\"\",\"\",VLOOKUP($C7,invullijst!$A$10:$M186,4,FALSE))","v":"65+"},{"$f":"IF(VLOOKUP($C7,invullijst!$A$10:$M184,2,FALSE)=\"\",\"\",VLOOKUP($C7,invullijst!$A$10:$M184,2,FALSE))","v":"Wim de Gouw"},{"$f":"IF(VLOOKUP($C7,invullijst!$A$10:$M$177,3,FALSE)=\"\",\"\",VLOOKUP($C7,invullijst!$A$10:$M$177,3,FALSE))","v":"Haarsteeg"},{"$f":"IF(VLOOKUP($C7,invullijst!$A$10:$M$177,6,FALSE)=\"\",\"\",VLOOKUP($C7,invullijst!$A$10:$M$177,6,FALSE))","v":95},{"$f":"IF(VLOOKUP($C7,invullijst!$A$10:$M$177,7,FALSE)=\"\",\"\",VLOOKUP($C7,invullijst!$A$10:$M$177,7,FALSE))","v":95},{"$f":"IF(VLOOKUP($C7,invullijst!$A$10:$M$177,8,FALSE)=\"\",\"\",VLOOKUP($C7,invullijst!$A$10:$M$177,8,FALSE))","v":""},{"$f":"IF(VLOOKUP($C7,invullijst!$A$10:$M$177,9,FALSE)=\"\",\"\",VLOOKUP($C7,invullijst!$A$10:$M$177,9,FALSE))","v":95},{"$f":"IF(VLOOKUP($C7,invullijst!$A$10:$M$177,10,FALSE)=\"\",\"\",VLOOKUP($C7,invullijst!$A$10:$M$177,10,FALSE))","v":95},380,{"$f":"IF(VLOOKUP($C7,invullijst!$A$10:$M$177,11,FALSE)=\"\",\"\",VLOOKUP($C7,invullijst!$A$10:$M$177,11,FALSE))","v":48}]
[null,4,401,{"$f":"IF(VLOOKUP($C8,invullijst!$A$10:$M189,4,FALSE)=\"\",\"\",VLOOKUP($C8,invullijst!$A$10:$M189,4,FALSE))","v":"65+"},{"$f":"IF(VLOOKUP($C8,invullijst!$A$10:$M188,2,FALSE)=\"\",\"\",VLOOKUP($C8,invullijst!$A$10:$M188,2,FALSE))","v":"Frans van Beurden"},{"$f":"IF(VLOOKUP($C8,invullijst!$A$10:$M$177,3,FALSE)=\"\",\"\",VLOOKUP($C8,invullijst!$A$10:$M$177,3,FALSE))","v":"Haarsteeg"},{"$f":"IF(VLOOKUP($C8,invullijst!$A$10:$M$177,6,FALSE)=\"\",\"\",VLOOKUP($C8,invullijst!$A$10:$M$177,6,FALSE))","v":95},{"$f":"IF(VLOOKUP($C8,invullijst!$A$10:$M$177,7,FALSE)=\"\",\"\",VLOOKUP($C8,invullijst!$A$10:$M$177,7,FALSE))","v":97},{"$f":"IF(VLOOKUP($C8,invullijst!$A$10:$M$177,8,FALSE)=\"\",\"\",VLOOKUP($C8,invullijst!$A$10:$M$177,8,FALSE))","v":""},{"$f":"IF(VLOOKUP($C8,invullijst!$A$10:$M$177,9,FALSE)=\"\",\"\",VLOOKUP($C8,invullijst!$A$10:$M$177,9,FALSE))","v":94},{"$f":"IF(VLOOKUP($C8,invullijst!$A$10:$M$177,10,FALSE)=\"\",\"\",VLOOKUP($C8,invullijst!$A$10:$M$177,10,FALSE))","v":94},380,{"$f":"IF(VLOOKUP($C8,invullijst!$A$10:$M$177,11,FALSE)=\"\",\"\",VLOOKUP($C8,invullijst!$A$10:$M$177,11,FALSE))","v":46}]
[null,5,509,{"$f":"IF(VLOOKUP($C9,invullijst!$A$10:$M197,4,FALSE)=\"\",\"\",VLOOKUP($C9,invullijst!$A$10:$M197,4,FALSE))","v":"65+"},{"$f":"IF(VLOOKUP($C9,invullijst!$A$10:$M191,2,FALSE)=\"\",\"\",VLOOKUP($C9,invullijst!$A$10:$M191,2,FALSE))","v":"Adwan de Pinth"},{"$f":"IF(VLOOKUP($C9,invullijst!$A$10:$M$177,3,FALSE)=\"\",\"\",VLOOKUP($C9,invullijst!$A$10:$M$177,3,FALSE))","v":"Kaatsheuvel"},{"$f":"IF(VLOOKUP($C9,invullijst!$A$10:$M$177,6,FALSE)=\"\",\"\",VLOOKUP($C9,invullijst!$A$10:$M$177,6,FALSE))","v":95},{"$f":"IF(VLOOKUP($C9,invullijst!$A$10:$M$177,7,FALSE)=\"\",\"\",VLOOKUP($C9,invullijst!$A$10:$M$177,7,FALSE))","v":96},{"$f":"IF(VLOOKUP($C9,invullijst!$A$10:$M$177,8,FALSE)=\"\",\"\",VLOOKUP($C9,invullijst!$A$10:$M$177,8,FALSE))","v":95},{"$f":"IF(VLOOKUP($C9,invullijst!$A$10:$M$177,9,FALSE)=\"\",\"\",VLOOKUP($C9,invullijst!$A$10:$M$177,9,FALSE))","v":""},{"$f":"IF(VLOOKUP($C9,invullijst!$A$10:$M$177,10,FALSE)=\"\",\"\",VLOOKUP($C9,invullijst!$A$10:$M$177,10,FALSE))","v":92},378,{"$f":"IF(VLOOKUP($C9,invullijst!$A$10:$M$177,11,FALSE)=\"\",\"\",VLOOKUP($C9,invullijst!$A$10:$M$177,11,FALSE))","v":49}]
[null,6,307,{"$f":"IF(VLOOKUP($C10,invullijst!$A$10:$M192,4,FALSE)=\"\",\"\",VLOOKUP($C10,invullijst!$A$10:$M192,4,FALSE))","v":"65+"},{"$f":"IF(VLOOKUP($C10,invullijst!$A$10:$M192,2,FALSE)=\"\",\"\",VLOOKUP($C10,invullijst!$A$10:$M192,2,FALSE))","v":"Bert van Engelen"},{"$f":"IF(VLOOKUP($C10,invullijst!$A$10:$M$177,3,FALSE)=\"\",\"\",VLOOKUP($C10,invullijst!$A$10:$M$177,3,FALSE))","v":"Elshout"},{"$f":"IF(VLOOKUP($C10,invullijst!$A$10:$M$177,6,FALSE)=\"\",\"\",VLOOKUP($C10,invullijst!$A$10:$M$177,6,FALSE))","v":95},{"$f":"IF(VLOOKUP($C10,invullijst!$A$10:$M$177,7,FALSE)=\"\",\"\",VLOOKUP($C10,invullijst!$A$10:$M$177,7,FALSE))","v":""},{"$f":"IF(VLOOKUP($C10,invullijst!$A$10:$M$177,8,FALSE)=\"\",\"\",VLOOKUP($C10,invullijst!$A$10:$M$177,8,FALSE))","v":93},{"$f":"IF(VLOOKUP($C10,invullijst!$A$10:$M$177,9,FALSE)=\"\",\"\",VLOOKUP($C10,invullijst!$A$10:$M$177,9,FALSE))","v":93},{"$f":"IF(VLOOKUP($C10,invullijst!$A$10:$M$177,10,FALSE)=\"\",\"\",VLOOKUP($C10,invullijst!$A$10:$M$177,10,FALSE))","v":96},377,{"$f":"IF(VLOOKUP($C10,invullijst!$A$10:$M$177,11,FALSE)=\"\",\"\",VLOOKUP($C10,invullijst!$A$10:$M$177,11,FALSE))","v":45}]
[null,7,211,{"$f":"IF(VLOOKUP($C11,invullijst!$A$10:$M185,4,FALSE)=\"\",\"\",VLOOKUP($C11,invullijst!$A$10:$M185,4,FALSE))","v":"65+"},{"$f":"IF(VLOOKUP($C11,invullijst!$A$10:$M186,2,FALSE)=\"\",\"\",VLOOKUP($C11,invullijst!$A$10:$M186,2,FALSE))","v":"Ad van den houdt"},{"$f":"IF(VLOOKUP($C11,invullijst!$A$10:$M$177,3,FALSE)=\"\",\"\",VLOOKUP($C11,invullijst!$A$10:$M$177,3,FALSE))","v":"Besoijen"},{"$f":"IF(VLOOKUP($C11,invullijst!$A$10:$M$177,6,FALSE)=\"\",\"\",VLOOKUP($C11,invullijst!$A$10:$M$177,6,FALSE))","v":96},{"$f":"IF(VLOOKUP($C11,invullijst!$A$10:$M$177,7,FALSE)=\"\",\"\",VLOOKUP($C11,invullijst!$A$10:$M$177,7,FALSE))","v":88},{"$f":"IF(VLOOKUP($C11,invullijst!$A$10:$M$177,8,FALSE)=\"\",\"\",VLOOKUP($C11,invullijst!$A$10:$M$177,8,FALSE))","v":92},{"$f":"IF(VLOOKUP($C11,invullijst!$A$10:$M$177,9,FALSE)=\"\",\"\",VLOOKUP($C11,invullijst!$A$10:$M$177,9,FALSE))","v":90},{"$f":"IF(VLOOKUP($C11,invullijst!$A$10:$M$177,10,FALSE)=\"\",\"\",VLOOKUP($C11,invullijst!$A$10:$M$177,10,FALSE))","v":""},366,{"$f":"IF(VLOOKUP($C11,invullijst!$A$10:$M$177,11,FALSE)=\"\",\"\",VLOOKUP($C11,invullijst!$A$10:$M$177,11,FALSE))","v":41}]
[null,8,412,{"$f":"IF(VLOOKUP($C12,invullijst!$A$10:$M196,4,FALSE)=\"\",\"\",VLOOKUP($C12,invullijst!$A$10:$M196,4,FALSE))","v":"65+"},{"$f":"IF(VLOOKUP($C12,invullijst!$A$10:$M194,2,FALSE)=\"\",\"\",VLOOKUP($C12,invullijst!$A$10:$M194,2,FALSE))","v":"Francien v/d Wiel"},{"$f":"IF(VLOOKUP($C12,invullijst!$A$10:$M$177,3,FALSE)=\"\",\"\",VLOOKUP($C12,invullijst!$A$10:$M$177,3,FALSE))","v":"Haarsteeg"},{"$f":"IF(VLOOKUP($C12,invullijst!$A$10:$M$177,6,FALSE)=\"\",\"\",VLOOKUP($C12,invullijst!$A$10:$M$177,6,FALSE))","v":96},{"$f":"IF(VLOOKUP($C12,invullijst!$A$10:$M$177,7,FALSE)=\"\",\"\",VLOOKUP($C12,invullijst!$A$10:$M$177,7,FALSE))","v":87},{"$f":"IF(VLOOKUP($C12,invullijst!$A$10:$M$177,8,FALSE)=\"\",\"\",VLOOKUP($C12,invullijst!$A$10:$M$177,8,FALSE))","v":""},{"$f":"IF(VLOOKUP($C12,invullijst!$A$10:$M$177,9,FALSE)=\"\",\"\",VLOOKUP($C12,invullijst!$A$10:$M$177,9,FALSE))","v":92},{"$f":"IF(VLOOKUP($C12,invullijst!$A$10:$M$177,10,FALSE)=\"\",\"\",VLOOKUP($C12,invullijst!$A$10:$M$177,10,FALSE))","v":89},364,{"$f":"IF(VLOOKUP($C12,invullijst!$A$10:$M$177,11,FALSE)=\"\",\"\",VLOOKUP($C12,invullijst!$A$10:$M$177,11,FALSE))","v":47}]
[null,9,214,{"$f":"IF(VLOOKUP($C13,invullijst!$A$10:$M198,4,FALSE)=\"\",\"\",VLOOKUP($C13,invullijst!$A$10:$M198,4,FALSE))","v":"65+"},{"$f":"IF(VLOOKUP($C13,invullijst!$A$10:$M194,2,FALSE)=\"\",\"\",VLOOKUP($C13,invullijst!$A$10:$M194,2,FALSE))","v":"André de Vaan"},{"$f":"IF(VLOOKUP($C13,invullijst!$A$10:$M$177,3,FALSE)=\"\",\"\",VLOOKUP($C13,invullijst!$A$10:$M$177,3,FALSE))","v":"Besoijen"},{"$f":"IF(VLOOKUP($C13,invullijst!$A$10:$M$177,6,FALSE)=\"\",\"\",VLOOKUP($C13,invullijst!$A$10:$M$177,6,FALSE))","v":87},{"$f":"IF(VLOOKUP($C13,invullijst!$A$10:$M$177,7,FALSE)=\"\",\"\",VLOOKUP($C13,invullijst!$A$10:$M$177,7,FALSE))","v":89},{"$f":"IF(VLOOKUP($C13,invullijst!$A$10:$M$177,8,FALSE)=\"\",\"\",VLOOKUP($C13,invullijst!$A$10:$M$177,8,FALSE))","v":91},{"$f":"IF(VLOOKUP($C13,invullijst!$A$10:$M$177,9,FALSE)=\"\",\"\",VLOOKUP($C13,invullijst!$A$10:$M$177,9,FALSE))","v":96},{"$f":"IF(VLOOKUP($C13,invullijst!$A$10:$M$177,10,FALSE)=\"\",\"\",VLOOKUP($C13,invullijst!$A$10:$M$177,10,FALSE))","v":""},363,{"$f":"IF(VLOOKUP($C13,invullijst!$A$10:$M$177,11,FALSE)=\"\",\"\",VLOOKUP($C13,invullijst!$A$10:$M$177,11,FALSE))","v":45}]
[null,10,301,{"$f":"IF(VLOOKUP($C14,invullijst!$A$10:$M190,4,FALSE)=\"\",\"\",VLOOKUP($C14,invullijst!$A$10:$M190,4,FALSE))","v":"65+"},{"$f":"IF(VLOOKUP($C14,invullijst!$A$10:$M190,2,FALSE)=\"\",\"\",VLOOKUP($C14,invullijst!$A$10:$M190,2,FALSE))","v":"Arjen van Assem disp"},{"$f":"IF(VLOOKUP($C14,invullijst!$A$10:$M$177,3,FALSE)=\"\",\"\",VLOOKUP($C14,invullijst!$A$10:$M$177,3,FALSE))","v":"Elshout"},{"$f":"IF(VLOOKUP($C14,invullijst!$A$10:$M$177,6,FALSE)=\"\",\"\",VLOOKUP($C14,invullijst!$A$10:$M$177,6,FALSE))","v":91},{"$f":"IF(VLOOKUP($C14,invullijst!$A$10:$M$177,7,FALSE)=\"\",\"\",VLOOKUP($C14,invullijst!$A$10:$M$177,7,FALSE))","v":""},{"$f":"IF(VLOOKUP($C14,invullijst!$A$10:$M$177,8,FALSE)=\"\",\"\",VLOOKUP($C14,invullijst!$A$10:$M$177,8,FALSE))","v":93},{"$f":"IF(VLOOKUP($C14,invullijst!$A$10:$M$177,9,FALSE)=\"\",\"\",VLOOKUP($C14,invullijst!$A$10:$M$177,9,FALSE))","v":89},{"$f":"IF(VLOOKUP($C14,invullijst!$A$10:$M$177,10,FALSE)=\"\",\"\",VLOOKUP($C14,invullijst!$A$10:$M$177,10,FALSE))","v":89},362,{"$f":"IF(VLOOKUP($C14,invullijst!$A$10:$M$177,11,FALSE)=\"\",\"\",VLOOKUP($C14,invullijst!$A$10:$M$177,11,FALSE))","v":42}]
["B",1,309,{"$f":"IF(VLOOKUP($C15,invullijst!$A$10:$M187,4,FALSE)=\"\",\"\",VLOOKUP($C15,invullijst!$A$10:$M187,4,FALSE))","v":"65+"},{"$f":"IF(VLOOKUP($C15,invullijst!$A$10:$M177,2,FALSE)=\"\",\"\",VLOOKUP($C15,invullijst!$A$10:$M177,2,FALSE))","v":"René de Jong"},{"$f":"IF(VLOOKUP($C15,invullijst!$A$10:$M$177,3,FALSE)=\"\",\"\",VLOOKUP($C15,invullijst!$A$10:$M$177,3,FALSE))","v":"Elshout"},{"$f":"IF(VLOOKUP($C15,invullijst!$A$10:$M$177,6,FALSE)=\"\",\"\",VLOOKUP($C15,invullijst!$A$10:$M$177,6,FALSE))","v":88},{"$f":"IF(VLOOKUP($C15,invullijst!$A$10:$M$177,7,FALSE)=\"\",\"\",VLOOKUP($C15,invullijst!$A$10:$M$177,7,FALSE))","v":""},{"$f":"IF(VLOOKUP($C15,invullijst!$A$10:$M$177,8,FALSE)=\"\",\"\",VLOOKUP($C15,invullijst!$A$10:$M$177,8,FALSE))","v":94},{"$f":"IF(VLOOKUP($C15,invullijst!$A$10:$M$177,9,FALSE)=\"\",\"\",VLOOKUP($C15,invullijst!$A$10:$M$177,9,FALSE))","v":93},{"$f":"IF(VLOOKUP($C15,invullijst!$A$10:$M$177,10,FALSE)=\"\",\"\",VLOOKUP($C15,invullijst!$A$10:$M$177,10,FALSE))","v":84},359,{"$f":"IF(VLOOKUP($C15,invullijst!$A$10:$M$177,11,FALSE)=\"\",\"\",VLOOKUP($C15,invullijst!$A$10:$M$177,11,FALSE))","v":46}]
[null,2,212,{"$f":"IF(VLOOKUP($C16,invullijst!$A$10:$M178,4,FALSE)=\"\",\"\",VLOOKUP($C16,invullijst!$A$10:$M178,4,FALSE))","v":"65+"},{"$f":"IF(VLOOKUP($C16,invullijst!$A$10:$M179,2,FALSE)=\"\",\"\",VLOOKUP($C16,invullijst!$A$10:$M179,2,FALSE))","v":"René Duquesnoy"},{"$f":"IF(VLOOKUP($C16,invullijst!$A$10:$M$177,3,FALSE)=\"\",\"\",VLOOKUP($C16,invullijst!$A$10:$M$177,3,FALSE))","v":"Besoijen"},{"$f":"IF(VLOOKUP($C16,invullijst!$A$10:$M$177,6,FALSE)=\"\",\"\",VLOOKUP($C16,invullijst!$A$10:$M$177,6,FALSE))","v":90},{"$f":"IF(VLOOKUP($C16,invullijst!$A$10:$M$177,7,FALSE)=\"\",\"\",VLOOKUP($C16,invullijst!$A$10:$M$177,7,FALSE))","v":87},{"$f":"IF(VLOOKUP($C16,invullijst!$A$10:$M$177,8,FALSE)=\"\",\"\",VLOOKUP($C16,invullijst!$A$10:$M$177,8,FALSE))","v":92},{"$f":"IF(VLOOKUP($C16,invullijst!$A$10:$M$177,9,FALSE)=\"\",\"\",VLOOKUP($C16,invullijst!$A$10:$M$177,9,FALSE))","v":87},{"$f":"IF(VLOOKUP($C16,invullijst!$A$10:$M$177,10,FALSE)=\"\",\"\",VLOOKUP($C16,invullijst!$A$10:$M$177,10,FALSE))","v":""},356,{"$f":"IF(VLOOKUP($C16,invullijst!$A$10:$M$177,11,FALSE)=\"\",\"\",VLOOKUP($C16,invullijst!$A$10:$M$177,11,FALSE))","v":45}]
[null,3,516,{"$f":"IF(VLOOKUP($C17,invullijst!$A$10:$M183,4,FALSE)=\"\",\"\",VLOOKUP($C17,invullijst!$A$10:$M183,4,FALSE))","v":"65+"},{"$f":"IF(VLOOKUP($C17,invullijst!$A$10:$M183,2,FALSE)=\"\",\"\",VLOOKUP($C17,invullijst!$A$10:$M183,2,FALSE))","v":"Henry Bergakker disp"},{"$f":"IF(VLOOKUP($C17,invullijst!$A$10:$M$177,3,FALSE)=\"\",\"\",VLOOKUP($C17,invullijst!$A$10:$M$177,3,FALSE))","v":"Kaatsheuvel"},{"$f":"IF(VLOOKUP($C17,invullijst!$A$10:$M$177,6,FALSE)=\"\",\"\",VLOOKUP($C17,invullijst!$A$10:$M$177,6,FALSE))","v":80},{"$f":"IF(VLOOKUP($C17,invullijst!$A$10:$M$177,7,FALSE)=\"\",\"\",VLOOKUP($C17,invullijst!$A$10:$M$177,7,FALSE))","v":88},{"$f":"IF(VLOOKUP($C17,invullijst!$A$10:$M$177,8,FALSE)=\"\",\"\",VLOOKUP($C17,invullijst!$A$10:$M$177,8,FALSE))","v":88},{"$f":"IF(VLOOKUP($C17,invullijst!$A$10:$M$177,9,FALSE)=\"\",\"\",VLOOKUP($C17,invullijst!$A$10:$M$177,9,FALSE))","v":""},{"$f":"IF(VLOOKUP($C17,invullijst!$A$10:$M$177,10,FALSE)=\"\",\"\",VLOOKUP($C17,invullijst!$A$10:$M$177,10,FALSE))","v":93},349,{"$f":"IF(VLOOKUP($C17,invullijst!$A$10:$M$177,11,FALSE)=\"\",\"\",VLOOKUP($C17,invullijst!$A$10:$M$177,11,FALSE))","v":44}]
[null,4,511,{"$f":"IF(VLOOKUP($C18,invullijst!$A$10:$M179,4,FALSE)=\"\",\"\",VLOOKUP($C18,invullijst!$A$10:$M179,4,FALSE))","v":"65+"},{"$f":"IF(VLOOKUP($C18,invullijst!$A$10:$M180,2,FALSE)=\"\",\"\",VLOOKUP($C18,invullijst!$A$10:$M180,2,FALSE))","v":"Ton Stans"},{"$f":"IF(VLOOKUP($C18,invullijst!$A$10:$M$177,3,FALSE)=\"\",\"\",VLOOKUP($C18,invullijst!$A$10:$M$177,3,FALSE))","v":"Kaatsheuvel"},{"$f":"IF(VLOOKUP($C18,invullijst!$A$10:$M$177,6,FALSE)=\"\",\"\",VLOOKUP($C18,invullijst!$A$10:$M$177,6,FALSE))","v":85},{"$f":"IF(VLOOKUP($C18,invullijst!$A$10:$M$177,7,FALSE)=\"\",\"\",VLOOKUP($C18,invullijst!$A$10:$M$177,7,FALSE))","v":83},{"$f":"IF(VLOOKUP($C18,invullijst!$A$10:$M$177,8,FALSE)=\"\",\"\",VLOOKUP($C18,invullijst!$A$10:$M$177,8,FALSE))","v":82},{"$f":"IF(VLOOKUP($C18,invullijst!$A$10:$M$177,9,FALSE)=\"\",\"\",VLOOKUP($C18,invullijst!$A$10:$M$177,9,FALSE))","v":""},{"$f":"IF(VLOOKUP($C18,invullijst!$A$10:$M$177,10,FALSE)=\"\",\"\",VLOOKUP($C18,invullijst!$A$10:$M$177,10,FALSE))","v":84},334,{"$f":"IF(VLOOKUP($C18,invullijst!$A$10:$M$177,11,FALSE)=\"\",\"\",VLOOKUP($C18,invullijst!$A$10:$M$177,11,FALSE))","v":38}]
[null,5,113,{"$f":"IF(VLOOKUP($C19,invullijst!$A$10:$M195,4,FALSE)=\"\",\"\",VLOOKUP($C19,invullijst!$A$10:$M195,4,FALSE))","v":"65+"},{"$f":"IF(VLOOKUP($C19,invullijst!$A$10:$M189,2,FALSE)=\"\",\"\",VLOOKUP($C19,invullijst!$A$10:$M189,2,FALSE))","v":"Kees Coppens"},{"$f":"IF(VLOOKUP($C19,invullijst!$A$10:$M$177,3,FALSE)=\"\",\"\",VLOOKUP($C19,invullijst!$A$10:$M$177,3,FALSE))","v":"Baardwijk"},{"$f":"IF(VLOOKUP($C19,invullijst!$A$10:$M$177,6,FALSE)=\"\",\"\",VLOOKUP($C19,invullijst!$A$10:$M$177,6,FALSE))","v":""},{"$f":"IF(VLOOKUP($C19,invullijst!$A$10:$M$177,7,FALSE)=\"\",\"\",VLOOKUP($C19,invullijst!$A$10:$M$177,7,FALSE))","v":84},{"$f":"IF(VLOOKUP($C19,invullijst!$A$10:$M$177,8,FALSE)=\"\",\"\",VLOOKUP($C19,invullijst!$A$10:$M$177,8,FALSE))","v":88},{"$f":"IF(VLOOKUP($C19,invullijst!$A$10:$M$177,9,FALSE)=\"\",\"\",VLOOKUP($C19,invullijst!$A$10:$M$177,9,FALSE))","v":68},{"$f":"IF(VLOOKUP($C19,invullijst!$A$10:$M$177,10,FALSE)=\"\",\"\",VLOOKUP($C19,invullijst!$A$10:$M$177,10,FALSE))","v":85},325,{"$f":"IF(VLOOKUP($C19,invullijst!$A$10:$M$177,11,FALSE)=\"\",\"\",VLOOKUP($C19,invullijst!$A$10:$M$177,11,FALSE))","v":36}]
[null,6,111,{"$f":"IF(VLOOKUP($C20,invullijst!$A$10:$M194,4,FALSE)=\"\",\"\",VLOOKUP($C20,invullijst!$A$10:$M194,4,FALSE))","v":"65+"},{"$f":"IF(VLOOKUP($C20,invullijst!$A$10:$M193,2,FALSE)=\"\",\"\",VLOOKUP($C20,invullijst!$A$10:$M193,2,FALSE))","v":"Frans van Buul"},{"$f":"IF(VLOOKUP($C20,invullijst!$A$10:$M$177,3,FALSE)=\"\",\"\",VLOOKUP($C20,invullijst!$A$10:$M$177,3,FALSE))","v":"Baardwijk"},{"$f":"IF(VLOOKUP($C20,invullijst!$A$10:$M$177,6,FALSE)=\"\",\"\",VLOOKUP($C20,invullijst!$A$10:$M$177,6,FALSE))","v":""},{"$f":"IF(VLOOKUP($C20,invullijst!$A$10:$M$177,7,FALSE)=\"\",\"\",VLOOKUP($C20,invullijst!$A$10:$M$177,7,FALSE))","v":83},{"$f":"IF(VLOOKUP($C20,invullijst!$A$10:$M$177,8,FALSE)=\"\",\"\",VLOOKUP($C20,invullijst!$A$10:$M$177,8,FALSE))","v":81},{"$f":"IF(VLOOKUP($C20,invullijst!$A$10:$M$177,9,FALSE)=\"\",\"\",VLOOKUP($C20,invullijst!$A$10:$M$177,9,FALSE))","v":66},{"$f":"IF(VLOOKUP($C20,invullijst!$A$10:$M$177,10,FALSE)=\"\",\"\",VLOOKUP($C20,invullijst!$A$10:$M$177,10,FALSE))","v":78},308,{"$f":"IF(VLOOKUP($C20,invullijst!$A$10:$M$177,11,FALSE)=\"\",\"\",VLOOKUP($C20,invullijst!$A$10:$M$177,11,FALSE))","v":40}]
[null,7,515,{"$f":"IF(VLOOKUP($C21,invullijst!$A$10:$M193,4,FALSE)=\"\",\"\",VLOOKUP($C21,invullijst!$A$10:$M193,4,FALSE))","v":"65+"},{"$f":"IF(VLOOKUP($C21,invullijst!$A$10:$M187,2,FALSE)=\"\",\"\",VLOOKUP($C21,invullijst!$A$10:$M187,2,FALSE))","v":"Ilona Bergakker disp"},{"$f":"IF(VLOOKUP($C21,invullijst!$A$10:$M$177,3,FALSE)=\"\",\"\",VLOOKUP($C21,invullijst!$A$10:$M$177,3,FALSE))","v":"Kaatsheuvel"},{"$f":"IF(VLOOKUP($C21,invullijst!$A$10:$M$177,6,FALSE)=\"\",\"\",VLOOKUP($C21,invullijst!$A$10:$M$177,6,FALSE))","v":92},{"$f":"IF(VLOOKUP($C21,invullijst!$A$10:$M$177,7,FALSE)=\"\",\"\",VLOOKUP($C21,invullijst!$A$10:$M$177,7,FALSE))","v":93},{"$f":"IF(VLOOKUP($C21,invullijst!$A$10:$M$177,8,FALSE)=\"\",\"\",VLOOKUP($C21,invullijst!$A$10:$M$177,8,FALSE))","v":89},{"$f":"IF(VLOOKUP($C21,invullijst!$A$10:$M$177,9,FALSE)=\"\",\"\",VLOOKUP($C21,invullijst!$A$10:$M$177,9,FALSE))","v":""},{"$f":"IF(VLOOKUP($C21,invullijst!$A$10:$M$177,10,FALSE)=\"\",\"\",VLOOKUP($C21,invullijst!$A$10:$M$177,10,FALSE))","v":""},274,{"$f":"IF(VLOOKUP($C21,invullijst!$A$10:$M$177,11,FALSE)=\"\",\"\",VLOOKUP($C21,invullijst!$A$10:$M$177,11,FALSE))","v":46}]
[null,8,403,{"$f":"IF(VLOOKUP($C22,invullijst!$A$10:$M182,4,FALSE)=\"\",\"\",VLOOKUP($C22,invullijst!$A$10:$M182,4,FALSE))","v":"65+"},{"$f":"IF(VLOOKUP($C22,invullijst!$A$10:$M193,2,FALSE)=\"\",\"\",VLOOKUP($C22,invullijst!$A$10:$M193,2,FALSE))","v":"Dorien de Kort"},{"$f":"IF(VLOOKUP($C22,invullijst!$A$10:$M$177,3,FALSE)=\"\",\"\",VLOOKUP($C22,invullijst!$A$10:$M$177,3,FALSE))","v":"Haarsteeg"},{"$f":"IF(VLOOKUP($C22,invullijst!$A$10:$M$177,6,FALSE)=\"\",\"\",VLOOKUP($C22,invullijst!$A$10:$M$177,6,FALSE))","v":92},{"$f":"IF(VLOOKUP($C22,invullijst!$A$10:$M$177,7,FALSE)=\"\",\"\",VLOOKUP($C22,invullijst!$A$10:$M$177,7,FALSE))","v":""},{"$f":"IF(VLOOKUP($C22,invullijst!$A$10:$M$177,8,FALSE)=\"\",\"\",VLOOKUP($C22,invullijst!$A$10:$M$177,8,FALSE))","v":""},{"$f":"IF(VLOOKUP($C22,invullijst!$A$10:$M$177,9,FALSE)=\"\",\"\",VLOOKUP($C22,invullijst!$A$10:$M$177,9,FALSE))","v":94},{"$f":"IF(VLOOKUP($C22,invullijst!$A$10:$M$177,10,FALSE)=\"\",\"\",VLOOKUP($C22,invullijst!$A$10:$M$177,10,FALSE))","v":87},273,{"$f":"IF(VLOOKUP($C22,invullijst!$A$10:$M$177,11,FALSE)=\"\",\"\",VLOOKUP($C22,invullijst!$A$10:$M$177,11,FALSE))","v":46}]
[null,9,514,{"$f":"IF(VLOOKUP($C23,invullijst!$A$10:$M191,4,FALSE)=\"\",\"\",VLOOKUP($C23,invullijst!$A$10:$M191,4,FALSE))","v":"65+"},{"$f":"IF(VLOOKUP($C23,invullijst!$A$10:$M192,2,FALSE)=\"\",\"\",VLOOKUP($C23,invullijst!$A$10:$M192,2,FALSE))","v":"Toon Ophorst"},{"$f":"IF(VLOOKUP($C23,invullijst!$A$10:$M$177,3,FALSE)=\"\",\"\",VLOOKUP($C23,invullijst!$A$10:$M$177,3,FALSE))","v":"Kaatsheuvel"},{"$f":"IF(VLOOKUP($C23,invullijst!$A$10:$M$177,6,FALSE)=\"\",\"\",VLOOKUP($C23,invullijst!$A$10:$M$177,6,FALSE))","v":49},{"$f":"IF(VLOOKUP($C23,invullijst!$A$10:$M$177,7,FALSE)=\"\",\"\",VLOOKUP($C23,invullijst!$A$10:$M$177,7,FALSE))","v":67},{"$f":"IF(VLOOKUP($C23,invullijst!$A$10:$M$177,8,FALSE)=\"\",\"\",VLOOKUP($C23,invullijst!$A$10:$M$177,8,FALSE))","v":75},{"$f":"IF(VLOOKUP($C23,invullijst!$A$10:$M$177,9,FALSE)=\"\",\"\",VLOOKUP($C23,invullijst!$A$10:$M$177,9,FALSE))","v":""},{"$f":"IF(VLOOKUP($C23,invullijst!$A$10:$M$177,10,FALSE)=\"\",\"\",VLOOKUP($C23,invullijst!$A$10:$M$177,10,FALSE))","v":63},254,{"$f":"IF(VLOOKUP($C23,invullijst!$A$10:$M$177,11,FALSE)=\"\",\"\",VLOOKUP($C23,invullijst!$A$10:$M$177,11,FALSE))","v":18}]
[null,10,505,{"$f":"IF(VLOOKUP($C24,invullijst!$A$10:$M180,4,FALSE)=\"\",\"\",VLOOKUP($C24,invullijst!$A$10:$M180,4,FALSE))","v":"65+"},{"$f":"IF(VLOOKUP($C24,invullijst!$A$10:$M182,2,FALSE)=\"\",\"\",VLOOKUP($C24,invullijst!$A$10:$M182,2,FALSE))","v":"Leo Wagemakers"},{"$f":"IF(VLOOKUP($C24,invullijst!$A$10:$M$177,3,FALSE)=\"\",\"\",VLOOKUP($C24,invullijst!$A$10:$M$177,3,FALSE))","v":"Kaatsheuvel"},{"$f":"IF(VLOOKUP($C24,invullijst!$A$10:$M$177,6,FALSE)=\"\",\"\",VLOOKUP($C24,invullijst!$A$10:$M$177,6,FALSE))","v":58},{"$f":"IF(VLOOKUP($C24,invullijst!$A$10:$M$177,7,FALSE)=\"\",\"\",VLOOKUP($C24,invullijst!$A$10:$M$177,7,FALSE))","v":69},{"$f":"IF(VLOOKUP($C24,invullijst!$A$10:$M$177,8,FALSE)=\"\",\"\",VLOOKUP($C24,invullijst!$A$10:$M$177,8,FALSE))","v":58},{"$f":"IF(VLOOKUP($C24,invullijst!$A$10:$M$177,9,FALSE)=\"\",\"\",VLOOKUP($C24,invullijst!$A$10:$M$177,9,FALSE))","v":""},{"$f":"IF(VLOOKUP($C24,invullijst!$A$10:$M$177,10,FALSE)=\"\",\"\",VLOOKUP($C24,invullijst!$A$10:$M$177,10,FALSE))","v":10},195,{"$f":"IF(VLOOKUP($C24,invullijst!$A$10:$M$177,11,FALSE)=\"\",\"\",VLOOKUP($C24,invullijst!$A$10:$M$177,11,FALSE))","v":36}]
[{"$nulls":3},{"$f":"IF(VLOOKUP($C25,invullijst!$A$10:$M199,4,FALSE)=\"\",\"\",VLOOKUP($C25,invullijst!$A$10:$M199,4,FALSE))","v":0},{"$f":"IF(VLOOKUP($C25,invullijst!$A$10:$M195,2,FALSE)=\"\",\"\",VLOOKUP($C25,invullijst!$A$10:$M195,2,FALSE))","v":0},{"$f":"IF(VLOOKUP($C25,invullijst!$A$10:$M$177,3,FALSE)=\"\",\"\",VLOOKUP($C25,invullijst!$A$10:$M$177,3,FALSE))","v":0},{"$f":"IF(VLOOKUP($C25,invullijst!$A$10:$M$177,6,FALSE)=\"\",\"\",VLOOKUP($C25,invullijst!$A$10:$M$177,6,FALSE))","v":0},{"$f":"IF(VLOOKUP($C25,invullijst!$A$10:$M$177,7,FALSE)=\"\",\"\",VLOOKUP($C25,invullijst!$A$10:$M$177,7,FALSE))","v":0},{"$f":"IF(VLOOKUP($C25,invullijst!$A$10:$M$177,8,FALSE)=\"\",\"\",VLOOKUP($C25,invullijst!$A$10:$M$177,8,FALSE))","v":0},{"$f":"IF(VLOOKUP($C25,invullijst!$A$10:$M$177,9,FALSE)=\"\",\"\",VLOOKUP($C25,invullijst!$A$10:$M$177,9,FALSE))","v":0},{"$f":"IF(VLOOKUP($C25,invullijst!$A$10:$M$177,10,FALSE)=\"\",\"\",VLOOKUP($C25,invullijst!$A$10:$M$177,10,FALSE))","v":0},0,{"$f":"IF(VLOOKUP($C25,invullijst!$A$10:$M$177,11,FALSE)=\"\",\"\",VLOOKUP($C25,invullijst!$A$10:$M$177,11,FALSE))","v":0}]
[{"$nulls":3},{"$f":"IF(VLOOKUP($C26,invullijst!$A$10:$M200,4,FALSE)=\"\",\"\",VLOOKUP($C26,invullijst!$A$10:$M200,4,FALSE))","v":0},{"$f":"IF(VLOOKUP($C26,invullijst!$A$10:$M196,2,FALSE)=\"\",\"\",VLOOKUP($C26,invullijst!$A$10:$M196,2,FALSE))","v":0},{"$f":"IF(VLOOKUP($C26,invullijst!$A$10:$M$177,3,FALSE)=\"\",\"\",VLOOKUP($C26,invullijst!$A$10:$M$177,3,FALSE))","v":0},{"$f":"IF(VLOOKUP($C26,invullijst!$A$10:$M$177,6,FALSE)=\"\",\"\",VLOOKUP($C26,invullijst!$A$10:$M$177,6,FALSE))","v":0},{"$f":"IF(VLOOKUP($C26,invullijst!$A$10:$M$177,7,FALSE)=\"\",\"\",VLOOKUP($C26,invullijst!$A$10:$M$177,7,FALSE))","v":0},{"$f":"IF(VLOOKUP($C26,invullijst!$A$10:$M$177,8,FALSE)=\"\",\"\",VLOOKUP($C26,invullijst!$A$10:$M$177,8,FALSE))","v":0},{"$f":"IF(VLOOKUP($C26,invullijst!$A$10:$M$177,9,FALSE)=\"\",\"\",VLOOKUP($C26,invullijst!$A$10:$M$177,9,FALSE))","v":0},{"$f":"IF(VLOOKUP($C26,invullijst!$A$10:$M$177,10,FALSE)=\"\",\"\",VLOOKUP($C26,invullijst!$A$10:$M$177,10,FALSE))","v":0},0,{"$f":"IF(VLOOKUP($C26,invullijst!$A$10:$M$177,11,FALSE)=\"\",\"\",VLOOKUP($C26,invullijst!$A$10:$M$177,11,FALSE))","v":0}]
[{"$nulls":3},{"$f":"IF(VLOOKUP($C27,invullijst!$A$10:$M201,4,FALSE)=\"\",\"\",VLOOKUP($C27,invullijst!$A$10:$M201,4,FALSE))","v":0},{"$f":"IF(VLOOKUP($C27,invullijst!$A$10:$M197,2,FALSE)=\"\",\"\",VLOOKUP($C27,invullijst!$A$10:$M197,2,FALSE))","v":0},{"$f":"IF(VLOOKUP($C27,invullijst!$A$10:$M$177,3,FALSE)=\"\",\"\",VLOOKUP($C27,invullijst!$A$10:$M$177,3,FALSE))","v":0},{"$f":"IF(VLOOKUP($C27,invullijst!$A$10:$M$177,6,FALSE)=\"\",\"\",VLOOKUP($C27,invullijst!$A$10:$M$177,6,FALSE))","v":0},{"$f":"IF(VLOOKUP($C27,invullijst!$A$10:$M$177,7,FALSE)=\"\",\"\",VLOOKUP($C27,invullijst!$A$10:$M$177,7,FALSE))","v":0},{"$f":"IF(VLOOKUP($C27,invullijst!$A$10:$M$177,8,FALSE)=\"\",\"\",VLOOKUP($C27,invullijst!$A$10:$M$177,8,FALSE))","v":0},{"$f":"IF(VLOOKUP($C27,invullijst!$A$10:$M$177,9,FALSE)=\"\",\"\",VLOOKUP($C27,invullijst!$A$10:$M$177,9,FALSE))","v":0},{"$f":"IF(VLOOKUP($C27,invullijst!$A$10:$M$177,10,FALSE)=\"\",\"\",VLOOKUP($C27,invullijst!$A$10:$M$177,10,FALSE))","v":0},0,{"$f":"IF(VLOOKUP($C27,invullijst!$A$10:$M$177,11,FALSE)=\"\",\"\",VLOOKUP($C27,invullijst!$A$10:$M$177,11,FALSE))","v":0}]
[{"$nulls":3},{"$f":"IF(VLOOKUP($C28,invullijst!$A$10:$M202,4,FALSE)=\"\",\"\",VLOOKUP($C28,invullijst!$A$10:$M202,4,FALSE))","v":0},{"$f":"IF(VLOOKUP($C28,invullijst!$A$10:$M198,2,FALSE)=\"\",\"\",VLOOKUP($C28,invullijst!$A$10:$M198,2,FALSE))","v":0},{"$f":"IF(VLOOKUP($C28,invullijst!$A$10:$M$177,3,FALSE)=\"\",\"\",VLOOKUP($C28,invullijst!$A$10:$M$177,3,FALSE))","v":0},{"$f":"IF(VLOOKUP($C28,invullijst!$A$10:$M$177,6,FALSE)=\"\",\"\",VLOOKUP($C28,invullijst!$A$10:$M$177,6,FALSE))","v":0},{"$f":"IF(VLOOKUP($C28,invullijst!$A$10:$M$177,7,FALSE)=\"\",\"\",VLOOKUP($C28,invullijst!$A$10:$M$177,7,FALSE))","v":0},{"$f":"IF(VLOOKUP($C28,invullijst!$A$10:$M$177,8,FALSE)=\"\",\"\",VLOOKUP($C28,invullijst!$A$10:$M$177,8,FALSE))","v":0},{"$f":"IF(VLOOKUP($C28,invullijst!$A$10:$M$177,9,FALSE)=\"\",\"\",VLOOKUP($C28,invullijst!$A$10:$M$177,9,FALSE))","v":0},{"$f":"IF(VLOOKUP($C28,invullijst!$A$10:$M$177,10,FALSE)=\"\",\"\",VLOOKUP($C28,invullijst!$A$10:$M$177,10,FALSE))","v":0},0,{"$f":"IF(VLOOKUP($C28,invullijst!$A$10:$M$177,11,FALSE)=\"\",\"\",VLOOKUP($C28,invullijst!$A$10:$M$177,11,FALSE))","v":0}]
[{"$nulls":3},{"$f":"IF(VLOOKUP($C29,invullijst!$A$10:$M203,4,FALSE)=\"\",\"\",VLOOKUP($C29,invullijst!$A$10:$M203,4,FALSE))","v":0},{"$f":"IF(VLOOKUP($C29,invullijst!$A$10:$M199,2,FALSE)=\"\",\"\",VLOOKUP($C29,invullijst!$A$10:$M199,2,FALSE))","v":0},{"$f":"IF(VLOOKUP($C29,invullijst!$A$10:$M$177,3,FALSE)=\"\",\"\",VLOOKUP($C29,invullijst!$A$10:$M$177,3,FALSE))","v":0},{"$f":"IF(VLOOKUP($C29,invullijst!$A$10:$M$177,6,FALSE)=\"\",\"\",VLOOKUP($C29,invullijst!$A$10:$M$177,6,FALSE))","v":0},{"$f":"IF(VLOOKUP($C29,invullijst!$A$10:$M$177,7,FALSE)=\"\",\"\",VLOOKUP($C29,invullijst!$A$10:$M$177,7,FALSE))","v":0},{"$f":"IF(VLOOKUP($C29,invullijst!$A$10:$M$177,8,FALSE)=\"\",\"\",VLOOKUP($C29,invullijst!$A$10:$M$177,8,FALSE))","v":0},{"$f":"IF(VLOOKUP($C29,invullijst!$A$10:$M$177,9,FALSE)=\"\",\"\",VLOOKUP($C29,invullijst!$A$10:$M$177,9,FALSE))","v":0},{"$f":"IF(VLOOKUP($C29,invullijst!$A$10:$M$177,10,FALSE)=\"\",\"\",VLOOKUP($C29,invullijst!$A$10:$M$177,10,FALSE))","v":0},0,{"$f":"IF(VLOOKUP($C29,invullijst!$A$10:$M$177,11,FALSE)=\"\",\"\",VLOOKUP($C29,invullijst!$A$10:$M$177,11,FALSE))","v":0}]
[{"$nulls":3},{"$f":"IF(VLOOKUP($C30,invullijst!$A$10:$M204,4,FALSE)=\"\",\"\",VLOOKUP($C30,invullijst!$A$10:$M204,4,FALSE))","v":0},{"$f":"IF(VLOOKUP($C30,invullijst!$A$10:$M200,2,FALSE)=\"\",\"\",VLOOKUP($C30,invullijst!$A$10:$M200,2,FALSE))","v":0},{"$f":"IF(VLOOKUP($C30,invullijst!$A$10:$M$177,3,FALSE)=\"\",\"\",VLOOKUP($C30,invullijst!$A$10:$M$177,3,FALSE))","v":0},{"$f":"IF(VLOOKUP($C30,invullijst!$A$10:$M$177,6,FALSE)=\"\",\"\",VLOOKUP($C30,invullijst!$A$10:$M$177,6,FALSE))","v":0},{"$f":"IF(VLOOKUP($C30,invullijst!$A$10:$M$177,7,FALSE)=\"\",\"\",VLOOKUP($C30,invullijst!$A$10:$M$177,7,FALSE))","v":0},{"$f":"IF(VLOOKUP($C30,invullijst!$A$10:$M$177,8,FALSE)=\"\",\"\",VLOOKUP($C30,invullijst!$A$10:$M$177,8,FALSE))","v":0},{"$f":"IF(VLOOKUP($C30,invullijst!$A$10:$M$177,9,FALSE)=\"\",\"\",VLOOKUP($C30,invullijst!$A$10:$M$177,9,FALSE))","v":0},{"$f":"IF(VLOOKUP($C30,invullijst!$A$10:$M$177,10,FALSE)=\"\",\"\",VLOOKUP($C30,invullijst!$A$10:$M$177,10,FALSE))","v":0},0,{"$f":"IF(VLOOKUP($C30,invullijst!$A$10:$M$177,11,FALSE)=\"\",\"\",VLOOKUP($C30,invullijst!$A$10:$M$177,11,FALSE))","v":0}]
[{"$nulls":3},{"$f":"IF(VLOOKUP($C31,invullijst!$A$10:$M205,4,FALSE)=\"\",\"\",VLOOKUP($C31,invullijst!$A$10:$M205,4,FALSE))","v":0},{"$f":"IF(VLOOKUP($C31,invullijst!$A$10:$M201,2,FALSE)=\"\",\"\",VLOOKUP($C31,invullijst!$A$10:$M201,2,FALSE))","v":0},{"$f":"IF(VLOOKUP($C31,invullijst!$A$10:$M$177,3,FALSE)=\"\",\"\",VLOOKUP($C31,invullijst!$A$10:$M$177,3,FALSE))","v":0},{"$f":"IF(VLOOKUP($C31,invullijst!$A$10:$M$177,6,FALSE)=\"\",\"\",VLOOKUP($C31,invullijst!$A$10:$M$177,6,FALSE))","v":0},{"$f":"IF(VLOOKUP($C31,invullijst!$A$10:$M$177,7,FALSE)=\"\",\"\",VLOOKUP($C31,invullijst!$A$10:$M$177,7,FALSE))","v":0},{"$f":"IF(VLOOKUP($C31,invullijst!$A$10:$M$177,8,FALSE)=\"\",\"\",VLOOKUP($C31,invullijst!$A$10:$M$177,8,FALSE))","v":0},{"$f":"IF(VLOOKUP($C31,invullijst!$A$10:$M$177,9,FALSE)=\"\",\"\",VLOOKUP($C31,invullijst!$A$10:$M$177,9,FALSE))","v":0},{"$f":"IF(VLOOKUP($C31,invullijst!$A$10:$M$177,10,FALSE)=\"\",\"\",VLOOKUP($C31,invullijst!$A$10:$M$177,10,FALSE))","v":0},0,{"$f":"IF(VLOOKUP($C31,invullijst!$A$10:$M$177,11,FALSE)=\"\",\"\",VLOOKUP($C31,invullijst!$A$10:$M$177,11,FALSE))","v":0}]
[{"$nulls":3},{"$f":"IF(VLOOKUP($C32,invullijst!$A$10:$M206,4,FALSE)=\"\",\"\",VLOOKUP($C32,invullijst!$A$10:$M206,4,FALSE))","v":0},{"$f":"IF(VLOOKUP($C32,invullijst!$A$10:$M202,2,FALSE)=\"\",\"\",VLOOKUP($C32,invullijst!$A$10:$M202,2,FALSE))","v":0},{"$f":"IF(VLOOKUP($C32,invullijst!$A$10:$M$177,3,FALSE)=\"\",\"\",VLOOKUP($C32,invullijst!$A$10:$M$177,3,FALSE))","v":0},{"$f":"IF(VLOOKUP($C32,invullijst!$A$10:$M$177,6,FALSE)=\"\",\"\",VLOOKUP($C32,invullijst!$A$10:$M$177,6,FALSE))","v":0},{"$f":"IF(VLOOKUP($C32,invullijst!$A$10:$M$177,7,FALSE)=\"\",\"\",VLOOKUP($C32,invullijst!$A$10:$M$177,7,FALSE))","v":0},{"$f":"IF(VLOOKUP($C32,invullijst!$A$10:$M$177,8,FALSE)=\"\",\"\",VLOOKUP($C32,invullijst!$A$10:$M$177,8,FALSE))","v":0},{"$f":"IF(VLOOKUP($C32,invullijst!$A$10:$M$177,9,FALSE)=\"\",\"\",VLOOKUP($C32,invullijst!$A$10:$M$177,9,FALSE))","v":0},{"$f":"IF(VLOOKUP($C32,invullijst!$A$10:$M$177,10,FALSE)=\"\",\"\",VLOOKUP($C32,invullijst!$A$10:$M$177,10,FALSE))","v":0},0,{"$f":"IF(VLOOKUP($C32,invullijst!$A$10:$M$177,11,FALSE)=\"\",\"\",VLOOKUP($C32,invullijst!$A$10:$M$177,11,FALSE))","v":0}]
[{"$nulls":3},{"$f":"IF(VLOOKUP($C33,invullijst!$A$10:$M207,4,FALSE)=\"\",\"\",VLOOKUP($C33,invullijst!$A$10:$M207,4,FALSE))","v":0},{"$f":"IF(VLOOKUP($C33,invullijst!$A$10:$M203,2,FALSE)=\"\",\"\",VLOOKUP($C33,invullijst!$A$10:$M203,2,FALSE))","v":0},{"$f":"IF(VLOOKUP($C33,invullijst!$A$10:$M$177,3,FALSE)=\"\",\"\",VLOOKUP($C33,invullijst!$A$10:$M$177,3,FALSE))","v":0},{"$f":"IF(VLOOKUP($C33,invullijst!$A$10:$M$177,6,FALSE)=\"\",\"\",VLOOKUP($C33,invullijst!$A$10:$M$177,6,FALSE))","v":0},{"$f":"IF(VLOOKUP($C33,invullijst!$A$10:$M$177,7,FALSE)=\"\",\"\",VLOOKUP($C33,invullijst!$A$10:$M$177,7,FALSE))","v":0},{"$f":"IF(VLOOKUP($C33,invullijst!$A$10:$M$177,8,FALSE)=\"\",\"\",VLOOKUP($C33,invullijst!$A$10:$M$177,8,FALSE))","v":0},{"$f":"IF(VLOOKUP($C33,invullijst!$A$10:$M$177,9,FALSE)=\"\",\"\",VLOOKUP($C33,invullijst!$A$10:$M$177,9,FALSE))","v":0},{"$f":"IF(VLOOKUP($C33,invullijst!$A$10:$M$177,10,FALSE)=\"\",\"\",VLOOKUP($C33,invullijst!$A$10:$M$177,10,FALSE))","v":0},0,{"$f":"IF(VLOOKUP($C33,invullijst!$A$10:$M$177,11,FALSE)=\"\",\"\",VLOOKUP($C33,invullijst!$A$10:$M$177,11,FALSE))","v":0}]
[{"$nulls":3},{"$f":"IF(VLOOKUP($C34,invullijst!$A$10:$M184,4,FALSE)=\"\",\"\",VLOOKUP($C34,invullijst!$A$10:$M184,4,FALSE))","v":0},{"$f":"IF(VLOOKUP($C34,invullijst!$A$10:$M185,2,FALSE)=\"\",\"\",VLOOKUP($C34,invullijst!$A$10:$M185,2,FALSE))","v":0},{"$f":"IF(VLOOKUP($C34,invullijst!$A$10:$M$177,3,FALSE)=\"\",\"\",VLOOKUP($C34,invullijst!$A$10:$M$177,3,FALSE))","v":0},{"$f":"IF(VLOOKUP($C34,invullijst!$A$10:$M$177,6,FALSE)=\"\",\"\",VLOOKUP($C34,invullijst!$A$10:$M$177,6,FALSE))","v":0},{"$f":"IF(VLOOKUP($C34,invullijst!$A$10:$M$177,7,FALSE)=\"\",\"\",VLOOKUP($C34,invullijst!$A$10:$M$177,7,FALSE))","v":0},{"$f":"IF(VLOOKUP($C34,invullijst!$A$10:$M$177,8,FALSE)=\"\",\"\",VLOOKUP($C34,invullijst!$A$10:$M$177,8,FALSE))","v":0},{"$f":"IF(VLOOKUP($C34,invullijst!$A$10:$M$177,9,FALSE)=\"\",\"\",VLOOKUP($C34,invullijst!$A$10:$M$177,9,FALSE))","v":0},{"$f":"IF(VLOOKUP($C34,invullijst!$A$10:$M$177,10,FALSE)=\"\",\"\",VLOOKUP($C34,invullijst!$A$10:$M$177,10,FALSE))","v":0},0,{"$f":"IF(VLOOKUP($C34,invullijst!$A$10:$M$177,11,FALSE)=\"\",\"\",VLOOKUP($C34,invullijst!$A$10:$M$177,11,FALSE))","v":0}]

{"sheet":"Korps","index":4,"n_rows":55,"n_cols":34,"rows_kept":55,"merged":[[0,2,0,3],[0,4,0,7],[0,9,0,13],[4,2,4,13],[4,16,4,31],[6,2,6,6],[6,9,6,13],[20,2,20,5],[20,9,20,12],[31,2,31,13],[31,16,31,31],[33,2,33,6],[33,9,33,13],[47,2,47,5],[47,9,47,12]]}
[null,null,{"$f":"invullijst!F1","v":"Organisatie"},null,{"$f":"invullijst!H2","v":"2023 - 2024"},{"$nulls":4},{"$f":"invullijst!F3","v":"St. Crispinus & Crispinianus Besoijen"}]
[]
[]
[]
[null,null,"UITSLAGEN  O.V.L.B. KORPS VRIJE-HAND",{"$nulls":13},"Hieronder niets wijzigen"]
[]
[null,null,"A-Korps Vrije-hand",{"$nulls":6},"B-Korps Vrije-hand",{"$nulls":18},"A-Korps",null,null,"B-Korps"]
[null,null,"Baardwijk",313,"-",330,"Besoijen",null,null,"Baardwijk",53,"-",340,"Besoijen",null,null,{"$f":"D8","v":313},"ba",{"$f":"IF(ISBLANK(D8),\"\",IF(D8=F8,1,IF(D8>F8,2,0)))","v":0},{"$f":"IF(ISBLANK(F8),\"\",IF(F8=D8,1,IF(F8>D8,2,0)))","v":2},"be",{"$f":"F8","v":330},{"$f":"K8","v":53},"ba",{"$f":"IF(ISBLANK(K8),\"\",IF(K8=M8,1,IF(K8>M8,2,0)))","v":0},{"$f":"IF(ISBLANK(M8),\"\",IF(M8=K8,1,IF(M8>K8,2,0)))","v":2},"be",{"$f":"M8","v":340},"Baardwijk",{"$f":"SUM(S8:S11)","v":0},{"$f":"SUM(Q8:Q11)","v":1262},"Baardwijk",{"$f":"SUM(Y8:Y11)","v":0},{"$f":"SUM(W8:W11)","v":117}]
[null,null,"Baardwijk",324,"-",340,"Elshout",null,null,"Baardwijk",0,"-",68,"Elshout",null,null,324,"ba",0,2,"el",340,{"$f":"K9","v":0},"ba",{"$f":"IF(ISBLANK(K9),\"\",IF(K9=M9,1,IF(K9>M9,2,0)))","v":0},{"$f":"IF(ISBLANK(M9),\"\",IF(M9=K9,1,IF(M9>K9,2,0)))","v":2},"el",{"$f":"M9","v":68},"Besoijen",{"$f":"SUM(T8,S12:S14)","v":7},{"$f":"SUM(V8,Q12:Q14)","v":1349},"Besoijen",{"$f":"SUM(Z8,Y12:Y14)","v":8},{"$f":"SUM(AB8,W12:W14)","v":1285}]
[null,null,"Baardwijk",303,"-",326,"Haarsteeg",null,null,"Baardwijk",0,"-",154,"Haarsteeg",null,null,303,"ba",0,2,"ha",326,0,"ba",0,2,"ha",154,"Elshout",{"$f":"SUM(T9,T12,S15:S16)","v":5},{"$f":"SUM(V9,V12,Q15:Q16)","v":1334},"Elshout",{"$f":"SUM(Z9,Z12,Y15:Y16)","v":2},{"$f":"SUM(AB9,AB12,W15:W16)","v":216}]
[null,null,"Baardwijk",322,"-",335,"Kaatsheuvel",null,null,"Baardwijk",64,"-",294,"Kaatsheuvel",null,null,322,"ba",0,2,"ka",335,64,"ba",0,2,"ka",294,"Haarsteeg",{"$f":"SUM(T10,T13,T15,S17)","v":6},{"$f":"SUM(V10,V13,V15,Q17)","v":1325},"Haarsteeg",{"$f":"SUM(Z10,Z13,Z15,Y17)","v":4},{"$f":"SUM(AB10,AB13,AB15,W17)","v":565}]
[null,null,"Besoijen",342,"-",342,"Elshout",null,null,"Besoijen",320,"-",68,"Elshout",null,null,342,"be",1,1,"el",342,320,"be",2,0,"el",68,"Kaatsheuvel",{"$f":"SUM(T11,T14,T16,T17)","v":2},{"$f":"SUM(V11,V14,V16,V17)","v":1312},"Kaatsheuvel",{"$f":"SUM(Z11,Z14,Z16,Z17)","v":6},{"$f":"SUM(AB11,AB14,AB16,AB17)","v":953}]
[null,null,"Besoijen",342,"-",330,"Haarsteeg",null,null,"Besoijen",315,"-",79,"Haarsteeg",null,null,342,"be",2,0,"ha",330,315,"be",2,0,"ha",79]
[null,null,"Besoijen",335,"-",328,"Kaatsheuvel",null,null,"Besoijen",310,"-",213,"Kaatsheuvel",null,null,335,"be",2,0,"ka",328,310,"be",2,0,"ka",213]
[null,null,"Elshout",304,"-",334,"Haarsteeg",null,null,"Elshout",0,"-",169,"Haarsteeg",null,null,304,"el",0,2,"ha",334,0,"el",0,2,"ha",169]
[null,null,"Elshout",348,"-",327,"Kaatsheuvel",null,null,"Elshout",80,"-",235,"Kaatsheuvel",null,null,348,"el",2,0,"ka",327,80,"el",0,2,"ka",235]
[null,null,"Haarsteeg",335,"-",322,"Kaatsheuvel",null,null,"Haarsteeg",163,"-",211,"Kaatsheuvel",null,null,335,"ha",2,0,"ka",322,163,"ha",0,2,"ka",211]
[null,null,"(*): de wedstrijden kunnen zowel uit- als thuiswedstrijden zijn; dus b.v. zowel Besoijen-Elshout als Elshout- Besoijen... "]
[]
[]
[null,null,"EINDSTAND A-KORPS VRIJE-HAND",{"$nulls":6},"EINDSTAND B-KORPS VRIJE-HAND"]
[{"$nulls":3},"Matchpunten","-","Totaalpunten",{"$nulls":4},"Matchpunten","-","Totaalpunten"]
[]
[1,null,"Besoijen",{"$f":"IF(ISTEXT(C24),VLOOKUP(C24,$AC$8:$AE$12,2,FALSE),\" \")","v":7},"-",{"$f":"IF(ISTEXT(C24),VLOOKUP(C24,$AC$8:$AE$12,3,FALSE),\" \")","v":1349},null,1,null,"Besoijen",{"$f":"IF(ISTEXT(J24),VLOOKUP(J24,$AF$8:$AH$12,2,FALSE),\" \")","v":8},"-",{"$f":"IF(ISTEXT(J24),VLOOKUP(J24,$AF$8:$AH$12,3,FALSE),\" \")","v":1285}]
[2,null,"Haarsteeg",{"$f":"IF(ISTEXT(C25),VLOOKUP(C25,$AC$8:$AE$12,2,FALSE),\" \")","v":6},"-",{"$f":"IF(ISTEXT(C25),VLOOKUP(C25,$AC$8:$AE$12,3,FALSE),\" \")","v":1325},null,2,null,"Kaatsheuvel",{"$f":"IF(ISTEXT(J25),VLOOKUP(J25,$AF$8:$AH$12,2,FALSE),\" \")","v":6},"-",{"$f":"IF(ISTEXT(J25),VLOOKUP(J25,$AF$8:$AH$12,3,FALSE),\" \")","v":953}]
[3,null,"Elshout",{"$f":"IF(ISTEXT(C26),VLOOKUP(C26,$AC$8:$AE$12,2,FALSE),\" \")","v":5},"-",{"$f":"IF(ISTEXT(C26),VLOOKUP(C26,$AC$8:$AE$12,3,FALSE),\" \")","v":1334},null,3,null,"Haarsteeg",{"$f":"IF(ISTEXT(J26),VLOOKUP(J26,$AF$8:$AH$12,2,FALSE),\" \")","v":4},"-",{"$f":"IF(ISTEXT(J26),VLOOKUP(J26,$AF$8:$AH$12,3,FALSE),\" \")","v":565}]
[4,null,"Kaatsheuvel",{"$f":"IF(ISTEXT(C27),VLOOKUP(C27,$AC$8:$AE$12,2,FALSE),\" \")","v":2},"-",{"$f":"IF(ISTEXT(C27),VLOOKUP(C27,$AC$8:$AE$12,3,FALSE),\" \")","v":1312},null,4,null,"Elshout",{"$f":"IF(ISTEXT(J27),VLOOKUP(J27,$AF$8:$AH$12,2,FALSE),\" \")","v":2},"-",{"$f":"IF(ISTEXT(J27),VLOOKUP(J27,$AF$8:$AH$12,3,FALSE),\" \")","v":216}]
[5,null,"Baardwijk",{"$f":"IF(ISTEXT(C28),VLOOKUP(C28,$AC$8:$AE$12,2,FALSE),\" \")","v":0},"-",{"$f":"IF(ISTEXT(C28),VLOOKUP(C28,$AC$8:$AE$12,3,FALSE),\" \")","v":1262},null,5,null,"Baardwijk",{"$f":"IF(ISTEXT(J28),VLOOKUP(J28,$AF$8:$AH$12,2,FALSE),\" \")","v":0},"-",{"$f":"IF(ISTEXT(J28),VLOOKUP(J28,$AF$8:$AH$12,3,FALSE),\" \")","v":117}]
[]
[]
[]
[null,null,"UITSLAGEN  O.V.L.B. KORPS OPGELEGD",{"$nulls":13},"Hieronder niets wijzigen"]
[]
[null,null,"A-KORPS OPGELEGD",{"$nulls":6},"B-KORPS OPGELEGD",{"$nulls":18},"A-Korps",null,null,"B-Korps"]
[null,null,"Baardwijk",261,"-",275,"Besoijen",null,null,"Baardwijk",null,"-",null,"Besoijen",null,null,{"$f":"D35","v":261},"ba",{"$f":"IF(ISBLANK(D35),\"\",IF(D35=F35,1,IF(D35>F35,2,0)))","v":0},{"$f":"IF(ISBLANK(F35),\"\",IF(F35=D35,1,IF(F35>D35,2,0)))","v":2},"be",{"$f":"F35","v":275},{"$f":"K35","v":0},"ba",{"$f":"IF(ISBLANK(K35),\"\",IF(K35=M35,1,IF(K35>M35,2,0)))","v":""},{"$f":"IF(ISBLANK(M35),\"\",IF(M35=K35,1,IF(M35>K35,2,0)))","v":""},"be",{"$f":"M35","v":0},"Baardwijk",{"$f":"SUM(S35:S38)","v":0},{"$f":"SUM(Q35:Q38)","v":969},"Baardwijk",{"$f":"SUM(Y35:Y38)","v":0},{"$f":"SUM(W35:W38)","v":65}]
[null,null,"Baardwijk",241,"-",271,"Elshout",null,null,"Baardwijk",0,"-",181,"Elshout",null,null,241,"ba",0,2,"el",271,{"$f":"K36","v":0},"ba",{"$f":"IF(ISBLANK(K36),\"\",IF(K36=M36,1,IF(K36>M36,2,0)))","v":0},{"$f":"IF(ISBLANK(M36),\"\",IF(M36=K36,1,IF(M36>K36,2,0)))","v":2},"el",{"$f":"M36","v":181},"Besoijen",{"$f":"SUM(T35,S39:S41)","v":4},{"$f":"SUM(V35,Q39:Q41)","v":1085},"Besoijen",{"$f":"SUM(Z35,Y39:Y41)","v":0},{"$f":"SUM(AB35,W39:W41)","v":0}]
[null,null,"Baardwijk",217,"-",287,"Haarsteeg",null,null,"Baardwijk",65,"-",281,"Haarsteeg",null,null,217,"ba",0,2,"ha",287,65,"ba",0,2,"ha",281,"Elshout",{"$f":"SUM(T36,T39,S42:S43)","v":6},{"$f":"SUM(V36,V39,Q42:Q43)","v":1102},"Elshout",{"$f":"SUM(Z36,Z39,Y42:Y43)","v":4},{"$f":"SUM(AB36,AB39,W42:W43)","v":638}]
[null,null,"Baardwijk",250,"-",272,"Kaatsheuvel",null,null,"Baardwijk",0,"-",224,"Kaatsheuvel",null,null,250,"ba",0,2,"ka",272,0,"ba",0,2,"ka",224,"Haarsteeg",{"$f":"SUM(T37,T40,T42,S44)","v":8},{"$f":"SUM(V37,V40,V42,Q44)","v":1144},"Haarsteeg",{"$f":"SUM(Z37,Z40,Z42,Y44)","v":8},{"$f":"SUM(AB37,AB40,AB42,W44)","v":1018}]
[null,null,"Besoijen",273,"-",277,"Elshout",null,null,"Besoijen",0,"-",182,"Elshout",null,null,273,"be",0,2,"el",277,0,"be",0,2,"el",182,"Kaatsheuvel",{"$f":"SUM(T38,T41,T43,T44)","v":2},{"$f":"SUM(V38,V41,V43,V44)","v":1074},"Kaatsheuvel",{"$f":"SUM(Z38,Z41,Z43,Z44)","v":6},{"$f":"SUM(AB38,AB41,AB43,AB44)","v":710}]
[null,null,"Besoijen",264,"-",289,"Haarsteeg",null,null,"Besoijen",0,"-",185,"Haarsteeg",null,null,264,"be",0,2,"ha",289,0,"be",0,2,"ha",185]
[null,null,"Besoijen",273,"-",267,"Kaatsheuvel",null,null,"Besoijen",0,"-",192,"Kaatsheuvel",null,null,273,"be",2,0,"ka",267,0,"be",0,2,"ka",192]
[null,null,"Elshout",277,"-",286,"Haarsteeg",null,null,"Elshout",88,"-",281,"Haarsteeg",null,null,277,"el",0,2,"ha",286,88,"el",0,2,"ha",281]
[null,null,"Elshout",277,"-",266,"Kaatsheuvel",null,null,"Elshout",187,"-",221,"Kaatsheuvel",null,null,277,"el",2,0,"ka",266,187,"el",0,2,"ka",221]
[null,null,"Haarsteeg",282,"-",269,"Kaatsheuvel",null,null,"Haarsteeg",271,"-",73,"Kaatsheuvel",null,null,282,"ha",2,0,"ka",269,271,"ha",2,0,"ka",73]
[null,null,"(*): de wedstrijden kunnen zowel uit- als thuiswedstrijden zijn; dus b.v. zowel Besoijen-Elshout als Elshout- Besoijen... "]
[]
[]
[null,null,"EINDSTAND A-KORPS OPGELEGD",{"$nulls":6},"EINDSTAND B-KORPS OPGELEGD"]
[{"$nulls":3},"Matchpunten","-","Totaalpunten",{"$nulls":4},"Matchpunten","-","Totaalpunten"]
[]
[1,null,"Haarsteeg",{"$f":"IF(ISTEXT(C51),VLOOKUP(C51,$AC$35:$AE$39,2,FALSE),\" \")","v":8},"-",{"$f":"IF(ISTEXT(C51),VLOOKUP(C51,$AC$35:$AE$39,3,FALSE),\" \")","v":1144},null,1,null,"Haarsteeg",{"$f":"IF(ISTEXT(J51),VLOOKUP(J51,$AF$35:$AH$39,2,FALSE),\" \")","v":8},"-",{"$f":"IF(ISTEXT(J51),VLOOKUP(J51,$AF$35:$AH$39,3,FALSE),\" \")","v":1018}]
[2,null,"Elshout",{"$f":"IF(ISTEXT(C52),VLOOKUP(C52,$AC$35:$AE$39,2,FALSE),\" \")","v":6},"-",{"$f":"IF(ISTEXT(C52),VLOOKUP(C52,$AC$35:$AE$39,3,FALSE),\" \")","v":1102},null,2,null,"Kaatsheuvel",{"$f":"IF(ISTEXT(J52),VLOOKUP(J52,$AF$35:$AH$39,2,FALSE),\" \")","v":6},"-",{"$f":"IF(ISTEXT(J52),VLOOKUP(J52,$AF$35:$AH$39,3,FALSE),\" \")","v":710}]
[3,null,"Besoijen",{"$f":"IF(ISTEXT(C53),VLOOKUP(C53,$AC$35:$AE$39,2,FALSE),\" \")","v":4},"-",{"$f":"IF(ISTEXT(C53),VLOOKUP(C53,$AC$35:$AE$39,3,FALSE),\" \")","v":1085},null,3,null,"Elshout",{"$f":"IF(ISTEXT(J53),VLOOKUP(J53,$AF$35:$AH$39,2,FALSE),\" \")","v":4},"-",{"$f":"IF(ISTEXT(J53),VLOOKUP(J53,$AF$35:$AH$39,3,FALSE),\" \")","v":638}]
[4,null,"Kaatsheuvel",{"$f":"IF(ISTEXT(C54),VLOOKUP(C54,$AC$35:$AE$39,2,FALSE),\" \")","v":2},"-",{"$f":"IF(ISTEXT(C54),VLOOKUP(C54,$AC$35:$AE$39,3,FALSE),\" \")","v":1074},null,4,null,"Baardwijk",{"$f":"IF(ISTEXT(J54),VLOOKUP(J54,$AF$35:$AH$39,2,FALSE),\" \")","v":0},"-",{"$f":"IF(ISTEXT(J54),VLOOKUP(J54,$AF$35:$AH$39,3,FALSE),\" \")","v":65}]
[5,null,"Baardwijk",{"$f":"IF(ISTEXT(C55),VLOOKUP(C55,$AC$35:$AE$39,2,FALSE),\" \")","v":0},"-",{"$f":"IF(ISTEXT(C55),VLOOKUP(C55,$AC$35:$AE$39,3,FALSE),\" \")","v":969},null,5,null,"Besoijen",{"$f":"IF(ISTEXT(J55),VLOOKUP(J55,$AF$35:$AH$39,2,FALSE),\" \")","v":0},"-",{"$f":"IF(ISTEXT(J55),VLOOKUP(J55,$AF$35:$AH$39,3,FALSE),\" \")","v":0}]

{"sheet":"wedstrijd 1A","index":5,"n_rows":38,"n_cols":15,"rows_kept":38,"merged":[[0,0,0,4],[0,5,0,7],[0,8,0,14],[1,0,1,11],[1,12,1,14],[2,1,2,5],[2,9,2,13],[4,0,4,14],[5,4,5,5],[5,12,5,13],[6,4,6,5],[6,12,6,13],[7,4,7,5],[7,12,7,13],[8,4,8,5],[8,12,8,13],[9,0,9,5],[9,8,9,13],[11,4,11,5],[11,12,11,13],[12,4,12,5],[12,12,12,13],[13,4,13,5],[13,12,13,13],[14,4,14,5],[14,12,14,13],[15,0,15,5],[15,8,15,13],[17,4,17,5],[17,12,17,13],[18,4,18,5],[18,12,18,13],[19,4,19,5],[19,12,19,13],[20,4,20,5],[20,12,20,13],[21,0,21,5],[21,8,21,13],[23,0,23,14],[24,4,24,5],[24,12,24,13],[25,4,25,5],[25,12,25,13],[26,4,26,5],[26,12,26,13],[27,0,27,5],[27,8,27,13],[29,4,29,5],[29,12,29,13],[30,4,30,5],[30,12,30,13],[31,4,31,5],[31,12,31,13],[32,0,32,5],[32,8,32,13],[34,4,34,5],[34,12,34,13],[35,4,35,5],[35,12,35,13],[36,4,36,5],[36,12,36,13],[37,0,37,5],[37,8,37,13]]}
[{"$f":"invullijst!F1","v":"Organisatie"},{"$nulls":4},{"$f":"invullijst!H2","v":"2023 - 2024"},null,null,{"$f":"invullijst!F3","v":"St. Crispinus & Crispinianus Besoijen"}]
["Datum: ",{"$nulls":11},"2023-12-10"]
[5,{"$f":"IF(VLOOKUP(A3,invullijst!A1:F5,2,FALSE)=\"\",\"\",VLOOKUP(A3,invullijst!A1:F5,2,FALSE))","v":"Sint Jan Baptist Kaatsheuvel"},{"$nulls":6},2,{"$f":"IF(VLOOKUP(I3,invullijst!A1:C5,2,FALSE)=\"\",\"\",VLOOKUP(I3,invullijst!A1:C5,2,FALSE))","v":"St. Crispinus & Crispinianus Besoijen"}]
[]
["vrijehand"]
[1,{"$f":"IF($G$3=\"k\",IF(VLOOKUP($D6,invullijst!$A$11:$M$177,11,FALSE)=0,\" \",VLOOKUP($D6,invullijst!$A$11:$M$177,11,FALSE)),\"\")","v":""},{"$f":"IF(VLOOKUP(D6,invullijst!A$11:F$218,4,FALSE)=\"\",\"\",VLOOKUP(D6,invullijst!A$11:D$218,4,FALSE))","v":"vr"},501,{"$f":"IF(VLOOKUP($D6,invullijst!$A$11:$M$177,2,FALSE)=\"\",\"\",VLOOKUP($D6,invullijst!$A$11:$M$177,2,FALSE))","v":"Annette Vos"},null,{"$f":"IF(VLOOKUP($D6,invullijst!$A$11:$M$177,6,FALSE)=0,\"\",VLOOKUP($D6,invullijst!$A$11:$M$177,6,FALSE))","v":80},null,1,{"$f":"IF($O$3=\"k\",IF(VLOOKUP($L6,invullijst!$A$11:$M$177,11,FALSE)=0,\" \",VLOOKUP($L6,invullijst!$A$11:$M$177,11,FALSE)),\"\")","v":""},null,201,{"$f":"IF(VLOOKUP($L6,invullijst!$A$11:$M$177,2,FALSE)=\"\",\"\",VLOOKUP($L6,invullijst!$A$11:$M$177,2,FALSE))","v":"Sander Oome"},null,{"$f":"IF(VLOOKUP($L6,invullijst!$A$11:$M$177,6,FALSE)=0,\"\",VLOOKUP($L6,invullijst!$A$11:$M$177,6,FALSE))","v":91}]
[2,{"$f":"IF($G$3=\"k\",IF(VLOOKUP($D7,invullijst!$A$11:$M$177,11,FALSE)=0,\" \",VLOOKUP($D7,invullijst!$A$11:$M$177,11,FALSE)),\"\")","v":""},{"$f":"IF(VLOOKUP(D7,invullijst!A$11:F$218,4,FALSE)=\"\",\"\",VLOOKUP(D7,invullijst!A$11:D$218,4,FALSE))","v":"vr"},507,{"$f":"IF(VLOOKUP($D7,invullijst!$A$11:$M$177,2,FALSE)=\"\",\"\",VLOOKUP($D7,invullijst!$A$11:$M$177,2,FALSE))","v":"Michael Blaauwbroek"},null,{"$f":"IF(VLOOKUP($D7,invullijst!$A$11:$M$177,6,FALSE)=0,\"\",VLOOKUP($D7,invullijst!$A$11:$M$177,6,FALSE))","v":70},null,2,{"$f":"IF($O$3=\"k\",IF(VLOOKUP($L7,invullijst!$A$11:$M$177,11,FALSE)=0,\" \",VLOOKUP($L7,invullijst!$A$11:$M$177,11,FALSE)),\"\")","v":""},null,206,{"$f":"IF(VLOOKUP($L7,invullijst!$A$11:$M$177,2,FALSE)=\"\",\"\",VLOOKUP($L7,invullijst!$A$11:$M$177,2,FALSE))","v":"Kees van Hulten"},null,{"$f":"IF(VLOOKUP($L7,invullijst!$A$11:$M$177,6,FALSE)=0,\"\",VLOOKUP($L7,invullijst!$A$11:$M$177,6,FALSE))","v":86}]
[3,{"$f":"IF($G$3=\"k\",IF(VLOOKUP($D8,invullijst!$A$11:$M$177,11,FALSE)=0,\" \",VLOOKUP($D8,invullijst!$A$11:$M$177,11,FALSE)),\"\")","v":""},{"$f":"IF(VLOOKUP(D8,invullijst!A$11:F$218,4,FALSE)=\"\",\"\",VLOOKUP(D8,invullijst!A$11:D$218,4,FALSE))","v":"vr"},506,{"$f":"IF(VLOOKUP($D8,invullijst!$A$11:$M$177,2,FALSE)=\"\",\"\",VLOOKUP($D8,invullijst!$A$11:$M$177,2,FALSE))","v":"Maikel Monden"},null,{"$f":"IF(VLOOKUP($D8,invullijst!$A$11:$M$177,6,FALSE)=0,\"\",VLOOKUP($D8,invullijst!$A$11:$M$177,6,FALSE))","v":84},null,3,{"$f":"IF($O$3=\"k\",IF(VLOOKUP($L8,invullijst!$A$11:$M$177,11,FALSE)=0,\" \",VLOOKUP($L8,invullijst!$A$11:$M$177,11,FALSE)),\"\")","v":""},null,205,{"$f":"IF(VLOOKUP($L8,invullijst!$A$11:$M$177,2,FALSE)=\"\",\"\",VLOOKUP($L8,invullijst!$A$11:$M$177,2,FALSE))","v":"Jos v/d Snepscheut"},null,{"$f":"IF(VLOOKUP($L8,invullijst!$A$11:$M$177,6,FALSE)=0,\"\",VLOOKUP($L8,invullijst!$A$11:$M$177,6,FALSE))","v":79}]
[4,{"$f":"IF($G$3=\"k\",IF(VLOOKUP($D9,invullijst!$A$11:$M$177,11,FALSE)=0,\" \",VLOOKUP($D9,invullijst!$A$11:$M$177,11,FALSE)),\"\")","v":""},{"$f":"IF(VLOOKUP(D9,invullijst!A$11:F$218,4,FALSE)=\"\",\"\",VLOOKUP(D9,invullijst!A$11:D$218,4,FALSE))","v":"vr"},504,{"$f":"IF(VLOOKUP($D9,invullijst!$A$11:$M$177,2,FALSE)=\"\",\"\",VLOOKUP($D9,invullijst!$A$11:$M$177,2,FALSE))","v":"Koen v/d Ven"},null,{"$f":"IF(VLOOKUP($D9,invullijst!$A$11:$M$177,6,FALSE)=0,\"\",VLOOKUP($D9,invullijst!$A$11:$M$177,6,FALSE))","v":94},null,4,{"$f":"IF($O$3=\"k\",IF(VLOOKUP($L9,invullijst!$A$11:$M$177,11,FALSE)=0,\" \",VLOOKUP($L9,invullijst!$A$11:$M$177,11,FALSE)),\"\")","v":""},null,215,{"$f":"IF(VLOOKUP($L9,invullijst!$A$11:$M$177,2,FALSE)=\"\",\"\",VLOOKUP($L9,invullijst!$A$11:$M$177,2,FALSE))","v":"Pieter Laghuwitz"},null,{"$f":"IF(VLOOKUP($L9,invullijst!$A$11:$M$177,6,FALSE)=0,\"\",VLOOKUP($L9,invullijst!$A$11:$M$177,6,FALSE))","v":79}]
["Totaal A korps",{"$nulls":5},{"$f":"SUM(G6:G9)","v":328},null,"Totaal A korps",{"$nulls":5},{"$f":"SUM(O6:O9)","v":335}]
[]
[1,{"$f":"IF($G$3=\"k\",IF(VLOOKUP($D12,invullijst!$A$11:$M$177,11,FALSE)=0,\" \",VLOOKUP($D12,invullijst!$A$11:$M$177,11,FALSE)),\"\")","v":""},{"$f":"IF(VLOOKUP(D12,invullijst!A$11:F$218,4,FALSE)=\"\",\"\",VLOOKUP(D12,invullijst!A$11:D$218,4,FALSE))","v":"vr"},512,{"$f":"IF(VLOOKUP($D12,invullijst!$A$11:$M$177,2,FALSE)=\"\",\"\",VLOOKUP($D12,invullijst!$A$11:$M$177,2,FALSE))","v":"Hans Bergakker"},null,{"$f":"IF(VLOOKUP($D12,invullijst!$A$11:$M$177,6,FALSE)=0,\"\",VLOOKUP($D12,invullijst!$A$11:$M$177,6,FALSE))","v":81},null,1,{"$f":"IF($O$3=\"k\",IF(VLOOKUP($L12,invullijst!$A$11:$M$177,11,FALSE)=0,\" \",VLOOKUP($L12,invullijst!$A$11:$M$177,11,FALSE)),\"\")","v":""},{"$f":"IF(VLOOKUP($L12,invullijst!$A$11:$M$218,4,FALSE)=\"\",\"\",VLOOKUP($L12,invullijst!$A$11:$M$218,4,FALSE))","v":"vr"},203,{"$f":"IF(VLOOKUP($L12,invullijst!$A$11:$M$177,2,FALSE)=\"\",\"\",VLOOKUP($L12,invullijst!$A$11:$M$177,2,FALSE))","v":"Frank van den Houdt"},null,{"$f":"IF(VLOOKUP($L12,invullijst!$A$11:$M$177,6,FALSE)=0,\"\",VLOOKUP($L12,invullijst!$A$11:$M$177,6,FALSE))","v":80}]
[2,{"$f":"IF($G$3=\"k\",IF(VLOOKUP($D13,invullijst!$A$11:$M$177,11,FALSE)=0,\" \",VLOOKUP($D13,invullijst!$A$11:$M$177,11,FALSE)),\"\")","v":""},{"$f":"IF(VLOOKUP(D13,invullijst!A$11:F$218,4,FALSE)=\"\",\"\",VLOOKUP(D13,invullijst!A$11:D$218,4,FALSE))","v":"vr"},502,{"$f":"IF(VLOOKUP($D13,invullijst!$A$11:$M$177,2,FALSE)=\"\",\"\",VLOOKUP($D13,invullijst!$A$11:$M$177,2,FALSE))","v":"Diny Vos"},null,{"$f":"IF(VLOOKUP($D13,invullijst!$A$11:$M$177,6,FALSE)=0,\"\",VLOOKUP($D13,invullijst!$A$11:$M$177,6,FALSE))","v":67},null,2,{"$f":"IF($O$3=\"k\",IF(VLOOKUP($L13,invullijst!$A$11:$M$177,11,FALSE)=0,\" \",VLOOKUP($L13,invullijst!$A$11:$M$177,11,FALSE)),\"\")","v":""},{"$f":"IF(VLOOKUP($L13,invullijst!$A$11:$M$218,4,FALSE)=\"\",\"\",VLOOKUP($L13,invullijst!$A$11:$M$218,4,FALSE))","v":"vr"},209,{"$f":"IF(VLOOKUP($L13,invullijst!$A$11:$M$177,2,FALSE)=\"\",\"\",VLOOKUP($L13,invullijst!$A$11:$M$177,2,FALSE))","v":"René van Kuijk"},null,{"$f":"IF(VLOOKUP($L13,invullijst!$A$11:$M$177,6,FALSE)=0,\"\",VLOOKUP($L13,invullijst!$A$11:$M$177,6,FALSE))","v":76}]
[3,{"$f":"IF($G$3=\"k\",IF(VLOOKUP($D14,invullijst!$A$11:$M$177,11,FALSE)=0,\" \",VLOOKUP($D14,invullijst!$A$11:$M$177,11,FALSE)),\"\")","v":""},{"$f":"IF(VLOOKUP(D14,invullijst!A$11:F$218,4,FALSE)=\"\",\"\",VLOOKUP(D14,invullijst!A$11:D$218,4,FALSE))","v":"vr"},513,{"$f":"IF(VLOOKUP($D14,invullijst!$A$11:$M$177,2,FALSE)=\"\",\"\",VLOOKUP($D14,invullijst!$A$11:$M$177,2,FALSE))","v":"Mark van Delft"},null,{"$f":"IF(VLOOKUP($D14,invullijst!$A$11:$M$177,6,FALSE)=0,\"\",VLOOKUP($D14,invullijst!$A$11:$M$177,6,FALSE))","v":65},null,3,{"$f":"IF($O$3=\"k\",IF(VLOOKUP($L14,invullijst!$A$11:$M$177,11,FALSE)=0,\" \",VLOOKUP($L14,invullijst!$A$11:$M$177,11,FALSE)),\"\")","v":""},{"$f":"IF(VLOOKUP($L14,invullijst!$A$11:$M$218,4,FALSE)=\"\",\"\",VLOOKUP($L14,invullijst!$A$11:$M$218,4,FALSE))","v":"vr"},202,{"$f":"IF(VLOOKUP($L14,invullijst!$A$11:$M$177,2,FALSE)=\"\",\"\",VLOOKUP($L14,invullijst!$A$11:$M$177,2,FALSE))","v":"Arco van Kuijk"},null,{"$f":"IF(VLOOKUP($L14,invullijst!$A$11:$M$177,6,FALSE)=0,\"\",VLOOKUP($L14,invullijst!$A$11:$M$177,6,FALSE))","v":74}]
[4,{"$f":"IF($G$3=\"k\",IF(VLOOKUP($D15,invullijst!$A$11:$M$177,11,FALSE)=0,\" \",VLOOKUP($D15,invullijst!$A$11:$M$177,11,FALSE)),\"\")","v":""},{"$f":"IF(VLOOKUP(D15,invullijst!A$10:F$218,4,FALSE)=\"\",\"\",VLOOKUP(D15,invullijst!A$10:D$218,4,FALSE))","v":0},null,{"$f":"IF(VLOOKUP($D15,invullijst!$A$10:$M$177,2,FALSE)=\"\",\"\",VLOOKUP($D15,invullijst!$A$10:$M$177,2,FALSE))","v":0},null,{"$f":"IF(VLOOKUP($D15,invullijst!$A$10:$M$177,6,FALSE)=0,\"\",VLOOKUP($D15,invullijst!$A$10:$M$177,6,FALSE))","v":""},null,4,{"$f":"IF($O$3=\"k\",IF(VLOOKUP($L15,invullijst!$A$11:$M$177,11,FALSE)=0,\" \",VLOOKUP($L15,invullijst!$A$11:$M$177,11,FALSE)),\"\")","v":""},{"$f":"IF(VLOOKUP($L15,invullijst!$A$11:$M$218,4,FALSE)=\"\",\"\",VLOOKUP($L15,invullijst!$A$11:$M$218,4,FALSE))","v":"vr"},204,{"$f":"IF(VLOOKUP($L15,invullijst!$A$11:$M$177,2,FALSE)=\"\",\"\",VLOOKUP($L15,invullijst!$A$11:$M$177,2,FALSE))","v":"Harry de Louw"},null,{"$f":"IF(VLOOKUP($L15,invullijst!$A$11:$M$177,6,FALSE)=0,\"\",VLOOKUP($L15,invullijst!$A$11:$M$177,6,FALSE))","v":80}]
["Totaal B1 korps",{"$nulls":5},{"$f":"SUM(G12:G15)","v":213},null,"Totaal B1 korps",{"$nulls":5},{"$f":"SUM(O12:O15)","v":310}]
[]
[1,{"$f":"IF($G$3=\"k\",IF(VLOOKUP($D18,invullijst!$A$11:$M$177,11,FALSE)=0,\" \",VLOOKUP($D18,invullijst!$A$11:$M$177,11,FALSE)),\"\")","v":""},{"$f":"IF(VLOOKUP(D18,invullijst!A$10:F$218,4,FALSE)=\"\",\"\",VLOOKUP(D18,invullijst!A$10:D$218,4,FALSE))","v":0},null,{"$f":"IF(VLOOKUP($D18,invullijst!$A$10:$M$177,2,FALSE)=\"\",\"\",VLOOKUP($D18,invullijst!$A$10:$M$177,2,FALSE))","v":0},null,{"$f":"IF(VLOOKUP($D18,invullijst!$A$10:$M$177,6,FALSE)=0,\"\",VLOOKUP($D18,invullijst!$A$10:$M$177,6,FALSE))","v":""},null,1,{"$f":"IF($O$3=\"k\",IF(VLOOKUP($L18,invullijst!$A$11:$M$177,11,FALSE)=0,\" \",VLOOKUP($L18,invullijst!$A$11:$M$177,11,FALSE)),\"\")","v":""},{"$f":"IF(VLOOKUP($L18,invullijst!$A$11:$M$218,4,FALSE)=\"\",\"\",VLOOKUP($L18,invullijst!$A$11:$M$218,4,FALSE))","v":"vr"},216,{"$f":"IF(VLOOKUP($L18,invullijst!$A$11:$M$177,2,FALSE)=\"\",\"\",VLOOKUP($L18,invullijst!$A$11:$M$177,2,FALSE))","v":"Hans Laghuwitz"},null,{"$f":"IF(VLOOKUP($L18,invullijst!$A$11:$M$177,6,FALSE)=0,\"\",VLOOKUP($L18,invullijst!$A$11:$M$177,6,FALSE))","v":67}]
[2,{"$f":"IF($G$3=\"k\",IF(VLOOKUP($D19,invullijst!$A$11:$M$177,11,FALSE)=0,\" \",VLOOKUP($D19,invullijst!$A$11:$M$177,11,FALSE)),\"\")","v":""},{"$f":"IF(VLOOKUP(D19,invullijst!A$10:F$218,4,FALSE)=\"\",\"\",VLOOKUP(D19,invullijst!A$10:D$218,4,FALSE))","v":0},null,{"$f":"IF(VLOOKUP($D19,invullijst!$A$10:$M$177,2,FALSE)=\"\",\"\",VLOOKUP($D19,invullijst!$A$10:$M$177,2,FALSE))","v":0},null,{"$f":"IF(VLOOKUP($D19,invullijst!$A$10:$M$177,6,FALSE)=0,\"\",VLOOKUP($D19,invullijst!$A$10:$M$177,6,FALSE))","v":""},null,2,{"$f":"IF($O$3=\"k\",IF(VLOOKUP($L19,invullijst!$A$11:$M$177,11,FALSE)=0,\" \",VLOOKUP($L19,invullijst!$A$11:$M$177,11,FALSE)),\"\")","v":""},{"$f":"IF(VLOOKUP($L19,invullijst!$A$11:$M$218,4,FALSE)=\"\",\"\",VLOOKUP($L19,invullijst!$A$11:$M$218,4,FALSE))","v":"vr"},210,{"$f":"IF(VLOOKUP($L19,invullijst!$A$11:$M$177,2,FALSE)=\"\",\"\",VLOOKUP($L19,invullijst!$A$11:$M$177,2,FALSE))","v":"Nick de Vaan"},null,{"$f":"IF(VLOOKUP($L19,invullijst!$A$11:$M$177,6,FALSE)=0,\"\",VLOOKUP($L19,invullijst!$A$11:$M$177,6,FALSE))","v":68}]
[3,{"$f":"IF($G$3=\"k\",IF(VLOOKUP($D20,invullijst!$A$11:$M$177,11,FALSE)=0,\" \",VLOOKUP($D20,invullijst!$A$11:$M$177,11,FALSE)),\"\")","v":""},{"$f":"IF(VLOOKUP(D20,invullijst!A$10:F$218,4,FALSE)=\"\",\"\",VLOOKUP(D20,invullijst!A$10:D$218,4,FALSE))","v":0},null,{"$f":"IF(VLOOKUP($D20,invullijst!$A$10:$M$177,2,FALSE)=\"\",\"\",VLOOKUP($D20,invullijst!$A$10:$M$177,2,FALSE))","v":0},null,{"$f":"IF(VLOOKUP($D20,invullijst!$A$10:$M$177,6,FALSE)=0,\"\",VLOOKUP($D20,invullijst!$A$10:$M$177,6,FALSE))","v":""},null,3,{"$f":"IF($O$3=\"k\",IF(VLOOKUP($L20,invullijst!$A$11:$M$177,11,FALSE)=0,\" \",VLOOKUP($L20,invullijst!$A$11:$M$177,11,FALSE)),\"\")","v":""},{"$f":"IF(VLOOKUP($L20,invullijst!$A$11:$M$218,4,FALSE)=\"\",\"\",VLOOKUP($L20,invullijst!$A$11:$M$218,4,FALSE))","v":"vr"},213,{"$f":"IF(VLOOKUP($L20,invullijst!$A$11:$M$177,2,FALSE)=\"\",\"\",VLOOKUP($L20,invullijst!$A$11:$M$177,2,FALSE))","v":"Roland van Delft"},null,{"$f":"IF(VLOOKUP($L20,invullijst!$A$11:$M$177,6,FALSE)=0,\"\",VLOOKUP($L20,invullijst!$A$11:$M$177,6,FALSE))","v":69}]
[4,{"$f":"IF($G$3=\"k\",IF(VLOOKUP($D21,invullijst!$A$11:$M$177,11,FALSE)=0,\" \",VLOOKUP($D21,invullijst!$A$11:$M$177,11,FALSE)),\"\")","v":""},{"$f":"IF(VLOOKUP(D21,invullijst!A$10:F$218,4,FALSE)=\"\",\"\",VLOOKUP(D21,invullijst!A$10:D$218,4,FALSE))","v":0},null,{"$f":"IF(VLOOKUP($D21,invullijst!$A$10:$M$177,2,FALSE)=\"\",\"\",VLOOKUP($D21,invullijst!$A$10:$M$177,2,FALSE))","v":0},null,{"$f":"IF(VLOOKUP($D21,invullijst!$A$10:$M$177,6,FALSE)=0,\"\",VLOOKUP($D21,invullijst!$A$10:$M$177,6,FALSE))","v":""},null,4,{"$f":"IF($O$3=\"k\",IF(VLOOKUP($L21,invullijst!$A$11:$M$177,11,FALSE)=0,\" \",VLOOKUP($L21,invullijst!$A$11:$M$177,11,FALSE)),\"\")","v":""},{"$f":"IF(VLOOKUP($L21,invullijst!$A$11:$M$218,4,FALSE)=\"\",\"\",VLOOKUP($L21,invullijst!$A$11:$M$218,4,FALSE))","v":"vr"},208,{"$f":"IF(VLOOKUP($L21,invullijst!$A$11:$M$177,2,FALSE)=\"\",\"\",VLOOKUP($L21,invullijst!$A$11:$M$177,2,FALSE))","v":"Erin van Hulten"},null,{"$f":"IF(VLOOKUP($L21,invullijst!$A$11:$M$177,6,FALSE)=0,\"\",VLOOKUP($L21,invullijst!$A$11:$M$177,6,FALSE))","v":78}]
["DIVERSEN / INHAAL",{"$nulls":7},"DIVERSEN / INHAAL"]
[]
["OPGELEGD (Jeugd <16 en 65+)"]
[1,{"$f":"IF($G$3=\"k\",IF(VLOOKUP($D25,invullijst!$A$11:$M$177,11,FALSE)=0,\" \",VLOOKUP($D25,invullijst!$A$11:$M$177,11,FALSE)),\"\")","v":""},{"$f":"IF(VLOOKUP(D25,invullijst!A$11:F$218,4,FALSE)=\"\",\"\",VLOOKUP(D25,invullijst!A$11:D$218,4,FALSE))","v":"65+"},509,{"$f":"IF(VLOOKUP($D25,invullijst!$A$11:$M$177,2,FALSE)=\"\",\"\",VLOOKUP($D25,invullijst!$A$11:$M$177,2,FALSE))","v":"Adwan de Pinth"},null,{"$f":"IF(VLOOKUP($D25,invullijst!$A$11:$M$177,6,FALSE)=0,\"\",VLOOKUP($D25,invullijst!$A$11:$M$177,6,FALSE))","v":95},null,1,{"$f":"IF($O$3=\"k\",IF(VLOOKUP($L25,invullijst!$A$11:$M$177,11,FALSE)=0,\" \",VLOOKUP($L25,invullijst!$A$11:$M$177,11,FALSE)),\"\")","v":""},{"$f":"IF(VLOOKUP($L25,invullijst!$A$11:$M$218,4,FALSE)=\"\",\"\",VLOOKUP($L25,invullijst!$A$11:$M$218,4,FALSE))","v":"65+"},212,{"$f":"IF(VLOOKUP($L25,invullijst!$A$11:$M$177,2,FALSE)=\"\",\"\",VLOOKUP($L25,invullijst!$A$11:$M$177,2,FALSE))","v":"René Duquesnoy"},null,{"$f":"IF(VLOOKUP($L25,invullijst!$A$11:$M$177,6,FALSE)=0,\"\",VLOOKUP($L25,invullijst!$A$11:$M$177,6,FALSE))","v":90}]
[2,{"$f":"IF($G$3=\"k\",IF(VLOOKUP($D26,invullijst!$A$11:$M$177,11,FALSE)=0,\" \",VLOOKUP($D26,invullijst!$A$11:$M$177,11,FALSE)),\"\")","v":""},{"$f":"IF(VLOOKUP(D26,invullijst!A$11:F$218,4,FALSE)=\"\",\"\",VLOOKUP(D26,invullijst!A$11:D$218,4,FALSE))","v":"65+"},515,{"$f":"IF(VLOOKUP($D26,invullijst!$A$11:$M$177,2,FALSE)=\"\",\"\",VLOOKUP($D26,invullijst!$A$11:$M$177,2,FALSE))","v":"Ilona Bergakker disp"},null,{"$f":"IF(VLOOKUP($D26,invullijst!$A$11:$M$177,6,FALSE)=0,\"\",VLOOKUP($D26,invullijst!$A$11:$M$177,6,FALSE))","v":92},null,2,{"$f":"IF($O$3=\"k\",IF(VLOOKUP($L26,invullijst!$A$11:$M$177,11,FALSE)=0,\" \",VLOOKUP($L26,invullijst!$A$11:$M$177,11,FALSE)),\"\")","v":""},{"$f":"IF(VLOOKUP($L26,invullijst!$A$11:$M$218,4,FALSE)=\"\",\"\",VLOOKUP($L26,invullijst!$A$11:$M$218,4,FALSE))","v":"65+"},211,{"$f":"IF(VLOOKUP($L26,invullijst!$A$11:$M$177,2,FALSE)=\"\",\"\",VLOOKUP($L26,invullijst!$A$11:$M$177,2,FALSE))","v":"Ad van den houdt"},null,{"$f":"IF(VLOOKUP($L26,invullijst!$A$11:$M$177,6,FALSE)=0,\"\",VLOOKUP($L26,invullijst!$A$11:$M$177,6,FALSE))","v":96}]
[3,{"$f":"IF($G$3=\"k\",IF(VLOOKUP($D27,invullijst!$A$11:$M$177,11,FALSE)=0,\" \",VLOOKUP($D27,invullijst!$A$11:$M$177,11,FALSE)),\"\")","v":""},{"$f":"IF(VLOOKUP(D27,invullijst!A$11:F$218,4,FALSE)=\"\",\"\",VLOOKUP(D27,invullijst!A$11:D$218,4,FALSE))","v":"65+"},516,{"$f":"IF(VLOOKUP($D27,invullijst!$A$11:$M$177,2,FALSE)=\"\",\"\",VLOOKUP($D27,invullijst!$A$11:$M$177,2,FALSE))","v":"Henry Bergakker disp"},null,{"$f":"IF(VLOOKUP($D27,invullijst!$A$11:$M$177,6,FALSE)=0,\"\",VLOOKUP($D27,invullijst!$A$11:$M$177,6,FALSE))","v":80},null,3,{"$f":"IF($O$3=\"k\",IF(VLOOKUP($L27,invullijst!$A$11:$M$177,11,FALSE)=0,\" \",VLOOKUP($L27,invullijst!$A$11:$M$177,11,FALSE)),\"\")","v":""},{"$f":"IF(VLOOKUP($L27,invullijst!$A$11:$M$218,4,FALSE)=\"\",\"\",VLOOKUP($L27,invullijst!$A$11:$M$218,4,FALSE))","v":"65+"},214,{"$f":"IF(VLOOKUP($L27,invullijst!$A$11:$M$177,2,FALSE)=\"\",\"\",VLOOKUP($L27,invullijst!$A$11:$M$177,2,FALSE))","v":"André de Vaan"},null,{"$f":"IF(VLOOKUP($L27,invullijst!$A$11:$M$177,6,FALSE)=0,\"\",VLOOKUP($L27,invullijst!$A$11:$M$177,6,FALSE))","v":87}]
["Totaal korps opgelegd A1",{"$nulls":5},{"$f":"SUM(G25:G27)","v":267},null,"Totaal korps opgelegd A1",{"$nulls":5},{"$f":"SUM(O25:O27)","v":273}]
[]
[1,{"$f":"IF($G$3=\"k\",IF(VLOOKUP($D30,invullijst!$A$11:$M$177,11,FALSE)=0,\" \",VLOOKUP($D30,invullijst!$A$11:$M$177,11,FALSE)),\"\")","v":""},{"$f":"IF(VLOOKUP(D30,invullijst!A$11:F$218,4,FALSE)=\"\",\"\",VLOOKUP(D30,invullijst!A$11:D$218,4,FALSE))","v":{"$error":"#N/A"}},510,{"$f":"IF(VLOOKUP($D30,invullijst!$A$11:$M$177,2,FALSE)=\"\",\"\",VLOOKUP($D30,invullijst!$A$11:$M$177,2,FALSE))","v":{"$error":"#N/A"}},null,{"$f":"IF(VLOOKUP($D30,invullijst!$A$11:$M$177,6,FALSE)=0,\"\",VLOOKUP($D30,invullijst!$A$11:$M$177,6,FALSE))","v":{"$error":"#N/A"}},null,1,{"$f":"IF($O$3=\"k\",IF(VLOOKUP($L30,invullijst!$A$11:$M$177,11,FALSE)=0,\" \",VLOOKUP($L30,invullijst!$A$11:$M$177,11,FALSE)),\"\")","v":""},{"$f":"IF(VLOOKUP($L30,invullijst!$A$10:$M$218,4,FALSE)=\"\",\"\",VLOOKUP($L30,invullijst!$A$10:$M$218,4,FALSE))","v":0},null,{"$f":"IF(VLOOKUP($L30,invullijst!$A$10:$M$177,2,FALSE)=\"\",\"\",VLOOKUP($L30,invullijst!$A$10:$M$177,2,FALSE))","v":0},null,{"$f":"IF(VLOOKUP($L30,invullijst!$A$10:$M$177,6,FALSE)=0,\"\",VLOOKUP($L30,invullijst!$A$10:$M$177,6,FALSE))","v":""}]
[2,{"$f":"IF($G$3=\"k\",IF(VLOOKUP($D31,invullijst!$A$11:$M$177,11,FALSE)=0,\" \",VLOOKUP($D31,invullijst!$A$11:$M$177,11,FALSE)),\"\")","v":""},{"$f":"IF(VLOOKUP(D31,invullijst!A$11:F$218,4,FALSE)=\"\",\"\",VLOOKUP(D31,invullijst!A$11:D$218,4,FALSE))","v":"65+"},514,{"$f":"IF(VLOOKUP($D31,invullijst!$A$11:$M$177,2,FALSE)=\"\",\"\",VLOOKUP($D31,invullijst!$A$11:$M$177,2,FALSE))","v":"Toon Ophorst"},null,{"$f":"IF(VLOOKUP($D31,invullijst!$A$11:$M$177,6,FALSE)=0,\"\",VLOOKUP($D31,invullijst!$A$11:$M$177,6,FALSE))","v":49},null,2,{"$f":"IF($O$3=\"k\",IF(VLOOKUP($L31,invullijst!$A$11:$M$177,11,FALSE)=0,\" \",VLOOKUP($L31,invullijst!$A$11:$M$177,11,FALSE)),\"\")","v":""},{"$f":"IF(VLOOKUP($L31,invullijst!$A$10:$M$218,4,FALSE)=\"\",\"\",VLOOKUP($L31,invullijst!$A$10:$M$218,4,FALSE))","v":0},null,{"$f":"IF(VLOOKUP($L31,invullijst!$A$10:$M$177,2,FALSE)=\"\",\"\",VLOOKUP($L31,invullijst!$A$10:$M$177,2,FALSE))","v":0},null,{"$f":"IF(VLOOKUP($L31,invullijst!$A$10:$M$177,6,FALSE)=0,\"\",VLOOKUP($L31,invullijst!$A$10:$M$177,6,FALSE))","v":""}]
[3,{"$f":"IF($G$3=\"k\",IF(VLOOKUP($D32,invullijst!$A$11:$M$177,11,FALSE)=0,\" \",VLOOKUP($D32,invullijst!$A$11:$M$177,11,FALSE)),\"\")","v":""},{"$f":"IF(VLOOKUP(D32,invullijst!A$11:F$218,4,FALSE)=\"\",\"\",VLOOKUP(D32,invullijst!A$11:D$218,4,FALSE))","v":"65+"},505,{"$f":"IF(VLOOKUP($D32,invullijst!$A$11:$M$177,2,FALSE)=\"\",\"\",VLOOKUP($D32,invullijst!$A$11:$M$177,2,FALSE))","v":"Leo Wagemakers"},null,{"$f":"IF(VLOOKUP($D32,invullijst!$A$11:$M$177,6,FALSE)=0,\"\",VLOOKUP($D32,invullijst!$A$11:$M$177,6,FALSE))","v":58},null,3,{"$f":"IF($O$3=\"k\",IF(VLOOKUP($L32,invullijst!$A$11:$M$177,11,FALSE)=0,\" \",VLOOKUP($L32,invullijst!$A$11:$M$177,11,FALSE)),\"\")","v":""},{"$f":"IF(VLOOKUP($L32,invullijst!$A$10:$M$218,4,FALSE)=\"\",\"\",VLOOKUP($L32,invullijst!$A$10:$M$218,4,FALSE))","v":0},null,{"$f":"IF(VLOOKUP($L32,invullijst!$A$10:$M$177,2,FALSE)=\"\",\"\",VLOOKUP($L32,invullijst!$A$10:$M$177,2,FALSE))","v":0},null,{"$f":"IF(VLOOKUP($L32,invullijst!$A$10:$M$177,6,FALSE)=0,\"\",VLOOKUP($L32,invullijst!$A$10:$M$177,6,FALSE))","v":""}]
["Totaal korps opgelegd A2",{"$nulls":5},{"$f":"SUM(G30:G32)","v":{"$error":"#N/A"}},null,"Totaal korps opgelegd A2",{"$nulls":5},{"$f":"SUM(O30:O32)","v":0}]
[]
[1,{"$f":"IF($G$3=\"k\",IF(VLOOKUP($D35,invullijst!$A$11:$M$177,11,FALSE)=0,\" \",VLOOKUP($D35,invullijst!$A$11:$M$177,11,FALSE)),\"\")","v":""},{"$f":"IF(VLOOKUP(D35,invullijst!A$10:F$218,4,FALSE)=\"\",\"\",VLOOKUP(D35,invullijst!A$10:D$218,4,FALSE))","v":"65+"},511,{"$f":"IF(VLOOKUP($D35,invullijst!$A$11:$M$177,2,FALSE)=\"\",\"\",VLOOKUP($D35,invullijst!$A$11:$M$177,2,FALSE))","v":"Ton Stans"},null,{"$f":"IF(VLOOKUP($D35,invullijst!$A$11:$M$177,6,FALSE)=0,\"\",VLOOKUP($D35,invullijst!$A$11:$M$177,6,FALSE))","v":85},null,1,{"$f":"IF($O$3=\"k\",IF(VLOOKUP($L35,invullijst!$A$11:$M$177,11,FALSE)=0,\" \",VLOOKUP($L35,invullijst!$A$11:$M$177,11,FALSE)),\"\")","v":""},{"$f":"IF(VLOOKUP($L35,invullijst!$A$11:$M$218,4,FALSE)=\"\",\"\",VLOOKUP($L35,invullijst!$A$11:$M$218,4,FALSE))","v":"vr"},217,{"$f":"IF(VLOOKUP($L35,invullijst!$A$11:$M$177,2,FALSE)=\"\",\"\",VLOOKUP($L35,invullijst!$A$11:$M$177,2,FALSE))","v":"Jānis Jākobsons"},null,{"$f":"IF(VLOOKUP($L35,invullijst!$A$11:$M$177,6,FALSE)=0,\"\",VLOOKUP($L35,invullijst!$A$11:$M$177,6,FALSE))","v":65}]
[2,{"$f":"IF($G$3=\"k\",IF(VLOOKUP($D36,invullijst!$A$11:$M$177,11,FALSE)=0,\" \",VLOOKUP($D36,invullijst!$A$11:$M$177,11,FALSE)),\"\")","v":""},{"$f":"IF(VLOOKUP(D36,invullijst!A$10:F$218,4,FALSE)=\"\",\"\",VLOOKUP(D36,invullijst!A$10:D$218,4,FALSE))","v":0},null,{"$f":"IF(VLOOKUP($D36,invullijst!$A$10:$M$177,2,FALSE)=\"\",\"\",VLOOKUP($D36,invullijst!$A$10:$M$177,2,FALSE))","v":0},null,{"$f":"IF(VLOOKUP($D36,invullijst!$A$10:$M$177,6,FALSE)=0,\"\",VLOOKUP($D36,invullijst!$A$10:$M$177,6,FALSE))","v":""},null,2,{"$f":"IF($O$3=\"k\",IF(VLOOKUP($L36,invullijst!$A$11:$M$177,11,FALSE)=0,\" \",VLOOKUP($L36,invullijst!$A$11:$M$177,11,FALSE)),\"\")","v":""},{"$f":"IF(VLOOKUP($L36,invullijst!$A$10:$M$218,4,FALSE)=\"\",\"\",VLOOKUP($L36,invullijst!$A$10:$M$218,4,FALSE))","v":0},null,{"$f":"IF(VLOOKUP($L36,invullijst!$A$10:$M$177,2,FALSE)=\"\",\"\",VLOOKUP($L36,invullijst!$A$10:$M$177,2,FALSE))","v":0},null,{"$f":"IF(VLOOKUP($L36,invullijst!$A$10:$M$177,6,FALSE)=0,\"\",VLOOKUP($L36,invullijst!$A$10:$M$177,6,FALSE))","v":""}]
[3,{"$f":"IF($G$3=\"k\",IF(VLOOKUP($D37,invullijst!$A$11:$M$177,11,FALSE)=0,\" \",VLOOKUP($D37,invullijst!$A$11:$M$177,11,FALSE)),\"\")","v":""},{"$f":"IF(VLOOKUP(D37,invullijst!A$10:F$218,4,FALSE)=\"\",\"\",VLOOKUP(D37,invullijst!A$10:D$218,4,FALSE))","v":0},null,{"$f":"IF(VLOOKUP($D37,invullijst!$A$10:$M$177,2,FALSE)=\"\",\"\",VLOOKUP($D37,invullijst!$A$10:$M$177,2,FALSE))","v":0},null,{"$f":"IF(VLOOKUP($D37,invullijst!$A$10:$M$177,6,FALSE)=0,\"\",VLOOKUP($D37,invullijst!$A$10:$M$177,6,FALSE))","v":""},null,3,{"$f":"IF($O$3=\"k\",IF(VLOOKUP($L37,invullijst!$A$11:$M$177,11,FALSE)=0,\" \",VLOOKUP($L37,invullijst!$A$11:$M$177,11,FALSE)),\"\")","v":""},{"$f":"IF(VLOOKUP($L37,invullijst!$A$10:$M$218,4,FALSE)=\"\",\"\",VLOOKUP($L37,invullijst!$A$10:$M$218,4,FALSE))","v":0},null,{"$f":"IF(VLOOKUP($L37,invullijst!$A$10:$M$177,2,FALSE)=\"\",\"\",VLOOKUP($L37,invullijst!$A$10:$M$177,2,FALSE))","v":0},null,{"$f":"IF(VLOOKUP($L37,invullijst!$A$10:$M$177,6,FALSE)=0,\"\",VLOOKUP($L37,invullijst!$A$10:$M$177,6,FALSE))","v":""}]
["Totaal korps opgelegd A3",{"$nulls":5},{"$f":"SUM(G35:G37)","v":85},null,"Totaal korps opgelegd A3",{"$nulls":5},{"$f":"IF(VLOOKUP($L38,invullijst!$A$11:$M$177,6,FALSE)=0,\"\",VLOOKUP($L38,invullijst!$A$11:$M$177,6,FALSE))","v":{"$error":"#N/A"}}]

{"sheet":"wedstrijd 1B","index":6,"n_rows":38,"n_cols":15,"rows_kept":38,"merged":[[0,0,0,4],[0,5,0,7],[0,8,0,14],[1,0,1,11],[1,12,1,14],[2,1,2,5],[2,9,2,13],[4,0,4,14],[5,4,5,5],[5,12,5,13],[6,4,6,5],[6,12,6,13],[7,4,7,5],[7,12,7,13],[8,4,8,5],[8,12,8,13],[9,0,9,5],[9,8,9,13],[11,4,11,5],[11,12,11,13],[12,4,12,5],[12,12,12,13],[13,4,13,5],[13,12,13,13],[14,4,14,5],[14,12,14,13],[15,0,15,5],[15,8,15,13],[17,4,17,5],[17,12,17,13],[18,4,18,5],[18,12,18,13],[19,4,19,5],[19,12,19,13],[20,4,20,5],[20,12,20,13],[21,0,21,5],[21,8,21,13],[23,0,23,14],[24,4,24,5],[24,12,24,13],[25,4,25,5],[25,12,25,13],[26,4,26,5],[26,12,26,13],[27,0,27,5],[27,8,27,13],[29,4,29,5],[29,12,29,13],[30,4,30,5],[30,12,30,13],[31,4,31,5],[31,12,31,13],[32,0,32,5],[32,8,32,13],[34,4,34,5],[34,12,34,13],[35,4,35,5],[35,12,35,13],[36,4,36,5],[36,12,36,13],[37,0,37,5],[37,8,37,13]]}
[{"$f":"invullijst!F1","v":"Organisatie"},{"$nulls":4},{"$f":"invullijst!H2","v":"2023 - 2024"},null,null,{"$f":"invullijst!F3","v":"St. Crispinus & Crispinianus Besoijen"}]
["Datum: ",{"$nulls":11},"2023-12-10"]
[4,{"$f":"IF(VLOOKUP(A3,invullijst!A1:F5,2,FALSE)=\"\",\"\",VLOOKUP(A3,invullijst!A1:F5,2,FALSE))","v":"Sint Ambrosius Haarsteeg"},{"$nulls":6},3,{"$f":"IF(VLOOKUP(I3,invullijst!A1:C5,2,FALSE)=\"\",\"\",VLOOKUP(I3,invullijst!A1:C5,2,FALSE))","v":"O.L.V. Schuts Elshout"}]
[]
["vrijehand"]
[1,{"$f":"IF($G$3=\"k\",IF(VLOOKUP($D6,invullijst!$A$10:$M$177,11,FALSE)=0,\" \",VLOOKUP($D6,invullijst!$A$10:$M$177,11,FALSE)),\"\")","v":""},{"$f":"IF(VLOOKUP(D6,invullijst!A$10:F$218,4,FALSE)=\"\",\"\",VLOOKUP(D6,invullijst!A$10:D$218,4,FALSE))","v":"vr"},405,{"$f":"IF(VLOOKUP($D6,invullijst!$A$10:$M$177,2,FALSE)=\"\",\"\",VLOOKUP($D6,invullijst!$A$10:$M$177,2,FALSE))","v":"Jan de Vaan"},null,{"$f":"IF(VLOOKUP($D6,invullijst!$A$10:$M$177,6,FALSE)=0,\"\",VLOOKUP($D6,invullijst!$A$10:$M$177,6,FALSE))","v":86},null,1,{"$f":"IF($O$3=\"k\",IF(VLOOKUP($L6,invullijst!$A$10:$M$177,11,FALSE)=0,\" \",VLOOKUP($L6,invullijst!$A$10:$M$177,11,FALSE)),\"\")","v":""},{"$f":"IF(VLOOKUP($L6,invullijst!$A$10:$M$218,4,FALSE)=\"\",\"\",VLOOKUP($L6,invullijst!$A$10:$M$218,4,FALSE))","v":"vr"},302,{"$f":"IF(VLOOKUP($L6,invullijst!$A$10:$M$177,2,FALSE)=\"\",\"\",VLOOKUP($L6,invullijst!$A$10:$M$177,2,FALSE))","v":"Freek de Jong"},null,{"$f":"IF(VLOOKUP($L6,invullijst!$A$10:$M$177,6,FALSE)=0,\"\",VLOOKUP($L6,invullijst!$A$10:$M$177,6,FALSE))","v":89}]
[2,{"$f":"IF($G$3=\"k\",IF(VLOOKUP($D7,invullijst!$A$10:$M$177,11,FALSE)=0,\" \",VLOOKUP($D7,invullijst!$A$10:$M$177,11,FALSE)),\"\")","v":""},{"$f":"IF(VLOOKUP(D7,invullijst!A$10:F$218,4,FALSE)=\"\",\"\",VLOOKUP(D7,invullijst!A$10:D$218,4,FALSE))","v":"vr"},408,{"$f":"IF(VLOOKUP($D7,invullijst!$A$10:$M$177,2,FALSE)=\"\",\"\",VLOOKUP($D7,invullijst!$A$10:$M$177,2,FALSE))","v":"Rudy van Falier"},null,{"$f":"IF(VLOOKUP($D7,invullijst!$A$10:$M$177,6,FALSE)=0,\"\",VLOOKUP($D7,invullijst!$A$10:$M$177,6,FALSE))","v":86},null,2,{"$f":"IF($O$3=\"k\",IF(VLOOKUP($L7,invullijst!$A$10:$M$177,11,FALSE)=0,\" \",VLOOKUP($L7,invullijst!$A$10:$M$177,11,FALSE)),\"\")","v":""},{"$f":"IF(VLOOKUP($L7,invullijst!$A$10:$M$218,4,FALSE)=\"\",\"\",VLOOKUP($L7,invullijst!$A$10:$M$218,4,FALSE))","v":"vr"},304,{"$f":"IF(VLOOKUP($L7,invullijst!$A$10:$M$177,2,FALSE)=\"\",\"\",VLOOKUP($L7,invullijst!$A$10:$M$177,2,FALSE))","v":"Henk Bruurmijn "},null,{"$f":"IF(VLOOKUP($L7,invullijst!$A$10:$M$177,6,FALSE)=0,\"\",VLOOKUP($L7,invullijst!$A$10:$M$177,6,FALSE))","v":71}]
[3,{"$f":"IF($G$3=\"k\",IF(VLOOKUP($D8,invullijst!$A$10:$M$177,11,FALSE)=0,\" \",VLOOKUP($D8,invullijst!$A$10:$M$177,11,FALSE)),\"\")","v":""},{"$f":"IF(VLOOKUP(D8,invullijst!A$10:F$218,4,FALSE)=\"\",\"\",VLOOKUP(D8,invullijst!A$10:D$218,4,FALSE))","v":"vr"},402,{"$f":"IF(VLOOKUP($D8,invullijst!$A$10:$M$177,2,FALSE)=\"\",\"\",VLOOKUP($D8,invullijst!$A$10:$M$177,2,FALSE))","v":"Daniëlle v/d Lee"},null,{"$f":"IF(VLOOKUP($D8,invullijst!$A$10:$M$177,6,FALSE)=0,\"\",VLOOKUP($D8,invullijst!$A$10:$M$177,6,FALSE))","v":80},null,3,{"$f":"IF($O$3=\"k\",IF(VLOOKUP($L8,invullijst!$A$10:$M$177,11,FALSE)=0,\" \",VLOOKUP($L8,invullijst!$A$10:$M$177,11,FALSE)),\"\")","v":""},{"$f":"IF(VLOOKUP($L8,invullijst!$A$10:$M$218,4,FALSE)=\"\",\"\",VLOOKUP($L8,invullijst!$A$10:$M$218,4,FALSE))","v":"vr"},305,{"$f":"IF(VLOOKUP($L8,invullijst!$A$10:$M$177,2,FALSE)=\"\",\"\",VLOOKUP($L8,invullijst!$A$10:$M$177,2,FALSE))","v":"Johan Klerx"},null,{"$f":"IF(VLOOKUP($L8,invullijst!$A$10:$M$177,6,FALSE)=0,\"\",VLOOKUP($L8,invullijst!$A$10:$M$177,6,FALSE))","v":84}]
[4,{"$f":"IF($G$3=\"k\",IF(VLOOKUP($D9,invullijst!$A$10:$M$177,11,FALSE)=0,\" \",VLOOKUP($D9,invullijst!$A$10:$M$177,11,FALSE)),\"\")","v":""},{"$f":"IF(VLOOKUP(D9,invullijst!A$10:F$218,4,FALSE)=\"\",\"\",VLOOKUP(D9,invullijst!A$10:D$218,4,FALSE))","v":"vr"},406,{"$f":"IF(VLOOKUP($D9,invullijst!$A$10:$M$177,2,FALSE)=\"\",\"\",VLOOKUP($D9,invullijst!$A$10:$M$177,2,FALSE))","v":"Jeroen van Oss"},null,{"$f":"IF(VLOOKUP($D9,invullijst!$A$10:$M$177,6,FALSE)=0,\"\",VLOOKUP($D9,invullijst!$A$10:$M$177,6,FALSE))","v":82},null,4,{"$f":"IF($O$3=\"k\",IF(VLOOKUP($L9,invullijst!$A$10:$M$177,11,FALSE)=0,\" \",VLOOKUP($L9,invullijst!$A$10:$M$177,11,FALSE)),\"\")","v":""},{"$f":"IF(VLOOKUP($L9,invullijst!$A$10:$M$218,4,FALSE)=\"\",\"\",VLOOKUP($L9,invullijst!$A$10:$M$218,4,FALSE))","v":"vr"},308,{"$f":"IF(VLOOKUP($L9,invullijst!$A$10:$M$177,2,FALSE)=\"\",\"\",VLOOKUP($L9,invullijst!$A$10:$M$177,2,FALSE))","v":"Jan van Esch"},null,{"$f":"IF(VLOOKUP($L9,invullijst!$A$10:$M$177,6,FALSE)=0,\"\",VLOOKUP($L9,invullijst!$A$10:$M$177,6,FALSE))","v":60}]
["Totaal A korps",{"$nulls":5},{"$f":"SUM(G6:G9)","v":334},null,"Totaal A korps",{"$nulls":5},{"$f":"SUM(O6:O9)","v":304}]
[]
[1,{"$f":"IF($G$3=\"k\",IF(VLOOKUP($D12,invullijst!$A$10:$M$177,11,FALSE)=0,\" \",VLOOKUP($D12,invullijst!$A$10:$M$177,11,FALSE)),\"\")","v":""},{"$f":"IF(VLOOKUP(D12,invullijst!A$10:F$218,4,FALSE)=\"\",\"\",VLOOKUP(D12,invullijst!A$10:D$218,4,FALSE))","v":"vr"},410,{"$f":"IF(VLOOKUP($D12,invullijst!$A$10:$M$177,2,FALSE)=\"\",\"\",VLOOKUP($D12,invullijst!$A$10:$M$177,2,FALSE))","v":"Tonnie Koks"},null,{"$f":"IF(VLOOKUP($D12,invullijst!$A$10:$M$177,6,FALSE)=0,\"\",VLOOKUP($D12,invullijst!$A$10:$M$177,6,FALSE))","v":85},null,1,{"$f":"IF($O$3=\"k\",IF(VLOOKUP($L12,invullijst!$A$10:$M$177,11,FALSE)=0,\" \",VLOOKUP($L12,invullijst!$A$10:$M$177,11,FALSE)),\"\")","v":""},{"$f":"IF(VLOOKUP($L12,invullijst!$A$10:$M$218,4,FALSE)=\"\",\"\",VLOOKUP($L12,invullijst!$A$10:$M$218,4,FALSE))","v":0},null,{"$f":"IF(VLOOKUP($L12,invullijst!$A$10:$M$177,2,FALSE)=\"\",\"\",VLOOKUP($L12,invullijst!$A$10:$M$177,2,FALSE))","v":0},null,{"$f":"IF(VLOOKUP($L12,invullijst!$A$10:$M$177,6,FALSE)=0,\"\",VLOOKUP($L12,invullijst!$A$10:$M$177,6,FALSE))","v":""}]
[2,{"$f":"IF($G$3=\"k\",IF(VLOOKUP($D13,invullijst!$A$10:$M$177,11,FALSE)=0,\" \",VLOOKUP($D13,invullijst!$A$10:$M$177,11,FALSE)),\"\")","v":""},{"$f":"IF(VLOOKUP(D13,invullijst!A$10:F$218,4,FALSE)=\"\",\"\",VLOOKUP(D13,invullijst!A$10:D$218,4,FALSE))","v":"vr"},407,{"$f":"IF(VLOOKUP($D13,invullijst!$A$10:$M$177,2,FALSE)=\"\",\"\",VLOOKUP($D13,invullijst!$A$10:$M$177,2,FALSE))","v":"Justin van Son"},null,{"$f":"IF(VLOOKUP($D13,invullijst!$A$10:$M$177,6,FALSE)=0,\"\",VLOOKUP($D13,invullijst!$A$10:$M$177,6,FALSE))","v":84},null,2,{"$f":"IF($O$3=\"k\",IF(VLOOKUP($L13,invullijst!$A$10:$M$177,11,FALSE)=0,\" \",VLOOKUP($L13,invullijst!$A$10:$M$177,11,FALSE)),\"\")","v":""},{"$f":"IF(VLOOKUP($L13,invullijst!$A$10:$M$218,4,FALSE)=\"\",\"\",VLOOKUP($L13,invullijst!$A$10:$M$218,4,FALSE))","v":0},null,{"$f":"IF(VLOOKUP($L13,invullijst!$A$10:$M$177,2,FALSE)=\"\",\"\",VLOOKUP($L13,invullijst!$A$10:$M$177,2,FALSE))","v":0},null,{"$f":"IF(VLOOKUP($L13,invullijst!$A$10:$M$177,6,FALSE)=0,\"\",VLOOKUP($L13,invullijst!$A$10:$M$177,6,FALSE))","v":""}]
[3,{"$f":"IF($G$3=\"k\",IF(VLOOKUP($D14,invullijst!$A$10:$M$177,11,FALSE)=0,\" \",VLOOKUP($D14,invullijst!$A$10:$M$177,11,FALSE)),\"\")","v":""},{"$f":"IF(VLOOKUP(D14,invullijst!A$10:F$218,4,FALSE)=\"\",\"\",VLOOKUP(D14,invullijst!A$10:D$218,4,FALSE))","v":0},null,{"$f":"IF(VLOOKUP($D14,invullijst!$A$10:$M$177,2,FALSE)=\"\",\"\",VLOOKUP($D14,invullijst!$A$10:$M$177,2,FALSE))","v":0},null,{"$f":"IF(VLOOKUP($D14,invullijst!$A$10:$M$177,6,FALSE)=0,\"\",VLOOKUP($D14,invullijst!$A$10:$M$177,6,FALSE))","v":""},null,3,{"$f":"IF($O$3=\"k\",IF(VLOOKUP($L14,invullijst!$A$10:$M$177,11,FALSE)=0,\" \",VLOOKUP($L14,invullijst!$A$10:$M$177,11,FALSE)),\"\")","v":""},{"$f":"IF(VLOOKUP($L14,invullijst!$A$10:$M$218,4,FALSE)=\"\",\"\",VLOOKUP($L14,invullijst!$A$10:$M$218,4,FALSE))","v":0},null,{"$f":"IF(VLOOKUP($L14,invullijst!$A$10:$M$177,2,FALSE)=\"\",\"\",VLOOKUP($L14,invullijst!$A$10:$M$177,2,FALSE))","v":0},null,{"$f":"IF(VLOOKUP($L14,invullijst!$A$10:$M$177,6,FALSE)=0,\"\",VLOOKUP($L14,invullijst!$A$10:$M$177,6,FALSE))","v":""}]
[4,{"$f":"IF($G$3=\"k\",IF(VLOOKUP($D15,invullijst!$A$10:$M$177,11,FALSE)=0,\" \",VLOOKUP($D15,invullijst!$A$10:$M$177,11,FALSE)),\"\")","v":""},{"$f":"IF(VLOOKUP(D15,invullijst!A$10:F$218,4,FALSE)=\"\",\"\",VLOOKUP(D15,invullijst!A$10:D$218,4,FALSE))","v":0},null,{"$f":"IF(VLOOKUP($D15,invullijst!$A$10:$M$177,2,FALSE)=\"\",\"\",VLOOKUP($D15,invullijst!$A$10:$M$177,2,FALSE))","v":0},null,{"$f":"IF(VLOOKUP($D15,invullijst!$A$10:$M$177,6,FALSE)=0,\"\",VLOOKUP($D15,invullijst!$A$10:$M$177,6,FALSE))","v":""},null,4,{"$f":"IF($O$3=\"k\",IF(VLOOKUP($L15,invullijst!$A$10:$M$177,11,FALSE)=0,\" \",VLOOKUP($L15,invullijst!$A$10:$M$177,11,FALSE)),\"\")","v":""},{"$f":"IF(VLOOKUP($L15,invullijst!$A$10:$M$218,4,FALSE)=\"\",\"\",VLOOKUP($L15,invullijst!$A$10:$M$218,4,FALSE))","v":0},null,{"$f":"IF(VLOOKUP($L15,invullijst!$A$10:$M$177,2,FALSE)=\"\",\"\",VLOOKUP($L15,invullijst!$A$10:$M$177,2,FALSE))","v":0},null,{"$f":"IF(VLOOKUP($L15,invullijst!$A$10:$M$177,6,FALSE)=0,\"\",VLOOKUP($L15,invullijst!$A$10:$M$177,6,FALSE))","v":""}]
["Totaal B1 korps",{"$nulls":5},{"$f":"SUM(G12:G15)","v":169},null,"Totaal B1 korps",{"$nulls":5},{"$f":"SUM(O12:O15)","v":0}]
[]
[1,{"$f":"IF($G$3=\"k\",IF(VLOOKUP($D18,invullijst!$A$10:$M$177,11,FALSE)=0,\" \",VLOOKUP($D18,invullijst!$A$10:$M$177,11,FALSE)),\"\")","v":""},{"$f":"IF(VLOOKUP(D18,invullijst!A$10:F$218,4,FALSE)=\"\",\"\",VLOOKUP(D18,invullijst!A$10:D$218,4,FALSE))","v":0},null,{"$f":"IF(VLOOKUP($D18,invullijst!$A$10:$M$177,2,FALSE)=\"\",\"\",VLOOKUP($D18,invullijst!$A$10:$M$177,2,FALSE))","v":0},null,{"$f":"IF(VLOOKUP($D18,invullijst!$A$10:$M$177,6,FALSE)=0,\"\",VLOOKUP($D18,invullijst!$A$10:$M$177,6,FALSE))","v":""},null,1,{"$f":"IF($O$3=\"k\",IF(VLOOKUP($L18,invullijst!$A$10:$M$177,11,FALSE)=0,\" \",VLOOKUP($L18,invullijst!$A$10:$M$177,11,FALSE)),\"\")","v":""},{"$f":"IF(VLOOKUP($L18,invullijst!$A$10:$M$218,4,FALSE)=\"\",\"\",VLOOKUP($L18,invullijst!$A$10:$M$218,4,FALSE))","v":0},null,{"$f":"IF(VLOOKUP($L18,invullijst!$A$10:$M$177,2,FALSE)=\"\",\"\",VLOOKUP($L18,invullijst!$A$10:$M$177,2,FALSE))","v":0},null,{"$f":"IF(VLOOKUP($L18,invullijst!$A$10:$M$177,6,FALSE)=0,\"\",VLOOKUP($L18,invullijst!$A$10:$M$177,6,FALSE))","v":""}]
[2,{"$f":"IF($G$3=\"k\",IF(VLOOKUP($D19,invullijst!$A$10:$M$177,11,FALSE)=0,\" \",VLOOKUP($D19,invullijst!$A$10:$M$177,11,FALSE)),\"\")","v":""},{"$f":"IF(VLOOKUP(D19,invullijst!A$10:F$218,4,FALSE)=\"\",\"\",VLOOKUP(D19,invullijst!A$10:D$218,4,FALSE))","v":0},null,{"$f":"IF(VLOOKUP($D19,invullijst!$A$10:$M$177,2,FALSE)=\"\",\"\",VLOOKUP($D19,invullijst!$A$10:$M$177,2,FALSE))","v":0},null,{"$f":"IF(VLOOKUP($D19,invullijst!$A$10:$M$177,6,FALSE)=0,\"\",VLOOKUP($D19,invullijst!$A$10:$M$177,6,FALSE))","v":""},null,2,{"$f":"IF($O$3=\"k\",IF(VLOOKUP($L19,invullijst!$A$10:$M$177,11,FALSE)=0,\" \",VLOOKUP($L19,invullijst!$A$10:$M$177,11,FALSE)),\"\")","v":""},{"$f":"IF(VLOOKUP($L19,invullijst!$A$10:$M$218,4,FALSE)=\"\",\"\",VLOOKUP($L19,invullijst!$A$10:$M$218,4,FALSE))","v":0},null,{"$f":"IF(VLOOKUP($L19,invullijst!$A$10:$M$177,2,FALSE)=\"\",\"\",VLOOKUP($L19,invullijst!$A$10:$M$177,2,FALSE))","v":0},null,{"$f":"IF(VLOOKUP($L19,invullijst!$A$10:$M$177,6,FALSE)=0,\"\",VLOOKUP($L19,invullijst!$A$10:$M$177,6,FALSE))","v":""}]
[3,{"$f":"IF($G$3=\"k\",IF(VLOOKUP($D20,invullijst!$A$10:$M$177,11,FALSE)=0,\" \",VLOOKUP($D20,invullijst!$A$10:$M$177,11,FALSE)),\"\")","v":""},{"$f":"IF(VLOOKUP(D20,invullijst!A$10:F$218,4,FALSE)=\"\",\"\",VLOOKUP(D20,invullijst!A$10:D$218,4,FALSE))","v":0},null,{"$f":"IF(VLOOKUP($D20,invullijst!$A$10:$M$177,2,FALSE)=\"\",\"\",VLOOKUP($D20,invullijst!$A$10:$M$177,2,FALSE))","v":0},null,{"$f":"IF(VLOOKUP($D20,invullijst!$A$10:$M$177,6,FALSE)=0,\"\",VLOOKUP($D20,invullijst!$A$10:$M$177,6,FALSE))","v":""},null,3,{"$f":"IF($O$3=\"k\",IF(VLOOKUP($L20,invullijst!$A$10:$M$177,11,FALSE)=0,\" \",VLOOKUP($L20,invullijst!$A$10:$M$177,11,FALSE)),\"\")","v":""},{"$f":"IF(VLOOKUP($L20,invullijst!$A$10:$M$218,4,FALSE)=\"\",\"\",VLOOKUP($L20,invullijst!$A$10:$M$218,4,FALSE))","v":0},null,{"$f":"IF(VLOOKUP($L20,invullijst!$A$10:$M$177,2,FALSE)=\"\",\"\",VLOOKUP($L20,invullijst!$A$10:$M$177,2,FALSE))","v":0},null,{"$f":"IF(VLOOKUP($L20,invullijst!$A$10:$M$177,6,FALSE)=0,\"\",VLOOKUP($L20,invullijst!$A$10:$M$177,6,FALSE))","v":""}]
[4,{"$f":"IF($G$3=\"k\",IF(VLOOKUP($D21,invullijst!$A$10:$M$177,11,FALSE)=0,\" \",VLOOKUP($D21,invullijst!$A$10:$M$177,11,FALSE)),\"\")","v":""},{"$f":"IF(VLOOKUP(D21,invullijst!A$10:F$218,4,FALSE)=\"\",\"\",VLOOKUP(D21,invullijst!A$10:D$218,4,FALSE))","v":0},null,{"$f":"IF(VLOOKUP($D21,invullijst!$A$10:$M$177,2,FALSE)=\"\",\"\",VLOOKUP($D21,invullijst!$A$10:$M$177,2,FALSE))","v":0},null,{"$f":"IF(VLOOKUP($D21,invullijst!$A$10:$M$177,6,FALSE)=0,\"\",VLOOKUP($D21,invullijst!$A$10:$M$177,6,FALSE))","v":""},null,4,{"$f":"IF($O$3=\"k\",IF(VLOOKUP($L21,invullijst!$A$10:$M$177,11,FALSE)=0,\" \",VLOOKUP($L21,invullijst!$A$10:$M$177,11,FALSE)),\"\")","v":""},{"$f":"IF(VLOOKUP($L21,invullijst!$A$10:$M$218,4,FALSE)=\"\",\"\",VLOOKUP($L21,invullijst!$A$10:$M$218,4,FALSE))","v":0},null,{"$f":"IF(VLOOKUP($L21,invullijst!$A$10:$M$177,2,FALSE)=\"\",\"\",VLOOKUP($L21,invullijst!$A$10:$M$177,2,FALSE))","v":0},null,{"$f":"IF(VLOOKUP($L21,invullijst!$A$10:$M$177,6,FALSE)=0,\"\",VLOOKUP($L21,invullijst!$A$10:$M$177,6,FALSE))","v":""}]
["DIVERSEN / INHAAL",{"$nulls":7},"DIVERSEN / INHAAL"]
[]
["OPGELEGD (Jeugd <16 en 65+)"]
[1,{"$f":"IF($G$3=\"k\",IF(VLOOKUP($D25,invullijst!$A$10:$M$177,11,FALSE)=0,\" \",VLOOKUP($D25,invullijst!$A$10:$M$177,11,FALSE)),\"\")","v":""},{"$f":"IF(VLOOKUP(D25,invullijst!A$10:F$218,4,FALSE)=\"\",\"\",VLOOKUP(D25,invullijst!A$10:D$218,4,FALSE))","v":"65+"},401,{"$f":"IF(VLOOKUP($D25,invullijst!$A$10:$M$177,2,FALSE)=\"\",\"\",VLOOKUP($D25,invullijst!$A$10:$M$177,2,FALSE))","v":"Frans van Beurden"},null,{"$f":"IF(VLOOKUP($D25,invullijst!$A$10:$M$177,6,FALSE)=0,\"\",VLOOKUP($D25,invullijst!$A$10:$M$177,6,FALSE))","v":95},null,1,{"$f":"IF($O$3=\"k\",IF(VLOOKUP($L25,invullijst!$A$10:$M$177,11,FALSE)=0,\" \",VLOOKUP($L25,invullijst!$A$10:$M$177,11,FALSE)),\"\")","v":""},{"$f":"IF(VLOOKUP($L25,invullijst!$A$10:$M$218,4,FALSE)=\"\",\"\",VLOOKUP($L25,invullijst!$A$10:$M$218,4,FALSE))","v":"65+"},307,{"$f":"IF(VLOOKUP($L25,invullijst!$A$10:$M$177,2,FALSE)=\"\",\"\",VLOOKUP($L25,invullijst!$A$10:$M$177,2,FALSE))","v":"Bert van Engelen"},null,{"$f":"IF(VLOOKUP($L25,invullijst!$A$10:$M$177,6,FALSE)=0,\"\",VLOOKUP($L25,invullijst!$A$10:$M$177,6,FALSE))","v":95}]
[2,{"$f":"IF($G$3=\"k\",IF(VLOOKUP($D26,invullijst!$A$10:$M$177,11,FALSE)=0,\" \",VLOOKUP($D26,invullijst!$A$10:$M$177,11,FALSE)),\"\")","v":""},{"$f":"IF(VLOOKUP(D26,invullijst!A$10:F$218,4,FALSE)=\"\",\"\",VLOOKUP(D26,invullijst!A$10:D$218,4,FALSE))","v":"65+"},415,{"$f":"IF(VLOOKUP($D26,invullijst!$A$10:$M$177,2,FALSE)=\"\",\"\",VLOOKUP($D26,invullijst!$A$10:$M$177,2,FALSE))","v":"Wim de Gouw"},null,{"$f":"IF(VLOOKUP($D26,invullijst!$A$10:$M$177,6,FALSE)=0,\"\",VLOOKUP($D26,invullijst!$A$10:$M$177,6,FALSE))","v":95},null,2,{"$f":"IF($O$3=\"k\",IF(VLOOKUP($L26,invullijst!$A$10:$M$177,11,FALSE)=0,\" \",VLOOKUP($L26,invullijst!$A$10:$M$177,11,FALSE)),\"\")","v":""},{"$f":"IF(VLOOKUP($L26,invullijst!$A$10:$M$218,4,FALSE)=\"\",\"\",VLOOKUP($L26,invullijst!$A$10:$M$218,4,FALSE))","v":"65+"},301,{"$f":"IF(VLOOKUP($L26,invullijst!$A$10:$M$177,2,FALSE)=\"\",\"\",VLOOKUP($L26,invullijst!$A$10:$M$177,2,FALSE))","v":"Arjen van Assem disp"},null,{"$f":"IF(VLOOKUP($L26,invullijst!$A$10:$M$177,6,FALSE)=0,\"\",VLOOKUP($L26,invullijst!$A$10:$M$177,6,FALSE))","v":91}]
[3,{"$f":"IF($G$3=\"k\",IF(VLOOKUP($D27,invullijst!$A$10:$M$177,11,FALSE)=0,\" \",VLOOKUP($D27,invullijst!$A$10:$M$177,11,FALSE)),\"\")","v":""},{"$f":"IF(VLOOKUP(D27,invullijst!A$10:F$218,4,FALSE)=\"\",\"\",VLOOKUP(D27,invullijst!A$10:D$218,4,FALSE))","v":"65+"},413,{"$f":"IF(VLOOKUP($D27,invullijst!$A$10:$M$177,2,FALSE)=\"\",\"\",VLOOKUP($D27,invullijst!$A$10:$M$177,2,FALSE))","v":"Frans Mommersteeg"},null,{"$f":"IF(VLOOKUP($D27,invullijst!$A$10:$M$177,6,FALSE)=0,\"\",VLOOKUP($D27,invullijst!$A$10:$M$177,6,FALSE))","v":96},null,3,{"$f":"IF($O$3=\"k\",IF(VLOOKUP($L27,invullijst!$A$10:$M$177,11,FALSE)=0,\" \",VLOOKUP($L27,invullijst!$A$10:$M$177,11,FALSE)),\"\")","v":""},{"$f":"IF(VLOOKUP($L27,invullijst!$A$10:$M$218,4,FALSE)=\"\",\"\",VLOOKUP($L27,invullijst!$A$10:$M$218,4,FALSE))","v":"J"},312,{"$f":"IF(VLOOKUP($L27,invullijst!$A$10:$M$177,2,FALSE)=\"\",\"\",VLOOKUP($L27,invullijst!$A$10:$M$177,2,FALSE))","v":"Floor de Jong"},null,{"$f":"IF(VLOOKUP($L27,invullijst!$A$10:$M$177,6,FALSE)=0,\"\",VLOOKUP($L27,invullijst!$A$10:$M$177,6,FALSE))","v":91}]
["Totaal korps opgelegd A1",{"$nulls":5},{"$f":"SUM(G25:G27)","v":286},null,"Totaal korps opgelegd A1",{"$nulls":5},{"$f":"SUM(O25:O27)","v":277}]
[]
[1,{"$f":"IF($G$3=\"k\",IF(VLOOKUP($D30,invullijst!$A$10:$M$177,11,FALSE)=0,\" \",VLOOKUP($D30,invullijst!$A$10:$M$177,11,FALSE)),\"\")","v":""},{"$f":"IF(VLOOKUP(D30,invullijst!A$10:F$218,4,FALSE)=\"\",\"\",VLOOKUP(D30,invullijst!A$10:D$218,4,FALSE))","v":"65+"},412,{"$f":"IF(VLOOKUP($D30,invullijst!$A$10:$M$177,2,FALSE)=\"\",\"\",VLOOKUP($D30,invullijst!$A$10:$M$177,2,FALSE))","v":"Francien v/d Wiel"},null,{"$f":"IF(VLOOKUP($D30,invullijst!$A$10:$M$177,6,FALSE)=0,\"\",VLOOKUP($D30,invullijst!$A$10:$M$177,6,FALSE))","v":96},null,1,{"$f":"IF($O$3=\"k\",IF(VLOOKUP($L30,invullijst!$A$10:$M$177,11,FALSE)=0,\" \",VLOOKUP($L30,invullijst!$A$10:$M$177,11,FALSE)),\"\")","v":""},{"$f":"IF(VLOOKUP($L30,invullijst!$A$10:$M$218,4,FALSE)=\"\",\"\",VLOOKUP($L30,invullijst!$A$10:$M$218,4,FALSE))","v":"65+"},309,{"$f":"IF(VLOOKUP($L30,invullijst!$A$10:$M$177,2,FALSE)=\"\",\"\",VLOOKUP($L30,invullijst!$A$10:$M$177,2,FALSE))","v":"René de Jong"},null,{"$f":"IF(VLOOKUP($L30,invullijst!$A$10:$M$177,6,FALSE)=0,\"\",VLOOKUP($L30,invullijst!$A$10:$M$177,6,FALSE))","v":88}]
[2,{"$f":"IF($G$3=\"k\",IF(VLOOKUP($D31,invullijst!$A$10:$M$177,11,FALSE)=0,\" \",VLOOKUP($D31,invullijst!$A$10:$M$177,11,FALSE)),\"\")","v":""},{"$f":"IF(VLOOKUP(D31,invullijst!A$10:F$218,4,FALSE)=\"\",\"\",VLOOKUP(D31,invullijst!A$10:D$218,4,FALSE))","v":"65+"},404,{"$f":"IF(VLOOKUP($D31,invullijst!$A$10:$M$177,2,FALSE)=\"\",\"\",VLOOKUP($D31,invullijst!$A$10:$M$177,2,FALSE))","v":"Gerard van Beurden"},null,{"$f":"IF(VLOOKUP($D31,invullijst!$A$10:$M$177,6,FALSE)=0,\"\",VLOOKUP($D31,invullijst!$A$10:$M$177,6,FALSE))","v":93},null,2,{"$f":"IF($O$3=\"k\",IF(VLOOKUP($L31,invullijst!$A$10:$M$177,11,FALSE)=0,\" \",VLOOKUP($L31,invullijst!$A$10:$M$177,11,FALSE)),\"\")","v":""},{"$f":"IF(VLOOKUP($L31,invullijst!$A$10:$M$218,4,FALSE)=\"\",\"\",VLOOKUP($L31,invullijst!$A$10:$M$218,4,FALSE))","v":0},null,{"$f":"IF(VLOOKUP($L31,invullijst!$A$10:$M$177,2,FALSE)=\"\",\"\",VLOOKUP($L31,invullijst!$A$10:$M$177,2,FALSE))","v":0},null,{"$f":"IF(VLOOKUP($L31,invullijst!$A$10:$M$177,6,FALSE)=0,\"\",VLOOKUP($L31,invullijst!$A$10:$M$177,6,FALSE))","v":""}]
[3,{"$f":"IF($G$3=\"k\",IF(VLOOKUP($D32,invullijst!$A$10:$M$177,11,FALSE)=0,\" \",VLOOKUP($D32,invullijst!$A$10:$M$177,11,FALSE)),\"\")","v":""},{"$f":"IF(VLOOKUP(D32,invullijst!A$10:F$218,4,FALSE)=\"\",\"\",VLOOKUP(D32,invullijst!A$10:D$218,4,FALSE))","v":"65+"},403,{"$f":"IF(VLOOKUP($D32,invullijst!$A$10:$M$177,2,FALSE)=\"\",\"\",VLOOKUP($D32,invullijst!$A$10:$M$177,2,FALSE))","v":"Dorien de Kort"},null,{"$f":"IF(VLOOKUP($D32,invullijst!$A$10:$M$177,6,FALSE)=0,\"\",VLOOKUP($D32,invullijst!$A$10:$M$177,6,FALSE))","v":92},null,3,{"$f":"IF($O$3=\"k\",IF(VLOOKUP($L32,invullijst!$A$10:$M$177,11,FALSE)=0,\" \",VLOOKUP($L32,invullijst!$A$10:$M$177,11,FALSE)),\"\")","v":""},{"$f":"IF(VLOOKUP($L32,invullijst!$A$10:$M$218,4,FALSE)=\"\",\"\",VLOOKUP($L32,invullijst!$A$10:$M$218,4,FALSE))","v":0},null,{"$f":"IF(VLOOKUP($L32,invullijst!$A$10:$M$177,2,FALSE)=\"\",\"\",VLOOKUP($L32,invullijst!$A$10:$M$177,2,FALSE))","v":0},null,{"$f":"IF(VLOOKUP($L32,invullijst!$A$10:$M$177,6,FALSE)=0,\"\",VLOOKUP($L32,invullijst!$A$10:$M$177,6,FALSE))","v":""}]
["Totaal korps opgelegd A2",{"$nulls":5},{"$f":"SUM(G30:G32)","v":281},null,"Totaal korps opgelegd A2",{"$nulls":5},{"$f":"SUM(O30:O32)","v":88}]
[]
[1,{"$f":"IF($G$3=\"k\",IF(VLOOKUP($D35,invullijst!$A$10:$M$177,11,FALSE)=0,\" \",VLOOKUP($D35,invullijst!$A$10:$M$177,11,FALSE)),\"\")","v":""},{"$f":"IF(VLOOKUP(D35,invullijst!A$10:F$218,4,FALSE)=\"\",\"\",VLOOKUP(D35,invullijst!A$10:D$218,4,FALSE))","v":0},null,{"$f":"IF(VLOOKUP($D35,invullijst!$A$10:$M$177,2,FALSE)=\"\",\"\",VLOOKUP($D35,invullijst!$A$10:$M$177,2,FALSE))","v":0},null,{"$f":"IF(VLOOKUP($D35,invullijst!$A$10:$M$177,6,FALSE)=0,\"\",VLOOKUP($D35,invullijst!$A$10:$M$177,6,FALSE))","v":""},null,1,{"$f":"IF($O$3=\"k\",IF(VLOOKUP($L35,invullijst!$A$10:$M$177,11,FALSE)=0,\" \",VLOOKUP($L35,invullijst!$A$10:$M$177,11,FALSE)),\"\")","v":""},{"$f":"IF(VLOOKUP($L35,invullijst!$A$10:$M$218,4,FALSE)=\"\",\"\",VLOOKUP($L35,invullijst!$A$10:$M$218,4,FALSE))","v":0},null,{"$f":"IF(VLOOKUP($L35,invullijst!$A$10:$M$177,2,FALSE)=\"\",\"\",VLOOKUP($L35,invullijst!$A$10:$M$177,2,FALSE))","v":0},null,{"$f":"IF(VLOOKUP($L35,invullijst!$A$10:$M$177,6,FALSE)=0,\"\",VLOOKUP($L35,invullijst!$A$10:$M$177,6,FALSE))","v":""}]
[2,{"$f":"IF($G$3=\"k\",IF(VLOOKUP($D36,invullijst!$A$10:$M$177,11,FALSE)=0,\" \",VLOOKUP($D36,invullijst!$A$10:$M$177,11,FALSE)),\"\")","v":""},{"$f":"IF(VLOOKUP(D36,invullijst!A$10:F$218,4,FALSE)=\"\",\"\",VLOOKUP(D36,invullijst!A$10:D$218,4,FALSE))","v":0},null,{"$f":"IF(VLOOKUP($D36,invullijst!$A$10:$M$177,2,FALSE)=\"\",\"\",VLOOKUP($D36,invullijst!$A$10:$M$177,2,FALSE))","v":0},null,{"$f":"IF(VLOOKUP($D36,invullijst!$A$10:$M$177,6,FALSE)=0,\"\",VLOOKUP($D36,invullijst!$A$10:$M$177,6,FALSE))","v":""},null,2,{"$f":"IF($O$3=\"k\",IF(VLOOKUP($L36,invullijst!$A$10:$M$177,11,FALSE)=0,\" \",VLOOKUP($L36,invullijst!$A$10:$M$177,11,FALSE)),\"\")","v":""},{"$f":"IF(VLOOKUP($L36,invullijst!$A$10:$M$218,4,FALSE)=\"\",\"\",VLOOKUP($L36,invullijst!$A$10:$M$218,4,FALSE))","v":0},null,{"$f":"IF(VLOOKUP($L36,invullijst!$A$10:$M$177,2,FALSE)=\"\",\"\",VLOOKUP($L36,invullijst!$A$10:$M$177,2,FALSE))","v":0},null,{"$f":"IF(VLOOKUP($L36,invullijst!$A$10:$M$177,6,FALSE)=0,\"\",VLOOKUP($L36,invullijst!$A$10:$M$177,6,FALSE))","v":""}]
[3,{"$f":"IF($G$3=\"k\",IF(VLOOKUP($D37,invullijst!$A$10:$M$177,11,FALSE)=0,\" \",VLOOKUP($D37,invullijst!$A$10:$M$177,11,FALSE)),\"\")","v":""},{"$f":"IF(VLOOKUP(D37,invullijst!A$10:F$218,4,FALSE)=\"\",\"\",VLOOKUP(D37,invullijst!A$10:D$218,4,FALSE))","v":0},null,{"$f":"IF(VLOOKUP($D37,invullijst!$A$10:$M$177,2,FALSE)=\"\",\"\",VLOOKUP($D37,invullijst!$A$10:$M$177,2,FALSE))","v":0},null,{"$f":"IF(VLOOKUP($D37,invullijst!$A$10:$M$177,6,FALSE)=0,\"\",VLOOKUP($D37,invullijst!$A$10:$M$177,6,FALSE))","v":""},null,3,{"$f":"IF($O$3=\"k\",IF(VLOOKUP($L37,invullijst!$A$10:$M$177,11,FALSE)=0,\" \",VLOOKUP($L37,invullijst!$A$10:$M$177,11,FALSE)),\"\")","v":""},{"$f":"IF(VLOOKUP($L37,invullijst!$A$10:$M$218,4,FALSE)=\"\",\"\",VLOOKUP($L37,invullijst!$A$10:$M$218,4,FALSE))","v":0},null,{"$f":"IF(VLOOKUP($L37,invullijst!$A$10:$M$177,2,FALSE)=\"\",\"\",VLOOKUP($L37,invullijst!$A$10:$M$177,2,FALSE))","v":0},null,{"$f":"IF(VLOOKUP($L37,invullijst!$A$10:$M$177,6,FALSE)=0,\"\",VLOOKUP($L37,invullijst!$A$10:$M$177,6,FALSE))","v":""}]
["Totaal korps opgelegd A3",{"$nulls":5},{"$f":"SUM(G35:G37)","v":0},null,"Totaal korps opgelegd A3",{"$nulls":5},{"$f":"SUM(O35:O37)","v":0}]

{"sheet":"wedstrijd 2A","index":7,"n_rows":38,"n_cols":15,"rows_kept":38,"merged":[[0,0,0,4],[0,5,0,7],[0,8,0,14],[1,0,1,11],[1,12,1,14],[2,1,2,5],[2,9,2,13],[4,0,4,14],[5,4,5,5],[5,12,5,13],[6,4,6,5],[6,12,6,13],[7,4,7,5],[7,12,7,13],[8,4,8,5],[8,12,8,13],[9,0,9,5],[9,8,9,13],[11,4,11,5],[11,12,11,13],[12,4,12,5],[12,12,12,13],[13,4,13,5],[13,12,13,13],[14,4,14,5],[14,12,14,13],[15,0,15,5],[15,8,15,13],[17,4,17,5],[17,12,17,13],[18,4,18,5],[18,12,18,13],[19,4,19,5],[19,12,19,13],[20,4,20,5],[20,12,20,13],[21,0,21,5],[21,8,21,13],[23,0,23,14],[24,4,24,5],[24,12,24,13],[25,4,25,5],[25,12,25,13],[26,4,26,5],[26,12,26,13],[27,0,27,5],[27,8,27,13],[29,4,29,5],[29,12,29,13],[30,4,30,5],[30,12,30,13],[31,4,31,5],[31,12,31,13],[32,0,32,5],[32,8,32,13],[34,4,34,5],[34,12,34,13],[35,4,35,5],[35,12,35,13],[36,4,36,5],[36,12,36,13],[37,0,37,5],[37,8,37,13]]}
[{"$f":"invullijst!F1","v":"Organisatie"},{"$nulls":4},{"$f":"invullijst!H2","v":"2023 - 2024"},null,null,{"$f":"invullijst!F3","v":"St. Crispinus & Crispinianus Besoijen"}]
["Datum: ",{"$nulls":11},"2024-02-21"]
[4,{"$f":"IF(VLOOKUP(A3,invullijst!A1:F5,2,FALSE)=\"\",\"\",VLOOKUP(A3,invullijst!A1:F5,2,FALSE))","v":"Sint Ambrosius Haarsteeg"},{"$nulls":6},2,{"$f":"IF(VLOOKUP(I3,invullijst!A1:C5,2,FALSE)=\"\",\"\",VLOOKUP(I3,invullijst!A1:C5,2,FALSE))","v":"St. Crispinus & Crispinianus Besoijen"}]
[]
["vrijehand"]
[1,{"$f":"IF($G$3=\"k\",IF(VLOOKUP($D6,invullijst!$A$10:$M$177,11,FALSE)=0,\" \",VLOOKUP($D6,invullijst!$A$10:$M$177,11,FALSE)),\"\")","v":""},{"$f":"IF(VLOOKUP(D6,invullijst!A$10:F$218,4,FALSE)=\"\",\"\",VLOOKUP(D6,invullijst!A$10:D$218,4,FALSE))","v":"vr"},405,{"$f":"IF(VLOOKUP($D6,invullijst!$A$10:$M$177,2,FALSE)=\"\",\"\",VLOOKUP($D6,invullijst!$A$10:$M$177,2,FALSE))","v":"Jan de Vaan"},null,{"$f":"IF(VLOOKUP($D6,invullijst!$A$10:$M$177,7,FALSE)=0,\"\",VLOOKUP($D6,invullijst!$A$10:$M$177,7,FALSE))","v":85},null,1,{"$f":"IF($O$3=\"k\",IF(VLOOKUP($L6,invullijst!$A$10:$M$177,11,FALSE)=0,\" \",VLOOKUP($L6,invullijst!$A$10:$M$177,11,FALSE)),\"\")","v":""},{"$f":"IF(VLOOKUP($L6,invullijst!$A$10:$M$218,4,FALSE)=\"\",\"\",VLOOKUP($L6,invullijst!$A$10:$M$218,4,FALSE))","v":"vr"},201,{"$f":"IF(VLOOKUP($L6,invullijst!$A$10:$M$177,2,FALSE)=\"\",\"\",VLOOKUP($L6,invullijst!$A$10:$M$177,2,FALSE))","v":"Sander Oome"},null,{"$f":"IF(VLOOKUP($L6,invullijst!$A$10:$M$177,7,FALSE)=0,\"\",VLOOKUP($L6,invullijst!$A$10:$M$177,7,FALSE))","v":92}]
[2,{"$f":"IF($G$3=\"k\",IF(VLOOKUP($D7,invullijst!$A$10:$M$177,11,FALSE)=0,\" \",VLOOKUP($D7,invullijst!$A$10:$M$177,11,FALSE)),\"\")","v":""},{"$f":"IF(VLOOKUP(D7,invullijst!A$10:F$218,4,FALSE)=\"\",\"\",VLOOKUP(D7,invullijst!A$10:D$218,4,FALSE))","v":"vr"},410,{"$f":"IF(VLOOKUP($D7,invullijst!$A$10:$M$177,2,FALSE)=\"\",\"\",VLOOKUP($D7,invullijst!$A$10:$M$177,2,FALSE))","v":"Tonnie Koks"},null,{"$f":"IF(VLOOKUP($D7,invullijst!$A$10:$M$177,7,FALSE)=0,\"\",VLOOKUP($D7,invullijst!$A$10:$M$177,7,FALSE))","v":84},null,2,{"$f":"IF($O$3=\"k\",IF(VLOOKUP($L7,invullijst!$A$10:$M$177,11,FALSE)=0,\" \",VLOOKUP($L7,invullijst!$A$10:$M$177,11,FALSE)),\"\")","v":""},{"$f":"IF(VLOOKUP($L7,invullijst!$A$10:$M$218,4,FALSE)=\"\",\"\",VLOOKUP($L7,invullijst!$A$10:$M$218,4,FALSE))","v":"vr"},206,{"$f":"IF(VLOOKUP($L7,invullijst!$A$10:$M$177,2,FALSE)=\"\",\"\",VLOOKUP($L7,invullijst!$A$10:$M$177,2,FALSE))","v":"Kees van Hulten"},null,{"$f":"IF(VLOOKUP($L7,invullijst!$A$10:$M$177,7,FALSE)=0,\"\",VLOOKUP($L7,invullijst!$A$10:$M$177,7,FALSE))","v":85}]
[3,{"$f":"IF($G$3=\"k\",IF(VLOOKUP($D8,invullijst!$A$10:$M$177,11,FALSE)=0,\" \",VLOOKUP($D8,invullijst!$A$10:$M$177,11,FALSE)),\"\")","v":""},{"$f":"IF(VLOOKUP(D8,invullijst!A$10:F$218,4,FALSE)=\"\",\"\",VLOOKUP(D8,invullijst!A$10:D$218,4,FALSE))","v":"vr"},406,{"$f":"IF(VLOOKUP($D8,invullijst!$A$10:$M$177,2,FALSE)=\"\",\"\",VLOOKUP($D8,invullijst!$A$10:$M$177,2,FALSE))","v":"Jeroen van Oss"},null,{"$f":"IF(VLOOKUP($D8,invullijst!$A$10:$M$177,7,FALSE)=0,\"\",VLOOKUP($D8,invullijst!$A$10:$M$177,7,FALSE))","v":82},null,3,{"$f":"IF($O$3=\"k\",IF(VLOOKUP($L8,invullijst!$A$10:$M$177,11,FALSE)=0,\" \",VLOOKUP($L8,invullijst!$A$10:$M$177,11,FALSE)),\"\")","v":""},{"$f":"IF(VLOOKUP($L8,invullijst!$A$10:$M$218,4,FALSE)=\"\",\"\",VLOOKUP($L8,invullijst!$A$10:$M$218,4,FALSE))","v":"vr"},203,{"$f":"IF(VLOOKUP($L8,invullijst!$A$10:$M$177,2,FALSE)=\"\",\"\",VLOOKUP($L8,invullijst!$A$10:$M$177,2,FALSE))","v":"Frank van den Houdt"},null,{"$f":"IF(VLOOKUP($L8,invullijst!$A$10:$M$177,7,FALSE)=0,\"\",VLOOKUP($L8,invullijst!$A$10:$M$177,7,FALSE))","v":82}]
[4,{"$f":"IF($G$3=\"k\",IF(VLOOKUP($D9,invullijst!$A$10:$M$177,11,FALSE)=0,\" \",VLOOKUP($D9,invullijst!$A$10:$M$177,11,FALSE)),\"\")","v":""},{"$f":"IF(VLOOKUP(D9,invullijst!A$10:F$218,4,FALSE)=\"\",\"\",VLOOKUP(D9,invullijst!A$10:D$218,4,FALSE))","v":"vr"},408,{"$f":"IF(VLOOKUP($D9,invullijst!$A$10:$M$177,2,FALSE)=\"\",\"\",VLOOKUP($D9,invullijst!$A$10:$M$177,2,FALSE))","v":"Rudy van Falier"},null,{"$f":"IF(VLOOKUP($D9,invullijst!$A$10:$M$177,7,FALSE)=0,\"\",VLOOKUP($D9,invullijst!$A$10:$M$177,7,FALSE))","v":79},null,4,{"$f":"IF($O$3=\"k\",IF(VLOOKUP($L9,invullijst!$A$10:$M$177,11,FALSE)=0,\" \",VLOOKUP($L9,invullijst!$A$10:$M$177,11,FALSE)),\"\")","v":""},{"$f":"IF(VLOOKUP($L9,invullijst!$A$10:$M$218,4,FALSE)=\"\",\"\",VLOOKUP($L9,invullijst!$A$10:$M$218,4,FALSE))","v":"vr"},205,{"$f":"IF(VLOOKUP($L9,invullijst!$A$10:$M$177,2,FALSE)=\"\",\"\",VLOOKUP($L9,invullijst!$A$10:$M$177,2,FALSE))","v":"Jos v/d Snepscheut"},null,{"$f":"IF(VLOOKUP($L9,invullijst!$A$10:$M$177,7,FALSE)=0,\"\",VLOOKUP($L9,invullijst!$A$10:$M$177,7,FALSE))","v":83}]
["Totaal A korps",{"$nulls":5},{"$f":"SUM(G6:G9)","v":330},null,"Totaal A korps",{"$nulls":5},{"$f":"SUM(O6:O9)","v":342}]
[]
[1,{"$f":"IF($G$3=\"k\",IF(VLOOKUP($D12,invullijst!$A$10:$M$177,11,FALSE)=0,\" \",VLOOKUP($D12,invullijst!$A$10:$M$177,11,FALSE)),\"\")","v":""},{"$f":"IF(VLOOKUP(D12,invullijst!A$10:F$218,4,FALSE)=\"\",\"\",VLOOKUP(D12,invullijst!A$10:D$218,4,FALSE))","v":"vr"},402,{"$f":"IF(VLOOKUP($D12,invullijst!$A$10:$M$177,2,FALSE)=\"\",\"\",VLOOKUP($D12,invullijst!$A$10:$M$177,2,FALSE))","v":"Daniëlle v/d Lee"},null,{"$f":"IF(VLOOKUP($D12,invullijst!$A$10:$M$177,7,FALSE)=0,\"\",VLOOKUP($D12,invullijst!$A$10:$M$177,7,FALSE))","v":79},null,1,{"$f":"IF($O$3=\"k\",IF(VLOOKUP($L12,invullijst!$A$10:$M$177,11,FALSE)=0,\" \",VLOOKUP($L12,invullijst!$A$10:$M$177,11,FALSE)),\"\")","v":""},{"$f":"IF(VLOOKUP($L12,invullijst!$A$10:$M$218,4,FALSE)=\"\",\"\",VLOOKUP($L12,invullijst!$A$10:$M$218,4,FALSE))","v":"vr"},209,{"$f":"IF(VLOOKUP($L12,invullijst!$A$10:$M$177,2,FALSE)=\"\",\"\",VLOOKUP($L12,invullijst!$A$10:$M$177,2,FALSE))","v":"René van Kuijk"},null,{"$f":"IF(VLOOKUP($L12,invullijst!$A$10:$M$177,7,FALSE)=0,\"\",VLOOKUP($L12,invullijst!$A$10:$M$177,7,FALSE))","v":80}]
[2,{"$f":"IF($G$3=\"k\",IF(VLOOKUP($D13,invullijst!$A$10:$M$177,11,FALSE)=0,\" \",VLOOKUP($D13,invullijst!$A$10:$M$177,11,FALSE)),\"\")","v":""},{"$f":"IF(VLOOKUP(D13,invullijst!A$10:F$218,4,FALSE)=\"\",\"\",VLOOKUP(D13,invullijst!A$10:D$218,4,FALSE))","v":0},null,{"$f":"IF(VLOOKUP($D13,invullijst!$A$10:$M$177,2,FALSE)=\"\",\"\",VLOOKUP($D13,invullijst!$A$10:$M$177,2,FALSE))","v":0},null,{"$f":"IF(VLOOKUP($D13,invullijst!$A$10:$M$177,7,FALSE)=0,\"\",VLOOKUP($D13,invullijst!$A$10:$M$177,7,FALSE))","v":""},null,2,{"$f":"IF($O$3=\"k\",IF(VLOOKUP($L13,invullijst!$A$10:$M$177,11,FALSE)=0,\" \",VLOOKUP($L13,invullijst!$A$10:$M$177,11,FALSE)),\"\")","v":""},{"$f":"IF(VLOOKUP($L13,invullijst!$A$10:$M$218,4,FALSE)=\"\",\"\",VLOOKUP($L13,invullijst!$A$10:$M$218,4,FALSE))","v":"vr"},215,{"$f":"IF(VLOOKUP($L13,invullijst!$A$10:$M$177,2,FALSE)=\"\",\"\",VLOOKUP($L13,invullijst!$A$10:$M$177,2,FALSE))","v":"Pieter Laghuwitz"},null,{"$f":"IF(VLOOKUP($L13,invullijst!$A$10:$M$177,7,FALSE)=0,\"\",VLOOKUP($L13,invullijst!$A$10:$M$177,7,FALSE))","v":74}]
[3,{"$f":"IF($G$3=\"k\",IF(VLOOKUP($D14,invullijst!$A$10:$M$177,11,FALSE)=0,\" \",VLOOKUP($D14,invullijst!$A$10:$M$177,11,FALSE)),\"\")","v":""},{"$f":"IF(VLOOKUP(D14,invullijst!A$10:F$218,4,FALSE)=\"\",\"\",VLOOKUP(D14,invullijst!A$10:D$218,4,FALSE))","v":0},null,{"$f":"IF(VLOOKUP($D14,invullijst!$A$10:$M$177,2,FALSE)=\"\",\"\",VLOOKUP($D14,invullijst!$A$10:$M$177,2,FALSE))","v":0},null,{"$f":"IF(VLOOKUP($D14,invullijst!$A$10:$M$177,7,FALSE)=0,\"\",VLOOKUP($D14,invullijst!$A$10:$M$177,7,FALSE))","v":""},null,3,{"$f":"IF($O$3=\"k\",IF(VLOOKUP($L14,invullijst!$A$10:$M$177,11,FALSE)=0,\" \",VLOOKUP($L14,invullijst!$A$10:$M$177,11,FALSE)),\"\")","v":""},{"$f":"IF(VLOOKUP($L14,invullijst!$A$10:$M$218,4,FALSE)=\"\",\"\",VLOOKUP($L14,invullijst!$A$10:$M$218,4,FALSE))","v":"vr"},208,{"$f":"IF(VLOOKUP($L14,invullijst!$A$10:$M$177,2,FALSE)=\"\",\"\",VLOOKUP($L14,invullijst!$A$10:$M$177,2,FALSE))","v":"Erin van Hulten"},null,{"$f":"IF(VLOOKUP($L14,invullijst!$A$10:$M$177,7,FALSE)=0,\"\",VLOOKUP($L14,invullijst!$A$10:$M$177,7,FALSE))","v":80}]
[4,{"$f":"IF($G$3=\"k\",IF(VLOOKUP($D15,invullijst!$A$10:$M$177,11,FALSE)=0,\" \",VLOOKUP($D15,invullijst!$A$10:$M$177,11,FALSE)),\"\")","v":""},{"$f":"IF(VLOOKUP(D15,invullijst!A$10:F$218,4,FALSE)=\"\",\"\",VLOOKUP(D15,invullijst!A$10:D$218,4,FALSE))","v":0},null,{"$f":"IF(VLOOKUP($D15,invullijst!$A$10:$M$177,2,FALSE)=\"\",\"\",VLOOKUP($D15,invullijst!$A$10:$M$177,2,FALSE))","v":0},null,{"$f":"IF(VLOOKUP($D15,invullijst!$A$10:$M$177,7,FALSE)=0,\"\",VLOOKUP($D15,invullijst!$A$10:$M$177,7,FALSE))","v":""},null,4,{"$f":"IF($O$3=\"k\",IF(VLOOKUP($L15,invullijst!$A$10:$M$177,11,FALSE)=0,\" \",VLOOKUP($L15,invullijst!$A$10:$M$177,11,FALSE)),\"\")","v":""},{"$f":"IF(VLOOKUP($L15,invullijst!$A$10:$M$218,4,FALSE)=\"\",\"\",VLOOKUP($L15,invullijst!$A$10:$M$218,4,FALSE))","v":"vr"},204,{"$f":"IF(VLOOKUP($L15,invullijst!$A$10:$M$177,2,FALSE)=\"\",\"\",VLOOKUP($L15,invullijst!$A$10:$M$177,2,FALSE))","v":"Harry de Louw"},null,{"$f":"IF(VLOOKUP($L15,invullijst!$A$10:$M$177,7,FALSE)=0,\"\",VLOOKUP($L15,invullijst!$A$10:$M$177,7,FALSE))","v":81}]
["Totaal B1 korps",{"$nulls":5},{"$f":"SUM(G12:G15)","v":79},null,"Totaal B1 korps",{"$nulls":5},{"$f":"SUM(O12:O15)","v":315}]
[]
[1,{"$f":"IF($G$3=\"k\",IF(VLOOKUP($D18,invullijst!$A$10:$M$177,11,FALSE)=0,\" \",VLOOKUP($D18,invullijst!$A$10:$M$177,11,FALSE)),\"\")","v":""},{"$f":"IF(VLOOKUP(D18,invullijst!A$10:F$218,4,FALSE)=\"\",\"\",VLOOKUP(D18,invullijst!A$10:D$218,4,FALSE))","v":0},null,{"$f":"IF(VLOOKUP($D18,invullijst!$A$10:$M$177,2,FALSE)=\"\",\"\",VLOOKUP($D18,invullijst!$A$10:$M$177,2,FALSE))","v":0},null,{"$f":"IF(VLOOKUP($D18,invullijst!$A$10:$M$177,7,FALSE)=0,\"\",VLOOKUP($D18,invullijst!$A$10:$M$177,7,FALSE))","v":""},null,1,{"$f":"IF($O$3=\"k\",IF(VLOOKUP($L18,invullijst!$A$10:$M$177,11,FALSE)=0,\" \",VLOOKUP($L18,invullijst!$A$10:$M$177,11,FALSE)),\"\")","v":""},{"$f":"IF(VLOOKUP($L18,invullijst!$A$10:$M$218,4,FALSE)=\"\",\"\",VLOOKUP($L18,invullijst!$A$10:$M$218,4,FALSE))","v":"vr"},216,{"$f":"IF(VLOOKUP($L18,invullijst!$A$10:$M$177,2,FALSE)=\"\",\"\",VLOOKUP($L18,invullijst!$A$10:$M$177,2,FALSE))","v":"Hans Laghuwitz"},null,{"$f":"IF(VLOOKUP($L18,invullijst!$A$10:$M$177,7,FALSE)=0,\"\",VLOOKUP($L18,invullijst!$A$10:$M$177,7,FALSE))","v":74}]
[2,{"$f":"IF($G$3=\"k\",IF(VLOOKUP($D19,invullijst!$A$10:$M$177,11,FALSE)=0,\" \",VLOOKUP($D19,invullijst!$A$10:$M$177,11,FALSE)),\"\")","v":""},{"$f":"IF(VLOOKUP(D19,invullijst!A$10:F$218,4,FALSE)=\"\",\"\",VLOOKUP(D19,invullijst!A$10:D$218,4,FALSE))","v":0},null,{"$f":"IF(VLOOKUP($D19,invullijst!$A$10:$M$177,2,FALSE)=\"\",\"\",VLOOKUP($D19,invullijst!$A$10:$M$177,2,FALSE))","v":0},null,{"$f":"IF(VLOOKUP($D19,invullijst!$A$10:$M$177,7,FALSE)=0,\"\",VLOOKUP($D19,invullijst!$A$10:$M$177,7,FALSE))","v":""},null,2,{"$f":"IF($O$3=\"k\",IF(VLOOKUP($L19,invullijst!$A$10:$M$177,11,FALSE)=0,\" \",VLOOKUP($L19,invullijst!$A$10:$M$177,11,FALSE)),\"\")","v":""},{"$f":"IF(VLOOKUP($L19,invullijst!$A$10:$M$218,4,FALSE)=\"\",\"\",VLOOKUP($L19,invullijst!$A$10:$M$218,4,FALSE))","v":"vr"},213,{"$f":"IF(VLOOKUP($L19,invullijst!$A$10:$M$177,2,FALSE)=\"\",\"\",VLOOKUP($L19,invullijst!$A$10:$M$177,2,FALSE))","v":"Roland van Delft"},null,{"$f":"IF(VLOOKUP($L19,invullijst!$A$10:$M$177,7,FALSE)=0,\"\",VLOOKUP($L19,invullijst!$A$10:$M$177,7,FALSE))","v":59}]
[3,{"$f":"IF($G$3=\"k\",IF(VLOOKUP($D20,invullijst!$A$10:$M$177,11,FALSE)=0,\" \",VLOOKUP($D20,invullijst!$A$10:$M$177,11,FALSE)),\"\")","v":""},{"$f":"IF(VLOOKUP(D20,invullijst!A$10:F$218,4,FALSE)=\"\",\"\",VLOOKUP(D20,invullijst!A$10:D$218,4,FALSE))","v":0},null,{"$f":"IF(VLOOKUP($D20,invullijst!$A$10:$M$177,2,FALSE)=\"\",\"\",VLOOKUP($D20,invullijst!$A$10:$M$177,2,FALSE))","v":0},null,{"$f":"IF(VLOOKUP($D20,invullijst!$A$10:$M$177,7,FALSE)=0,\"\",VLOOKUP($D20,invullijst!$A$10:$M$177,7,FALSE))","v":""},null,3,{"$f":"IF($O$3=\"k\",IF(VLOOKUP($L20,invullijst!$A$10:$M$177,11,FALSE)=0,\" \",VLOOKUP($L20,invullijst!$A$10:$M$177,11,FALSE)),\"\")","v":""},{"$f":"IF(VLOOKUP($L20,invullijst!$A$10:$M$218,4,FALSE)=\"\",\"\",VLOOKUP($L20,invullijst!$A$10:$M$218,4,FALSE))","v":"vr"},210,{"$f":"IF(VLOOKUP($L20,invullijst!$A$10:$M$177,2,FALSE)=\"\",\"\",VLOOKUP($L20,invullijst!$A$10:$M$177,2,FALSE))","v":"Nick de Vaan"},null,{"$f":"IF(VLOOKUP($L20,invullijst!$A$10:$M$177,7,FALSE)=0,\"\",VLOOKUP($L20,invullijst!$A$10:$M$177,7,FALSE))","v":63}]
[4,{"$f":"IF($G$3=\"k\",IF(VLOOKUP($D21,invullijst!$A$10:$M$177,11,FALSE)=0,\" \",VLOOKUP($D21,invullijst!$A$10:$M$177,11,FALSE)),\"\")","v":""},{"$f":"IF(VLOOKUP(D21,invullijst!A$10:F$218,4,FALSE)=\"\",\"\",VLOOKUP(D21,invullijst!A$10:D$218,4,FALSE))","v":0},null,{"$f":"IF(VLOOKUP($D21,invullijst!$A$10:$M$177,2,FALSE)=\"\",\"\",VLOOKUP($D21,invullijst!$A$10:$M$177,2,FALSE))","v":0},null,{"$f":"IF(VLOOKUP($D21,invullijst!$A$10:$M$177,7,FALSE)=0,\"\",VLOOKUP($D21,invullijst!$A$10:$M$177,7,FALSE))","v":""},null,4,{"$f":"IF($O$3=\"k\",IF(VLOOKUP($L21,invullijst!$A$10:$M$177,11,FALSE)=0,\" \",VLOOKUP($L21,invullijst!$A$10:$M$177,11,FALSE)),\"\")","v":""},{"$f":"IF(VLOOKUP($L21,invullijst!$A$10:$M$218,4,FALSE)=\"\",\"\",VLOOKUP($L21,invullijst!$A$10:$M$218,4,FALSE))","v":"vr"},217,{"$f":"IF(VLOOKUP($L21,invullijst!$A$10:$M$177,2,FALSE)=\"\",\"\",VLOOKUP($L21,invullijst!$A$10:$M$177,2,FALSE))","v":"Jānis Jākobsons"},null,{"$f":"IF(VLOOKUP($L21,invullijst!$A$10:$M$177,7,FALSE)=0,\"\",VLOOKUP($L21,invullijst!$A$10:$M$177,7,FALSE))","v":72}]
["DIVERSEN / INHAAL",{"$nulls":7},"DIVERSEN / INHAAL"]
[]
["OPGELEGD (Jeugd <16 en 65+)"]
[1,{"$f":"IF($G$3=\"k\",IF(VLOOKUP($D25,invullijst!$A$10:$M$177,11,FALSE)=0,\" \",VLOOKUP($D25,invullijst!$A$10:$M$177,11,FALSE)),\"\")","v":""},{"$f":"IF(VLOOKUP(D25,invullijst!A$10:F$218,4,FALSE)=\"\",\"\",VLOOKUP(D25,invullijst!A$10:D$218,4,FALSE))","v":"65+"},404,{"$f":"IF(VLOOKUP($D25,invullijst!$A$10:$M$177,2,FALSE)=\"\",\"\",VLOOKUP($D25,invullijst!$A$10:$M$177,2,FALSE))","v":"Gerard van Beurden"},null,{"$f":"IF(VLOOKUP($D25,invullijst!$A$10:$M$177,7,FALSE)=0,\"\",VLOOKUP($D25,invullijst!$A$10:$M$177,7,FALSE))","v":97},null,1,{"$f":"IF($O$3=\"k\",IF(VLOOKUP($L25,invullijst!$A$10:$M$177,11,FALSE)=0,\" \",VLOOKUP($L25,invullijst!$A$10:$M$177,11,FALSE)),\"\")","v":""},{"$f":"IF(VLOOKUP($L25,invullijst!$A$10:$M$218,4,FALSE)=\"\",\"\",VLOOKUP($L25,invullijst!$A$10:$M$218,4,FALSE))","v":"65+"},211,{"$f":"IF(VLOOKUP($L25,invullijst!$A$10:$M$177,2,FALSE)=\"\",\"\",VLOOKUP($L25,invullijst!$A$10:$M$177,2,FALSE))","v":"Ad van den houdt"},null,{"$f":"IF(VLOOKUP($L25,invullijst!$A$10:$M$177,7,FALSE)=0,\"\",VLOOKUP($L25,invullijst!$A$10:$M$177,7,FALSE))","v":88}]
[2,{"$f":"IF($G$3=\"k\",IF(VLOOKUP($D26,invullijst!$A$10:$M$177,11,FALSE)=0,\" \",VLOOKUP($D26,invullijst!$A$10:$M$177,11,FALSE)),\"\")","v":""},{"$f":"IF(VLOOKUP(D26,invullijst!A$10:F$218,4,FALSE)=\"\",\"\",VLOOKUP(D26,invullijst!A$10:D$218,4,FALSE))","v":"65+"},401,{"$f":"IF(VLOOKUP($D26,invullijst!$A$10:$M$177,2,FALSE)=\"\",\"\",VLOOKUP($D26,invullijst!$A$10:$M$177,2,FALSE))","v":"Frans van Beurden"},null,{"$f":"IF(VLOOKUP($D26,invullijst!$A$10:$M$177,7,FALSE)=0,\"\",VLOOKUP($D26,invullijst!$A$10:$M$177,7,FALSE))","v":97},null,2,{"$f":"IF($O$3=\"k\",IF(VLOOKUP($L26,invullijst!$A$10:$M$177,11,FALSE)=0,\" \",VLOOKUP($L26,invullijst!$A$10:$M$177,11,FALSE)),\"\")","v":""},{"$f":"IF(VLOOKUP($L26,invullijst!$A$10:$M$218,4,FALSE)=\"\",\"\",VLOOKUP($L26,invullijst!$A$10:$M$218,4,FALSE))","v":"65+"},212,{"$f":"IF(VLOOKUP($L26,invullijst!$A$10:$M$177,2,FALSE)=\"\",\"\",VLOOKUP($L26,invullijst!$A$10:$M$177,2,FALSE))","v":"René Duquesnoy"},null,{"$f":"IF(VLOOKUP($L26,invullijst!$A$10:$M$177,7,FALSE)=0,\"\",VLOOKUP($L26,invullijst!$A$10:$M$177,7,FALSE))","v":87}]
[3,{"$f":"IF($G$3=\"k\",IF(VLOOKUP($D27,invullijst!$A$10:$M$177,11,FALSE)=0,\" \",VLOOKUP($D27,invullijst!$A$10:$M$177,11,FALSE)),\"\")","v":""},{"$f":"IF(VLOOKUP(D27,invullijst!A$10:F$218,4,FALSE)=\"\",\"\",VLOOKUP(D27,invullijst!A$10:D$218,4,FALSE))","v":"65+"},415,{"$f":"IF(VLOOKUP($D27,invullijst!$A$10:$M$177,2,FALSE)=\"\",\"\",VLOOKUP($D27,invullijst!$A$10:$M$177,2,FALSE))","v":"Wim de Gouw"},null,{"$f":"IF(VLOOKUP($D27,invullijst!$A$10:$M$177,7,FALSE)=0,\"\",VLOOKUP($D27,invullijst!$A$10:$M$177,7,FALSE))","v":95},null,3,{"$f":"IF($O$3=\"k\",IF(VLOOKUP($L27,invullijst!$A$10:$M$177,11,FALSE)=0,\" \",VLOOKUP($L27,invullijst!$A$10:$M$177,11,FALSE)),\"\")","v":""},{"$f":"IF(VLOOKUP($L27,invullijst!$A$10:$M$218,4,FALSE)=\"\",\"\",VLOOKUP($L27,invullijst!$A$10:$M$218,4,FALSE))","v":"65+"},214,{"$f":"IF(VLOOKUP($L27,invullijst!$A$10:$M$177,2,FALSE)=\"\",\"\",VLOOKUP($L27,invullijst!$A$10:$M$177,2,FALSE))","v":"André de Vaan"},null,{"$f":"IF(VLOOKUP($L27,invullijst!$A$10:$M$177,7,FALSE)=0,\"\",VLOOKUP($L27,invullijst!$A$10:$M$177,7,FALSE))","v":89}]
["Totaal korps opgelegd A1",{"$nulls":5},{"$f":"SUM(G25:G27)","v":289},null,"Totaal korps opgelegd A1",{"$nulls":5},{"$f":"SUM(O25:O27)","v":264}]
[]
[1,{"$f":"IF($G$3=\"k\",IF(VLOOKUP($D30,invullijst!$A$10:$M$177,11,FALSE)=0,\" \",VLOOKUP($D30,invullijst!$A$10:$M$177,11,FALSE)),\"\")","v":""},{"$f":"IF(VLOOKUP(D30,invullijst!A$10:F$218,4,FALSE)=\"\",\"\",VLOOKUP(D30,invullijst!A$10:D$218,4,FALSE))","v":"65+"},413,{"$f":"IF(VLOOKUP($D30,invullijst!$A$10:$M$177,2,FALSE)=\"\",\"\",VLOOKUP($D30,invullijst!$A$10:$M$177,2,FALSE))","v":"Frans Mommersteeg"},null,{"$f":"IF(VLOOKUP($D30,invullijst!$A$10:$M$177,7,FALSE)=0,\"\",VLOOKUP($D30,invullijst!$A$10:$M$177,7,FALSE))","v":98},null,1,{"$f":"IF($O$3=\"k\",IF(VLOOKUP($L30,invullijst!$A$10:$M$177,11,FALSE)=0,\" \",VLOOKUP($L30,invullijst!$A$10:$M$177,11,FALSE)),\"\")","v":""},{"$f":"IF(VLOOKUP($L30,invullijst!$A$10:$M$218,4,FALSE)=\"\",\"\",VLOOKUP($L30,invullijst!$A$10:$M$218,4,FALSE))","v":0},null,{"$f":"IF(VLOOKUP($L30,invullijst!$A$10:$M$177,2,FALSE)=\"\",\"\",VLOOKUP($L30,invullijst!$A$10:$M$177,2,FALSE))","v":0},null,{"$f":"IF(VLOOKUP($L30,invullijst!$A$10:$M$177,7,FALSE)=0,\"\",VLOOKUP($L30,invullijst!$A$10:$M$177,7,FALSE))","v":""}]
[2,{"$f":"IF($G$3=\"k\",IF(VLOOKUP($D31,invullijst!$A$10:$M$177,11,FALSE)=0,\" \",VLOOKUP($D31,invullijst!$A$10:$M$177,11,FALSE)),\"\")","v":""},{"$f":"IF(VLOOKUP(D31,invullijst!A$10:F$218,4,FALSE)=\"\",\"\",VLOOKUP(D31,invullijst!A$10:D$218,4,FALSE))","v":"65+"},412,{"$f":"IF(VLOOKUP($D31,invullijst!$A$10:$M$177,2,FALSE)=\"\",\"\",VLOOKUP($D31,invullijst!$A$10:$M$177,2,FALSE))","v":"Francien v/d Wiel"},null,{"$f":"IF(VLOOKUP($D31,invullijst!$A$10:$M$177,7,FALSE)=0,\"\",VLOOKUP($D31,invullijst!$A$10:$M$177,7,FALSE))","v":87},null,2,{"$f":"IF($O$3=\"k\",IF(VLOOKUP($L31,invullijst!$A$10:$M$177,11,FALSE)=0,\" \",VLOOKUP($L31,invullijst!$A$10:$M$177,11,FALSE)),\"\")","v":""},{"$f":"IF(VLOOKUP($L31,invullijst!$A$10:$M$218,4,FALSE)=\"\",\"\",VLOOKUP($L31,invullijst!$A$10:$M$218,4,FALSE))","v":0},null,{"$f":"IF(VLOOKUP($L31,invullijst!$A$10:$M$177,2,FALSE)=\"\",\"\",VLOOKUP($L31,invullijst!$A$10:$M$177,2,FALSE))","v":0},null,{"$f":"IF(VLOOKUP($L31,invullijst!$A$10:$M$177,7,FALSE)=0,\"\",VLOOKUP($L31,invullijst!$A$10:$M$177,7,FALSE))","v":""}]
[3,{"$f":"IF($G$3=\"k\",IF(VLOOKUP($D32,invullijst!$A$10:$M$177,11,FALSE)=0,\" \",VLOOKUP($D32,invullijst!$A$10:$M$177,11,FALSE)),\"\")","v":""},{"$f":"IF(VLOOKUP(D32,invullijst!A$10:F$218,4,FALSE)=\"\",\"\",VLOOKUP(D32,invullijst!A$10:D$218,4,FALSE))","v":0},null,{"$f":"IF(VLOOKUP($D32,invullijst!$A$10:$M$177,2,FALSE)=\"\",\"\",VLOOKUP($D32,invullijst!$A$10:$M$177,2,FALSE))","v":0},null,{"$f":"IF(VLOOKUP($D32,invullijst!$A$10:$M$177,7,FALSE)=0,\"\",VLOOKUP($D32,invullijst!$A$10:$M$177,7,FALSE))","v":""},null,3,{"$f":"IF($O$3=\"k\",IF(VLOOKUP($L32,invullijst!$A$10:$M$177,11,FALSE)=0,\" \",VLOOKUP($L32,invullijst!$A$10:$M$177,11,FALSE)),\"\")","v":""},{"$f":"IF(VLOOKUP($L32,invullijst!$A$10:$M$218,4,FALSE)=\"\",\"\",VLOOKUP($L32,invullijst!$A$10:$M$218,4,FALSE))","v":0},null,{"$f":"IF(VLOOKUP($L32,invullijst!$A$10:$M$177,2,FALSE)=\"\",\"\",VLOOKUP($L32,invullijst!$A$10:$M$177,2,FALSE))","v":0},null,{"$f":"IF(VLOOKUP($L32,invullijst!$A$10:$M$177,7,FALSE)=0,\"\",VLOOKUP($L32,invullijst!$A$10:$M$177,7,FALSE))","v":""}]
["Totaal korps opgelegd A2",{"$nulls":5},{"$f":"SUM(G30:G32)","v":185},null,"Totaal korps opgelegd A2",{"$nulls":5},{"$f":"SUM(O30:O32)","v":0}]
[]
[1,{"$f":"IF($G$3=\"k\",IF(VLOOKUP($D35,invullijst!$A$10:$M$177,11,FALSE)=0,\" \",VLOOKUP($D35,invullijst!$A$10:$M$177,11,FALSE)),\"\")","v":""},{"$f":"IF(VLOOKUP(D35,invullijst!A$10:F$218,4,FALSE)=\"\",\"\",VLOOKUP(D35,invullijst!A$10:D$218,4,FALSE))","v":0},null,{"$f":"IF(VLOOKUP($D35,invullijst!$A$10:$M$177,2,FALSE)=\"\",\"\",VLOOKUP($D35,invullijst!$A$10:$M$177,2,FALSE))","v":0},null,{"$f":"IF(VLOOKUP($D35,invullijst!$A$10:$M$177,7,FALSE)=0,\"\",VLOOKUP($D35,invullijst!$A$10:$M$177,7,FALSE))","v":""},null,1,{"$f":"IF($O$3=\"k\",IF(VLOOKUP($L35,invullijst!$A$10:$M$177,11,FALSE)=0,\" \",VLOOKUP($L35,invullijst!$A$10:$M$177,11,FALSE)),\"\")","v":""},{"$f":"IF(VLOOKUP($L35,invullijst!$A$10:$M$218,4,FALSE)=\"\",\"\",VLOOKUP($L35,invullijst!$A$10:$M$218,4,FALSE))","v":0},null,{"$f":"IF(VLOOKUP($L35,invullijst!$A$10:$M$177,2,FALSE)=\"\",\"\",VLOOKUP($L35,invullijst!$A$10:$M$177,2,FALSE))","v":0},null,{"$f":"IF(VLOOKUP($L35,invullijst!$A$10:$M$177,7,FALSE)=0,\"\",VLOOKUP($L35,invullijst!$A$10:$M$177,7,FALSE))","v":""}]
[2,{"$f":"IF($G$3=\"k\",IF(VLOOKUP($D36,invullijst!$A$10:$M$177,11,FALSE)=0,\" \",VLOOKUP($D36,invullijst!$A$10:$M$177,11,FALSE)),\"\")","v":""},{"$f":"IF(VLOOKUP(D36,invullijst!A$10:F$218,4,FALSE)=\"\",\"\",VLOOKUP(D36,invullijst!A$10:D$218,4,FALSE))","v":0},null,{"$f":"IF(VLOOKUP($D36,invullijst!$A$10:$M$177,2,FALSE)=\"\",\"\",VLOOKUP($D36,invullijst!$A$10:$M$177,2,FALSE))","v":0},null,{"$f":"IF(VLOOKUP($D36,invullijst!$A$10:$M$177,7,FALSE)=0,\"\",VLOOKUP($D36,invullijst!$A$10:$M$177,7,FALSE))","v":""},null,2,{"$f":"IF($O$3=\"k\",IF(VLOOKUP($L36,invullijst!$A$10:$M$177,11,FALSE)=0,\" \",VLOOKUP($L36,invullijst!$A$10:$M$177,11,FALSE)),\"\")","v":""},{"$f":"IF(VLOOKUP($L36,invullijst!$A$10:$M$218,4,FALSE)=\"\",\"\",VLOOKUP($L36,invullijst!$A$10:$M$218,4,FALSE))","v":0},null,{"$f":"IF(VLOOKUP($L36,invullijst!$A$10:$M$177,2,FALSE)=\"\",\"\",VLOOKUP($L36,invullijst!$A$10:$M$177,2,FALSE))","v":0},null,{"$f":"IF(VLOOKUP($L36,invullijst!$A$10:$M$177,7,FALSE)=0,\"\",VLOOKUP($L36,invullijst!$A$10:$M$177,7,FALSE))","v":""}]
[3,{"$f":"IF($G$3=\"k\",IF(VLOOKUP($D37,invullijst!$A$10:$M$177,11,FALSE)=0,\" \",VLOOKUP($D37,invullijst!$A$10:$M$177,11,FALSE)),\"\")","v":""},{"$f":"IF(VLOOKUP(D37,invullijst!A$10:F$218,4,FALSE)=\"\",\"\",VLOOKUP(D37,invullijst!A$10:D$218,4,FALSE))","v":0},null,{"$f":"IF(VLOOKUP($D37,invullijst!$A$10:$M$177,2,FALSE)=\"\",\"\",VLOOKUP($D37,invullijst!$A$10:$M$177,2,FALSE))","v":0},null,{"$f":"IF(VLOOKUP($D37,invullijst!$A$10:$M$177,7,FALSE)=0,\"\",VLOOKUP($D37,invullijst!$A$10:$M$177,7,FALSE))","v":""},null,3,{"$f":"IF($O$3=\"k\",IF(VLOOKUP($L37,invullijst!$A$10:$M$177,11,FALSE)=0,\" \",VLOOKUP($L37,invullijst!$A$10:$M$177,11,FALSE)),\"\")","v":""},{"$f":"IF(VLOOKUP($L37,invullijst!$A$10:$M$218,4,FALSE)=\"\",\"\",VLOOKUP($L37,invullijst!$A$10:$M$218,4,FALSE))","v":0},null,{"$f":"IF(VLOOKUP($L37,invullijst!$A$10:$M$177,2,FALSE)=\"\",\"\",VLOOKUP($L37,invullijst!$A$10:$M$177,2,FALSE))","v":0},null,{"$f":"IF(VLOOKUP($L37,invullijst!$A$10:$M$177,7,FALSE)=0,\"\",VLOOKUP($L37,invullijst!$A$10:$M$177,7,FALSE))","v":""}]
["Totaal korps opgelegd A3",{"$nulls":5},{"$f":"SUM(G35:G37)","v":0},null,"Totaal korps opgelegd A3",{"$nulls":5},{"$f":"SUM(O35:O37)","v":0}]

{"sheet":"wedstrijd 2B","index":8,"n_rows":38,"n_cols":15,"rows_kept":38,"merged":[[0,0,0,4],[0,5,0,7],[0,8,0,14],[1,0,1,11],[1,12,1,14],[2,1,2,5],[2,9,2,13],[4,0,4,14],[5,4,5,5],[5,12,5,13],[6,4,6,5],[6,12,6,13],[7,4,7,5],[7,12,7,13],[8,4,8,5],[8,12,8,13],[9,0,9,5],[9,8,9,13],[11,4,11,5],[11,12,11,13],[12,4,12,5],[12,12,12,13],[13,4,13,5],[13,12,13,13],[14,4,14,5],[14,12,14,13],[15,0,15,5],[15,8,15,13],[17,4,17,5],[17,12,17,13],[18,4,18,5],[18,12,18,13],[19,4,19,5],[19,12,19,13],[20,4,20,5],[20,12,20,13],[21,0,21,5],[21,8,21,13],[23,0,23,14],[24,4,24,5],[24,12,24,13],[25,4,25,5],[25,12,25,13],[26,4,26,5],[26,12,26,13],[27,0,27,5],[27,8,27,13],[29,4,29,5],[29,12,29,13],[30,4,30,5],[30,12,30,13],[31,4,31,5],[31,12,31,13],[32,0,32,5],[32,8,32,13],[34,4,34,5],[34,12,34,13],[35,4,35,5],[35,12,35,13],[36,4,36,5],[36,12,36,13],[37,0,37,5],[37,8,37,13]]}
[{"$f":"invullijst!F1","v":"Organisatie"},{"$nulls":4},{"$f":"invullijst!H2","v":"2023 - 2024"},null,null,{"$f":"invullijst!F3","v":"St. Crispinus & Crispinianus Besoijen"}]
["Datum: ",{"$nulls":11},"2024-02-21"]
[5,{"$f":"IF(VLOOKUP(A3,invullijst!A1:F5,2,FALSE)=\"\",\"\",VLOOKUP(A3,invullijst!A1:F5,2,FALSE))","v":"Sint Jan Baptist Kaatsheuvel"},{"$nulls":6},1,{"$f":"IF(VLOOKUP(I3,invullijst!A1:C5,2,FALSE)=\"\",\"\",VLOOKUP(I3,invullijst!A1:C5,2,FALSE))","v":"Sint Ambrosius Baardwijk"}]
[]
["vrijehand"]
[1,{"$f":"IF($G$3=\"k\",IF(VLOOKUP($D6,invullijst!$A$10:$M$177,11,FALSE)=0,\" \",VLOOKUP($D6,invullijst!$A$10:$M$177,11,FALSE)),\"\")","v":""},{"$f":"IF(VLOOKUP(D6,invullijst!A$10:F$218,4,FALSE)=\"\",\"\",VLOOKUP(D6,invullijst!A$10:D$218,4,FALSE))","v":"vr"},506,{"$f":"IF(VLOOKUP($D6,invullijst!$A$10:$M$177,2,FALSE)=\"\",\"\",VLOOKUP($D6,invullijst!$A$10:$M$177,2,FALSE))","v":"Maikel Monden"},null,{"$f":"IF(VLOOKUP($D6,invullijst!$A$10:$M$177,7,FALSE)=0,\"\",VLOOKUP($D6,invullijst!$A$10:$M$177,7,FALSE))","v":85},null,1,{"$f":"IF($O$3=\"k\",IF(VLOOKUP($L6,invullijst!$A$10:$M$177,11,FALSE)=0,\" \",VLOOKUP($L6,invullijst!$A$10:$M$177,11,FALSE)),\"\")","v":""},{"$f":"IF(VLOOKUP($L6,invullijst!$A$10:$M$218,4,FALSE)=\"\",\"\",VLOOKUP($L6,invullijst!$A$10:$M$218,4,FALSE))","v":"vr"},102,{"$f":"IF(VLOOKUP($L6,invullijst!$A$10:$M$177,2,FALSE)=\"\",\"\",VLOOKUP($L6,invullijst!$A$10:$M$177,2,FALSE))","v":"John de Jong"},null,{"$f":"IF(VLOOKUP($L6,invullijst!$A$10:$M$177,7,FALSE)=0,\"\",VLOOKUP($L6,invullijst!$A$10:$M$177,7,FALSE))","v":74}]
[2,{"$f":"IF($G$3=\"k\",IF(VLOOKUP($D7,invullijst!$A$10:$M$177,11,FALSE)=0,\" \",VLOOKUP($D7,invullijst!$A$10:$M$177,11,FALSE)),\"\")","v":""},{"$f":"IF(VLOOKUP(D7,invullijst!A$10:F$218,4,FALSE)=\"\",\"\",VLOOKUP(D7,invullijst!A$10:D$218,4,FALSE))","v":"vr"},504,{"$f":"IF(VLOOKUP($D7,invullijst!$A$10:$M$177,2,FALSE)=\"\",\"\",VLOOKUP($D7,invullijst!$A$10:$M$177,2,FALSE))","v":"Koen v/d Ven"},null,{"$f":"IF(VLOOKUP($D7,invullijst!$A$10:$M$177,7,FALSE)=0,\"\",VLOOKUP($D7,invullijst!$A$10:$M$177,7,FALSE))","v":90},null,2,{"$f":"IF($O$3=\"k\",IF(VLOOKUP($L7,invullijst!$A$10:$M$177,11,FALSE)=0,\" \",VLOOKUP($L7,invullijst!$A$10:$M$177,11,FALSE)),\"\")","v":""},{"$f":"IF(VLOOKUP($L7,invullijst!$A$10:$M$218,4,FALSE)=\"\",\"\",VLOOKUP($L7,invullijst!$A$10:$M$218,4,FALSE))","v":"vr"},105,{"$f":"IF(VLOOKUP($L7,invullijst!$A$10:$M$177,2,FALSE)=\"\",\"\",VLOOKUP($L7,invullijst!$A$10:$M$177,2,FALSE))","v":"René Klijn"},null,{"$f":"IF(VLOOKUP($L7,invullijst!$A$10:$M$177,7,FALSE)=0,\"\",VLOOKUP($L7,invullijst!$A$10:$M$177,7,FALSE))","v":83}]
[3,{"$f":"IF($G$3=\"k\",IF(VLOOKUP($D8,invullijst!$A$10:$M$177,11,FALSE)=0,\" \",VLOOKUP($D8,invullijst!$A$10:$M$177,11,FALSE)),\"\")","v":""},{"$f":"IF(VLOOKUP(D8,invullijst!A$10:F$218,4,FALSE)=\"\",\"\",VLOOKUP(D8,invullijst!A$10:D$218,4,FALSE))","v":"vr"},501,{"$f":"IF(VLOOKUP($D8,invullijst!$A$10:$M$177,2,FALSE)=\"\",\"\",VLOOKUP($D8,invullijst!$A$10:$M$177,2,FALSE))","v":"Annette Vos"},null,{"$f":"IF(VLOOKUP($D8,invullijst!$A$10:$M$177,7,FALSE)=0,\"\",VLOOKUP($D8,invullijst!$A$10:$M$177,7,FALSE))","v":89},null,3,{"$f":"IF($O$3=\"k\",IF(VLOOKUP($L8,invullijst!$A$10:$M$177,11,FALSE)=0,\" \",VLOOKUP($L8,invullijst!$A$10:$M$177,11,FALSE)),\"\")","v":""},{"$f":"IF(VLOOKUP($L8,invullijst!$A$10:$M$218,4,FALSE)=\"\",\"\",VLOOKUP($L8,invullijst!$A$10:$M$218,4,FALSE))","v":"vr"},106,{"$f":"IF(VLOOKUP($L8,invullijst!$A$10:$M$177,2,FALSE)=\"\",\"\",VLOOKUP($L8,invullijst!$A$10:$M$177,2,FALSE))","v":"René Pullens"},null,{"$f":"IF(VLOOKUP($L8,invullijst!$A$10:$M$177,7,FALSE)=0,\"\",VLOOKUP($L8,invullijst!$A$10:$M$177,7,FALSE))","v":84}]
[4,{"$f":"IF($G$3=\"k\",IF(VLOOKUP($D9,invullijst!$A$10:$M$177,11,FALSE)=0,\" \",VLOOKUP($D9,invullijst!$A$10:$M$177,11,FALSE)),\"\")","v":""},{"$f":"IF(VLOOKUP(D9,invullijst!A$10:F$218,4,FALSE)=\"\",\"\",VLOOKUP(D9,invullijst!A$10:D$218,4,FALSE))","v":"vr"},512,{"$f":"IF(VLOOKUP($D9,invullijst!$A$10:$M$177,2,FALSE)=\"\",\"\",VLOOKUP($D9,invullijst!$A$10:$M$177,2,FALSE))","v":"Hans Bergakker"},null,{"$f":"IF(VLOOKUP($D9,invullijst!$A$10:$M$177,7,FALSE)=0,\"\",VLOOKUP($D9,invullijst!$A$10:$M$177,7,FALSE))","v":71},null,4,{"$f":"IF($O$3=\"k\",IF(VLOOKUP($L9,invullijst!$A$10:$M$177,11,FALSE)=0,\" \",VLOOKUP($L9,invullijst!$A$10:$M$177,11,FALSE)),\"\")","v":""},{"$f":"IF(VLOOKUP($L9,invullijst!$A$10:$M$218,4,FALSE)=\"\",\"\",VLOOKUP($L9,invullijst!$A$10:$M$218,4,FALSE))","v":"vr"},108,{"$f":"IF(VLOOKUP($L9,invullijst!$A$10:$M$177,2,FALSE)=\"\",\"\",VLOOKUP($L9,invullijst!$A$10:$M$177,2,FALSE))","v":"Bram Pullens"},null,{"$f":"IF(VLOOKUP($L9,invullijst!$A$10:$M$177,7,FALSE)=0,\"\",VLOOKUP($L9,invullijst!$A$10:$M$177,7,FALSE))","v":81}]
["Totaal A korps",{"$nulls":5},{"$f":"SUM(G6:G9)","v":335},null,"Totaal A korps",{"$nulls":5},{"$f":"SUM(O6:O9)","v":322}]
[]
[1,{"$f":"IF($G$3=\"k\",IF(VLOOKUP($D12,invullijst!$A$10:$M$177,11,FALSE)=0,\" \",VLOOKUP($D12,invullijst!$A$10:$M$177,11,FALSE)),\"\")","v":""},{"$f":"IF(VLOOKUP(D12,invullijst!A$10:F$218,4,FALSE)=\"\",\"\",VLOOKUP(D12,invullijst!A$10:D$218,4,FALSE))","v":"vr"},508,{"$f":"IF(VLOOKUP($D12,invullijst!$A$10:$M$177,2,FALSE)=\"\",\"\",VLOOKUP($D12,invullijst!$A$10:$M$177,2,FALSE))","v":"Rowan Dobbelsteen"},null,{"$f":"IF(VLOOKUP($D12,invullijst!$A$10:$M$177,7,FALSE)=0,\"\",VLOOKUP($D12,invullijst!$A$10:$M$177,7,FALSE))","v":79},null,1,{"$f":"IF($O$3=\"k\",IF(VLOOKUP($L12,invullijst!$A$10:$M$177,11,FALSE)=0,\" \",VLOOKUP($L12,invullijst!$A$10:$M$177,11,FALSE)),\"\")","v":""},{"$f":"IF(VLOOKUP($L12,invullijst!$A$10:$M$218,4,FALSE)=\"\",\"\",VLOOKUP($L12,invullijst!$A$10:$M$218,4,FALSE))","v":"vr"},103,{"$f":"IF(VLOOKUP($L12,invullijst!$A$10:$M$177,2,FALSE)=\"\",\"\",VLOOKUP($L12,invullijst!$A$10:$M$177,2,FALSE))","v":"Norbert van Buul"},null,{"$f":"IF(VLOOKUP($L12,invullijst!$A$10:$M$177,7,FALSE)=0,\"\",VLOOKUP($L12,invullijst!$A$10:$M$177,7,FALSE))","v":64}]
[2,{"$f":"IF($G$3=\"k\",IF(VLOOKUP($D13,invullijst!$A$10:$M$177,11,FALSE)=0,\" \",VLOOKUP($D13,invullijst!$A$10:$M$177,11,FALSE)),\"\")","v":""},{"$f":"IF(VLOOKUP(D13,invullijst!A$10:F$218,4,FALSE)=\"\",\"\",VLOOKUP(D13,invullijst!A$10:D$218,4,FALSE))","v":"vr"},502,{"$f":"IF(VLOOKUP($D13,invullijst!$A$10:$M$177,2,FALSE)=\"\",\"\",VLOOKUP($D13,invullijst!$A$10:$M$177,2,FALSE))","v":"Diny Vos"},null,{"$f":"IF(VLOOKUP($D13,invullijst!$A$10:$M$177,7,FALSE)=0,\"\",VLOOKUP($D13,invullijst!$A$10:$M$177,7,FALSE))","v":66},null,2,{"$f":"IF($O$3=\"k\",IF(VLOOKUP($L13,invullijst!$A$10:$M$177,11,FALSE)=0,\" \",VLOOKUP($L13,invullijst!$A$10:$M$177,11,FALSE)),\"\")","v":""},{"$f":"IF(VLOOKUP($L13,invullijst!$A$10:$M$218,4,FALSE)=\"\",\"\",VLOOKUP($L13,invullijst!$A$10:$M$218,4,FALSE))","v":0},null,{"$f":"IF(VLOOKUP($L13,invullijst!$A$10:$M$177,2,FALSE)=\"\",\"\",VLOOKUP($L13,invullijst!$A$10:$M$177,2,FALSE))","v":0},null,{"$f":"IF(VLOOKUP($L13,invullijst!$A$10:$M$177,7,FALSE)=0,\"\",VLOOKUP($L13,invullijst!$A$10:$M$177,7,FALSE))","v":""}]
[3,{"$f":"IF($G$3=\"k\",IF(VLOOKUP($D14,invullijst!$A$10:$M$177,11,FALSE)=0,\" \",VLOOKUP($D14,invullijst!$A$10:$M$177,11,FALSE)),\"\")","v":""},{"$f":"IF(VLOOKUP(D14,invullijst!A$10:F$218,4,FALSE)=\"\",\"\",VLOOKUP(D14,invullijst!A$10:D$218,4,FALSE))","v":"vr"},513,{"$f":"IF(VLOOKUP($D14,invullijst!$A$10:$M$177,2,FALSE)=\"\",\"\",VLOOKUP($D14,invullijst!$A$10:$M$177,2,FALSE))","v":"Mark van Delft"},null,{"$f":"IF(VLOOKUP($D14,invullijst!$A$10:$M$177,7,FALSE)=0,\"\",VLOOKUP($D14,invullijst!$A$10:$M$177,7,FALSE))","v":79},null,3,{"$f":"IF($O$3=\"k\",IF(VLOOKUP($L14,invullijst!$A$10:$M$177,11,FALSE)=0,\" \",VLOOKUP($L14,invullijst!$A$10:$M$177,11,FALSE)),\"\")","v":""},{"$f":"IF(VLOOKUP($L14,invullijst!$A$10:$M$218,4,FALSE)=\"\",\"\",VLOOKUP($L14,invullijst!$A$10:$M$218,4,FALSE))","v":0},null,{"$f":"IF(VLOOKUP($L14,invullijst!$A$10:$M$177,2,FALSE)=\"\",\"\",VLOOKUP($L14,invullijst!$A$10:$M$177,2,FALSE))","v":0},null,{"$f":"IF(VLOOKUP($L14,invullijst!$A$10:$M$177,7,FALSE)=0,\"\",VLOOKUP($L14,invullijst!$A$10:$M$177,7,FALSE))","v":""}]
[4,{"$f":"IF($G$3=\"k\",IF(VLOOKUP($D15,invullijst!$A$10:$M$177,11,FALSE)=0,\" \",VLOOKUP($D15,invullijst!$A$10:$M$177,11,FALSE)),\"\")","v":""},{"$f":"IF(VLOOKUP(D15,invullijst!A$10:F$218,4,FALSE)=\"\",\"\",VLOOKUP(D15,invullijst!A$10:D$218,4,FALSE))","v":"vr"},507,{"$f":"IF(VLOOKUP($D15,invullijst!$A$10:$M$177,2,FALSE)=\"\",\"\",VLOOKUP($D15,invullijst!$A$10:$M$177,2,FALSE))","v":"Michael Blaauwbroek"},null,{"$f":"IF(VLOOKUP($D15,invullijst!$A$10:$M$177,7,FALSE)=0,\"\",VLOOKUP($D15,invullijst!$A$10:$M$177,7,FALSE))","v":70},null,4,{"$f":"IF($O$3=\"k\",IF(VLOOKUP($L15,invullijst!$A$10:$M$177,11,FALSE)=0,\" \",VLOOKUP($L15,invullijst!$A$10:$M$177,11,FALSE)),\"\")","v":""},{"$f":"IF(VLOOKUP($L15,invullijst!$A$10:$M$218,4,FALSE)=\"\",\"\",VLOOKUP($L15,invullijst!$A$10:$M$218,4,FALSE))","v":0},null,{"$f":"IF(VLOOKUP($L15,invullijst!$A$10:$M$177,2,FALSE)=\"\",\"\",VLOOKUP($L15,invullijst!$A$10:$M$177,2,FALSE))","v":0},null,{"$f":"IF(VLOOKUP($L15,invullijst!$A$10:$M$177,7,FALSE)=0,\"\",VLOOKUP($L15,invullijst!$A$10:$M$177,7,FALSE))","v":""}]
["Totaal B1 korps",{"$nulls":5},{"$f":"SUM(G12:G15)","v":294},null,"Totaal B1 korps",{"$nulls":5},{"$f":"SUM(O12:O15)","v":64}]
[]
[1,{"$f":"IF($G$3=\"k\",IF(VLOOKUP($D18,invullijst!$A$10:$M$177,11,FALSE)=0,\" \",VLOOKUP($D18,invullijst!$A$10:$M$177,11,FALSE)),\"\")","v":""},{"$f":"IF(VLOOKUP(D18,invullijst!A$10:F$218,4,FALSE)=\"\",\"\",VLOOKUP(D18,invullijst!A$10:D$218,4,FALSE))","v":0},null,{"$f":"IF(VLOOKUP($D18,invullijst!$A$10:$M$177,2,FALSE)=\"\",\"\",VLOOKUP($D18,invullijst!$A$10:$M$177,2,FALSE))","v":0},null,{"$f":"IF(VLOOKUP($D18,invullijst!$A$10:$M$177,7,FALSE)=0,\"\",VLOOKUP($D18,invullijst!$A$10:$M$177,7,FALSE))","v":""},null,1,{"$f":"IF($O$3=\"k\",IF(VLOOKUP($L18,invullijst!$A$10:$M$177,11,FALSE)=0,\" \",VLOOKUP($L18,invullijst!$A$10:$M$177,11,FALSE)),\"\")","v":""},{"$f":"IF(VLOOKUP($L18,invullijst!$A$10:$M$218,4,FALSE)=\"\",\"\",VLOOKUP($L18,invullijst!$A$10:$M$218,4,FALSE))","v":0},null,{"$f":"IF(VLOOKUP($L18,invullijst!$A$10:$M$177,2,FALSE)=\"\",\"\",VLOOKUP($L18,invullijst!$A$10:$M$177,2,FALSE))","v":0},null,{"$f":"IF(VLOOKUP($L18,invullijst!$A$10:$M$177,7,FALSE)=0,\"\",VLOOKUP($L18,invullijst!$A$10:$M$177,7,FALSE))","v":""}]
[2,{"$f":"IF($G$3=\"k\",IF(VLOOKUP($D19,invullijst!$A$10:$M$177,11,FALSE)=0,\" \",VLOOKUP($D19,invullijst!$A$10:$M$177,11,FALSE)),\"\")","v":""},{"$f":"IF(VLOOKUP(D19,invullijst!A$10:F$218,4,FALSE)=\"\",\"\",VLOOKUP(D19,invullijst!A$10:D$218,4,FALSE))","v":0},null,{"$f":"IF(VLOOKUP($D19,invullijst!$A$10:$M$177,2,FALSE)=\"\",\"\",VLOOKUP($D19,invullijst!$A$10:$M$177,2,FALSE))","v":0},null,{"$f":"IF(VLOOKUP($D19,invullijst!$A$10:$M$177,7,FALSE)=0,\"\",VLOOKUP($D19,invullijst!$A$10:$M$177,7,FALSE))","v":""},null,2,{"$f":"IF($O$3=\"k\",IF(VLOOKUP($L19,invullijst!$A$10:$M$177,11,FALSE)=0,\" \",VLOOKUP($L19,invullijst!$A$10:$M$177,11,FALSE)),\"\")","v":""},{"$f":"IF(VLOOKUP($L19,invullijst!$A$10:$M$218,4,FALSE)=\"\",\"\",VLOOKUP($L19,invullijst!$A$10:$M$218,4,FALSE))","v":0},null,{"$f":"IF(VLOOKUP($L19,invullijst!$A$10:$M$177,2,FALSE)=\"\",\"\",VLOOKUP($L19,invullijst!$A$10:$M$177,2,FALSE))","v":0},null,{"$f":"IF(VLOOKUP($L19,invullijst!$A$10:$M$177,7,FALSE)=0,\"\",VLOOKUP($L19,invullijst!$A$10:$M$177,7,FALSE))","v":""}]
[3,{"$f":"IF($G$3=\"k\",IF(VLOOKUP($D20,invullijst!$A$10:$M$177,11,FALSE)=0,\" \",VLOOKUP($D20,invullijst!$A$10:$M$177,11,FALSE)),\"\")","v":""},{"$f":"IF(VLOOKUP(D20,invullijst!A$10:F$218,4,FALSE)=\"\",\"\",VLOOKUP(D20,invullijst!A$10:D$218,4,FALSE))","v":0},null,{"$f":"IF(VLOOKUP($D20,invullijst!$A$10:$M$177,2,FALSE)=\"\",\"\",VLOOKUP($D20,invullijst!$A$10:$M$177,2,FALSE))","v":0},null,{"$f":"IF(VLOOKUP($D20,invullijst!$A$10:$M$177,7,FALSE)=0,\"\",VLOOKUP($D20,invullijst!$A$10:$M$177,7,FALSE))","v":""},null,3,{"$f":"IF($O$3=\"k\",IF(VLOOKUP($L20,invullijst!$A$10:$M$177,11,FALSE)=0,\" \",VLOOKUP($L20,invullijst!$A$10:$M$177,11,FALSE)),\"\")","v":""},{"$f":"IF(VLOOKUP($L20,invullijst!$A$10:$M$218,4,FALSE)=\"\",\"\",VLOOKUP($L20,invullijst!$A$10:$M$218,4,FALSE))","v":0},null,{"$f":"IF(VLOOKUP($L20,invullijst!$A$10:$M$177,2,FALSE)=\"\",\"\",VLOOKUP($L20,invullijst!$A$10:$M$177,2,FALSE))","v":0},null,{"$f":"IF(VLOOKUP($L20,invullijst!$A$10:$M$177,7,FALSE)=0,\"\",VLOOKUP($L20,invullijst!$A$10:$M$177,7,FALSE))","v":""}]
[4,{"$f":"IF($G$3=\"k\",IF(VLOOKUP($D21,invullijst!$A$10:$M$177,11,FALSE)=0,\" \",VLOOKUP($D21,invullijst!$A$10:$M$177,11,FALSE)),\"\")","v":""},{"$f":"IF(VLOOKUP(D21,invullijst!A$10:F$218,4,FALSE)=\"\",\"\",VLOOKUP(D21,invullijst!A$10:D$218,4,FALSE))","v":0},null,"Rowan Dobbelsteen (Inhalen)",null,80,null,4,{"$f":"IF($O$3=\"k\",IF(VLOOKUP($L21,invullijst!$A$10:$M$177,11,FALSE)=0,\" \",VLOOKUP($L21,invullijst!$A$10:$M$177,11,FALSE)),\"\")","v":""},{"$f":"IF(VLOOKUP($L21,invullijst!$A$10:$M$218,4,FALSE)=\"\",\"\",VLOOKUP($L21,invullijst!$A$10:$M$218,4,FALSE))","v":0},null,{"$f":"IF(VLOOKUP($L21,invullijst!$A$10:$M$177,2,FALSE)=\"\",\"\",VLOOKUP($L21,invullijst!$A$10:$M$177,2,FALSE))","v":0},null,{"$f":"IF(VLOOKUP($L21,invullijst!$A$10:$M$177,7,FALSE)=0,\"\",VLOOKUP($L21,invullijst!$A$10:$M$177,7,FALSE))","v":""}]
["DIVERSE / INHAAL",{"$nulls":7},"DIVERSE / INHAAL"]
[]
["OPGELEGD (Jeugd <16 en 65+)"]
[1,{"$f":"IF($G$3=\"k\",IF(VLOOKUP($D25,invullijst!$A$10:$M$177,11,FALSE)=0,\" \",VLOOKUP($D25,invullijst!$A$10:$M$177,11,FALSE)),\"\")","v":""},{"$f":"IF(VLOOKUP(D25,invullijst!A$10:F$218,4,FALSE)=\"\",\"\",VLOOKUP(D25,invullijst!A$10:D$218,4,FALSE))","v":"65+"},511,{"$f":"IF(VLOOKUP($D25,invullijst!$A$10:$M$177,2,FALSE)=\"\",\"\",VLOOKUP($D25,invullijst!$A$10:$M$177,2,FALSE))","v":"Ton Stans"},null,{"$f":"IF(VLOOKUP($D25,invullijst!$A$10:$M$177,7,FALSE)=0,\"\",VLOOKUP($D25,invullijst!$A$10:$M$177,7,FALSE))","v":83},null,1,{"$f":"IF($O$3=\"k\",IF(VLOOKUP($L25,invullijst!$A$10:$M$177,11,FALSE)=0,\" \",VLOOKUP($L25,invullijst!$A$10:$M$177,11,FALSE)),\"\")","v":""},{"$f":"IF(VLOOKUP($L25,invullijst!$A$10:$M$218,4,FALSE)=\"\",\"\",VLOOKUP($L25,invullijst!$A$10:$M$218,4,FALSE))","v":"65+"},111,{"$f":"IF(VLOOKUP($L25,invullijst!$A$10:$M$177,2,FALSE)=\"\",\"\",VLOOKUP($L25,invullijst!$A$10:$M$177,2,FALSE))","v":"Frans van Buul"},null,{"$f":"IF(VLOOKUP($L25,invullijst!$A$10:$M$177,7,FALSE)=0,\"\",VLOOKUP($L25,invullijst!$A$10:$M$177,7,FALSE))","v":83}]
[2,{"$f":"IF($G$3=\"k\",IF(VLOOKUP($D26,invullijst!$A$10:$M$177,11,FALSE)=0,\" \",VLOOKUP($D26,invullijst!$A$10:$M$177,11,FALSE)),\"\")","v":""},{"$f":"IF(VLOOKUP(D26,invullijst!A$10:F$218,4,FALSE)=\"\",\"\",VLOOKUP(D26,invullijst!A$10:D$218,4,FALSE))","v":"65+"},515,{"$f":"IF(VLOOKUP($D26,invullijst!$A$10:$M$177,2,FALSE)=\"\",\"\",VLOOKUP($D26,invullijst!$A$10:$M$177,2,FALSE))","v":"Ilona Bergakker disp"},null,{"$f":"IF(VLOOKUP($D26,invullijst!$A$10:$M$177,7,FALSE)=0,\"\",VLOOKUP($D26,invullijst!$A$10:$M$177,7,FALSE))","v":93},null,2,{"$f":"IF($O$3=\"k\",IF(VLOOKUP($L26,invullijst!$A$10:$M$177,11,FALSE)=0,\" \",VLOOKUP($L26,invullijst!$A$10:$M$177,11,FALSE)),\"\")","v":""},{"$f":"IF(VLOOKUP($L26,invullijst!$A$10:$M$218,4,FALSE)=\"\",\"\",VLOOKUP($L26,invullijst!$A$10:$M$218,4,FALSE))","v":"65+"},113,{"$f":"IF(VLOOKUP($L26,invullijst!$A$10:$M$177,2,FALSE)=\"\",\"\",VLOOKUP($L26,invullijst!$A$10:$M$177,2,FALSE))","v":"Kees Coppens"},null,{"$f":"IF(VLOOKUP($L26,invullijst!$A$10:$M$177,7,FALSE)=0,\"\",VLOOKUP($L26,invullijst!$A$10:$M$177,7,FALSE))","v":84}]
[3,{"$f":"IF($G$3=\"k\",IF(VLOOKUP($D27,invullijst!$A$10:$M$177,11,FALSE)=0,\" \",VLOOKUP($D27,invullijst!$A$10:$M$177,11,FALSE)),\"\")","v":""},{"$f":"IF(VLOOKUP(D27,invullijst!A$10:F$218,4,FALSE)=\"\",\"\",VLOOKUP(D27,invullijst!A$10:D$218,4,FALSE))","v":"65+"},509,{"$f":"IF(VLOOKUP($D27,invullijst!$A$10:$M$177,2,FALSE)=\"\",\"\",VLOOKUP($D27,invullijst!$A$10:$M$177,2,FALSE))","v":"Adwan de Pinth"},null,{"$f":"IF(VLOOKUP($D27,invullijst!$A$10:$M$177,7,FALSE)=0,\"\",VLOOKUP($D27,invullijst!$A$10:$M$177,7,FALSE))","v":96},null,3,{"$f":"IF($O$3=\"k\",IF(VLOOKUP($L27,invullijst!$A$10:$M$177,11,FALSE)=0,\" \",VLOOKUP($L27,invullijst!$A$10:$M$177,11,FALSE)),\"\")","v":""},{"$f":"IF(VLOOKUP($L27,invullijst!$A$10:$M$218,4,FALSE)=\"\",\"\",VLOOKUP($L27,invullijst!$A$10:$M$218,4,FALSE))","v":"J"},109,{"$f":"IF(VLOOKUP($L27,invullijst!$A$10:$M$177,2,FALSE)=\"\",\"\",VLOOKUP($L27,invullijst!$A$10:$M$177,2,FALSE))","v":"Gijs Pullens"},null,{"$f":"IF(VLOOKUP($L27,invullijst!$A$10:$M$177,7,FALSE)=0,\"\",VLOOKUP($L27,invullijst!$A$10:$M$177,7,FALSE))","v":83}]
["Totaal korps opgelegd A1",{"$nulls":5},{"$f":"SUM(G25:G27)","v":272},null,"Totaal korps opgelegd A1",{"$nulls":5},{"$f":"SUM(O25:O27)","v":250}]
[]
[1,{"$f":"IF($G$3=\"k\",IF(VLOOKUP($D30,invullijst!$A$10:$M$177,11,FALSE)=0,\" \",VLOOKUP($D30,invullijst!$A$10:$M$177,11,FALSE)),\"\")","v":""},{"$f":"IF(VLOOKUP(D30,invullijst!A$10:F$218,4,FALSE)=\"\",\"\",VLOOKUP(D30,invullijst!A$10:D$218,4,FALSE))","v":"65+"},514,{"$f":"IF(VLOOKUP($D30,invullijst!$A$10:$M$177,2,FALSE)=\"\",\"\",VLOOKUP($D30,invullijst!$A$10:$M$177,2,FALSE))","v":"Toon Ophorst"},null,{"$f":"IF(VLOOKUP($D30,invullijst!$A$10:$M$177,7,FALSE)=0,\"\",VLOOKUP($D30,invullijst!$A$10:$M$177,7,FALSE))","v":67},null,1,{"$f":"IF($O$3=\"k\",IF(VLOOKUP($L30,invullijst!$A$10:$M$177,11,FALSE)=0,\" \",VLOOKUP($L30,invullijst!$A$10:$M$177,11,FALSE)),\"\")","v":""},{"$f":"IF(VLOOKUP($L30,invullijst!$A$10:$M$218,4,FALSE)=\"\",\"\",VLOOKUP($L30,invullijst!$A$10:$M$218,4,FALSE))","v":0},null,{"$f":"IF(VLOOKUP($L30,invullijst!$A$10:$M$177,2,FALSE)=\"\",\"\",VLOOKUP($L30,invullijst!$A$10:$M$177,2,FALSE))","v":0},null,{"$f":"IF(VLOOKUP($L30,invullijst!$A$10:$M$177,7,FALSE)=0,\"\",VLOOKUP($L30,invullijst!$A$10:$M$177,7,FALSE))","v":""}]
[2,{"$f":"IF($G$3=\"k\",IF(VLOOKUP($D31,invullijst!$A$10:$M$177,11,FALSE)=0,\" \",VLOOKUP($D31,invullijst!$A$10:$M$177,11,FALSE)),\"\")","v":""},{"$f":"IF(VLOOKUP(D31,invullijst!A$10:F$218,4,FALSE)=\"\",\"\",VLOOKUP(D31,invullijst!A$10:D$218,4,FALSE))","v":"65+"},505,{"$f":"IF(VLOOKUP($D31,invullijst!$A$10:$M$177,2,FALSE)=\"\",\"\",VLOOKUP($D31,invullijst!$A$10:$M$177,2,FALSE))","v":"Leo Wagemakers"},null,{"$f":"IF(VLOOKUP($D31,invullijst!$A$10:$M$177,7,FALSE)=0,\"\",VLOOKUP($D31,invullijst!$A$10:$M$177,7,FALSE))","v":69},null,2,{"$f":"IF($O$3=\"k\",IF(VLOOKUP($L31,invullijst!$A$10:$M$177,11,FALSE)=0,\" \",VLOOKUP($L31,invullijst!$A$10:$M$177,11,FALSE)),\"\")","v":""},{"$f":"IF(VLOOKUP($L31,invullijst!$A$10:$M$218,4,FALSE)=\"\",\"\",VLOOKUP($L31,invullijst!$A$10:$M$218,4,FALSE))","v":0},null,{"$f":"IF(VLOOKUP($L31,invullijst!$A$10:$M$177,2,FALSE)=\"\",\"\",VLOOKUP($L31,invullijst!$A$10:$M$177,2,FALSE))","v":0},null,{"$f":"IF(VLOOKUP($L31,invullijst!$A$10:$M$177,7,FALSE)=0,\"\",VLOOKUP($L31,invullijst!$A$10:$M$177,7,FALSE))","v":""}]
[3,{"$f":"IF($G$3=\"k\",IF(VLOOKUP($D32,invullijst!$A$10:$M$177,11,FALSE)=0,\" \",VLOOKUP($D32,invullijst!$A$10:$M$177,11,FALSE)),\"\")","v":""},{"$f":"IF(VLOOKUP(D32,invullijst!A$10:F$218,4,FALSE)=\"\",\"\",VLOOKUP(D32,invullijst!A$10:D$218,4,FALSE))","v":"65+"},516,{"$f":"IF(VLOOKUP($D32,invullijst!$A$10:$M$177,2,FALSE)=\"\",\"\",VLOOKUP($D32,invullijst!$A$10:$M$177,2,FALSE))","v":"Henry Bergakker disp"},null,{"$f":"IF(VLOOKUP($D32,invullijst!$A$10:$M$177,7,FALSE)=0,\"\",VLOOKUP($D32,invullijst!$A$10:$M$177,7,FALSE))","v":88},null,3,{"$f":"IF($O$3=\"k\",IF(VLOOKUP($L32,invullijst!$A$10:$M$177,11,FALSE)=0,\" \",VLOOKUP($L32,invullijst!$A$10:$M$177,11,FALSE)),\"\")","v":""},{"$f":"IF(VLOOKUP($L32,invullijst!$A$10:$M$218,4,FALSE)=\"\",\"\",VLOOKUP($L32,invullijst!$A$10:$M$218,4,FALSE))","v":0},null,{"$f":"IF(VLOOKUP($L32,invullijst!$A$10:$M$177,2,FALSE)=\"\",\"\",VLOOKUP($L32,invullijst!$A$10:$M$177,2,FALSE))","v":0},null,{"$f":"IF(VLOOKUP($L32,invullijst!$A$10:$M$177,7,FALSE)=0,\"\",VLOOKUP($L32,invullijst!$A$10:$M$177,7,FALSE))","v":""}]
["Totaal korps opgelegd A2",{"$nulls":5},{"$f":"SUM(G30:G32)","v":224},null,"Totaal korps opgelegd A2",{"$nulls":5},{"$f":"SUM(O30:O32)","v":0}]
[]
[1,{"$f":"IF($G$3=\"k\",IF(VLOOKUP($D35,invullijst!$A$10:$M$177,11,FALSE)=0,\" \",VLOOKUP($D35,invullijst!$A$10:$M$177,11,FALSE)),\"\")","v":""},{"$f":"IF(VLOOKUP(D35,invullijst!A$10:F$218,4,FALSE)=\"\",\"\",VLOOKUP(D35,invullijst!A$10:D$218,4,FALSE))","v":0},null,{"$f":"IF(VLOOKUP($D35,invullijst!$A$10:$M$177,2,FALSE)=\"\",\"\",VLOOKUP($D35,invullijst!$A$10:$M$177,2,FALSE))","v":0},null,{"$f":"IF(VLOOKUP($D35,invullijst!$A$10:$M$177,7,FALSE)=0,\"\",VLOOKUP($D35,invullijst!$A$10:$M$177,7,FALSE))","v":""},null,1,{"$f":"IF($O$3=\"k\",IF(VLOOKUP($L35,invullijst!$A$10:$M$177,11,FALSE)=0,\" \",VLOOKUP($L35,invullijst!$A$10:$M$177,11,FALSE)),\"\")","v":""},{"$f":"IF(VLOOKUP($L35,invullijst!$A$10:$M$218,4,FALSE)=\"\",\"\",VLOOKUP($L35,invullijst!$A$10:$M$218,4,FALSE))","v":0},null,{"$f":"IF(VLOOKUP($L35,invullijst!$A$10:$M$177,2,FALSE)=\"\",\"\",VLOOKUP($L35,invullijst!$A$10:$M$177,2,FALSE))","v":0},null,{"$f":"IF(VLOOKUP($L35,invullijst!$A$10:$M$177,7,FALSE)=0,\"\",VLOOKUP($L35,invullijst!$A$10:$M$177,7,FALSE))","v":""}]
[2,{"$f":"IF($G$3=\"k\",IF(VLOOKUP($D36,invullijst!$A$10:$M$177,11,FALSE)=0,\" \",VLOOKUP($D36,invullijst!$A$10:$M$177,11,FALSE)),\"\")","v":""},{"$f":"IF(VLOOKUP(D36,invullijst!A$10:F$218,4,FALSE)=\"\",\"\",VLOOKUP(D36,invullijst!A$10:D$218,4,FALSE))","v":0},null,{"$f":"IF(VLOOKUP($D36,invullijst!$A$10:$M$177,2,FALSE)=\"\",\"\",VLOOKUP($D36,invullijst!$A$10:$M$177,2,FALSE))","v":0},null,{"$f":"IF(VLOOKUP($D36,invullijst!$A$10:$M$177,7,FALSE)=0,\"\",VLOOKUP($D36,invullijst!$A$10:$M$177,7,FALSE))","v":""},null,2,{"$f":"IF($O$3=\"k\",IF(VLOOKUP($L36,invullijst!$A$10:$M$177,11,FALSE)=0,\" \",VLOOKUP($L36,invullijst!$A$10:$M$177,11,FALSE)),\"\")","v":""},{"$f":"IF(VLOOKUP($L36,invullijst!$A$10:$M$218,4,FALSE)=\"\",\"\",VLOOKUP($L36,invullijst!$A$10:$M$218,4,FALSE))","v":0},null,{"$f":"IF(VLOOKUP($L36,invullijst!$A$10:$M$177,2,FALSE)=\"\",\"\",VLOOKUP($L36,invullijst!$A$10:$M$177,2,FALSE))","v":0},null,{"$f":"IF(VLOOKUP($L36,invullijst!$A$10:$M$177,7,FALSE)=0,\"\",VLOOKUP($L36,invullijst!$A$10:$M$177,7,FALSE))","v":""}]
[3,{"$f":"IF($G$3=\"k\",IF(VLOOKUP($D37,invullijst!$A$10:$M$177,11,FALSE)=0,\" \",VLOOKUP($D37,invullijst!$A$10:$M$177,11,FALSE)),\"\")","v":""},{"$f":"IF(VLOOKUP(D37,invullijst!A$10:F$218,4,FALSE)=\"\",\"\",VLOOKUP(D37,invullijst!A$10:D$218,4,FALSE))","v":0},null,{"$f":"IF(VLOOKUP($D37,invullijst!$A$10:$M$177,2,FALSE)=\"\",\"\",VLOOKUP($D37,invullijst!$A$10:$M$177,2,FALSE))","v":0},null,{"$f":"IF(VLOOKUP($D37,invullijst!$A$10:$M$177,7,FALSE)=0,\"\",VLOOKUP($D37,invullijst!$A$10:$M$177,7,FALSE))","v":""},null,3,{"$f":"IF($O$3=\"k\",IF(VLOOKUP($L37,invullijst!$A$10:$M$177,11,FALSE)=0,\" \",VLOOKUP($L37,invullijst!$A$10:$M$177,11,FALSE)),\"\")","v":""},{"$f":"IF(VLOOKUP($L37,invullijst!$A$10:$M$218,4,FALSE)=\"\",\"\",VLOOKUP($L37,invullijst!$A$10:$M$218,4,FALSE))","v":0},null,{"$f":"IF(VLOOKUP($L37,invullijst!$A$10:$M$177,2,FALSE)=\"\",\"\",VLOOKUP($L37,invullijst!$A$10:$M$177,2,FALSE))","v":0},null,{"$f":"IF(VLOOKUP($L37,invullijst!$A$10:$M$177,7,FALSE)=0,\"\",VLOOKUP($L37,invullijst!$A$10:$M$177,7,FALSE))","v":""}]
["Totaal korps opgelegd A3",{"$nulls":5},{"$f":"SUM(G35:G37)","v":0},null,"Totaal korps opgelegd A3",{"$nulls":5},{"$f":"SUM(O35:O37)","v":0}]

{"sheet":"wedstrijd 3A","index":9,"n_rows":38,"n_cols":15,"rows_kept":38,"merged":[[0,0,0,4],[0,5,0,7],[0,8,0,14],[1,0,1,11],[1,12,1,14],[2,1,2,5],[2,9,2,13],[4,0,4,14],[5,4,5,5],[5,12,5,13],[6,4,6,5],[6,12,6,13],[7,4,7,5],[7,12,7,13],[8,4,8,5],[8,12,8,13],[9,0,9,5],[9,8,9,13],[11,4,11,5],[11,12,11,13],[12,4,12,5],[12,12,12,13],[13,4,13,5],[13,12,13,13],[14,4,14,5],[14,12,14,13],[15,0,15,5],[15,8,15,13],[17,4,17,5],[17,12,17,13],[18,4,18,5],[18,12,18,13],[19,4,19,5],[19,12,19,13],[20,4,20,5],[20,12,20,13],[21,0,21,5],[21,8,21,13],[23,0,23,14],[24,4,24,5],[24,12,24,13],[25,4,25,5],[25,12,25,13],[26,4,26,5],[26,12,26,13],[27,0,27,5],[27,8,27,13],[29,4,29,5],[29,12,29,13],[30,4,30,5],[30,12,30,13],[31,4,31,5],[31,12,31,13],[32,0,32,5],[32,8,32,13],[34,4,34,5],[34,12,34,13],[35,4,35,5],[35,12,35,13],[36,4,36,5],[36,12,36,13],[37,0,37,5],[37,8,37,13]]}
[{"$f":"invullijst!F1","v":"Organisatie"},{"$nulls":4},{"$f":"invullijst!H2","v":"2023 - 2024"},null,null,{"$f":"invullijst!F3","v":"St. Crispinus & Crispinianus Besoijen"}]
["Datum: ",{"$nulls":11},"2024-02-18"]
[1,{"$f":"IF(VLOOKUP(A3,invullijst!A1:F5,2,FALSE)=\"\",\"\",VLOOKUP(A3,invullijst!A1:F5,2,FALSE))","v":"Sint Ambrosius Baardwijk"},{"$nulls":6},2,{"$f":"IF(VLOOKUP(I3,invullijst!A1:C5,2,FALSE)=\"\",\"\",VLOOKUP(I3,invullijst!A1:C5,2,FALSE))","v":"St. Crispinus & Crispinianus Besoijen"}]
[]
["vrijehand"]
[1,{"$f":"IF($G$3=\"k\",IF(VLOOKUP($D6,invullijst!$A$10:$M$177,11,FALSE)=0,\" \",VLOOKUP($D6,invullijst!$A$10:$M$177,11,FALSE)),\"\")","v":""},{"$f":"IF(VLOOKUP(D6,invullijst!A$10:F$218,4,FALSE)=\"\",\"\",VLOOKUP(D6,invullijst!A$10:D$218,4,FALSE))","v":"vr"},102,{"$f":"IF(VLOOKUP($D6,invullijst!$A$10:$M$177,2,FALSE)=\"\",\"\",VLOOKUP($D6,invullijst!$A$10:$M$177,2,FALSE))","v":"John de Jong"},null,{"$f":"IF(VLOOKUP($D6,invullijst!$A$10:$M$177,8,FALSE)=0,\"\",VLOOKUP($D6,invullijst!$A$10:$M$177,8,FALSE))","v":61},null,1,{"$f":"IF($O$3=\"k\",IF(VLOOKUP($L6,invullijst!$A$10:$M$177,11,FALSE)=0,\" \",VLOOKUP($L6,invullijst!$A$10:$M$177,11,FALSE)),\"\")","v":""},{"$f":"IF(VLOOKUP($L6,invullijst!$A$10:$M$218,4,FALSE)=\"\",\"\",VLOOKUP($L6,invullijst!$A$10:$M$218,4,FALSE))","v":"vr"},201,{"$f":"IF(VLOOKUP($L6,invullijst!$A$10:$M$177,2,FALSE)=\"\",\"\",VLOOKUP($L6,invullijst!$A$10:$M$177,2,FALSE))","v":"Sander Oome"},null,{"$f":"IF(VLOOKUP($L6,invullijst!$A$10:$M$177,8,FALSE)=0,\"\",VLOOKUP($L6,invullijst!$A$10:$M$177,8,FALSE))","v":92}]
[2,{"$f":"IF($G$3=\"k\",IF(VLOOKUP($D7,invullijst!$A$10:$M$177,11,FALSE)=0,\" \",VLOOKUP($D7,invullijst!$A$10:$M$177,11,FALSE)),\"\")","v":""},{"$f":"IF(VLOOKUP(D7,invullijst!A$10:F$218,4,FALSE)=\"\",\"\",VLOOKUP(D7,invullijst!A$10:D$218,4,FALSE))","v":"vr"},105,{"$f":"IF(VLOOKUP($D7,invullijst!$A$10:$M$177,2,FALSE)=\"\",\"\",VLOOKUP($D7,invullijst!$A$10:$M$177,2,FALSE))","v":"René Klijn"},null,{"$f":"IF(VLOOKUP($D7,invullijst!$A$10:$M$177,8,FALSE)=0,\"\",VLOOKUP($D7,invullijst!$A$10:$M$177,8,FALSE))","v":81},null,2,{"$f":"IF($O$3=\"k\",IF(VLOOKUP($L7,invullijst!$A$10:$M$177,11,FALSE)=0,\" \",VLOOKUP($L7,invullijst!$A$10:$M$177,11,FALSE)),\"\")","v":""},{"$f":"IF(VLOOKUP($L7,invullijst!$A$10:$M$218,4,FALSE)=\"\",\"\",VLOOKUP($L7,invullijst!$A$10:$M$218,4,FALSE))","v":"vr"},206,{"$f":"IF(VLOOKUP($L7,invullijst!$A$10:$M$177,2,FALSE)=\"\",\"\",VLOOKUP($L7,invullijst!$A$10:$M$177,2,FALSE))","v":"Kees van Hulten"},null,{"$f":"IF(VLOOKUP($L7,invullijst!$A$10:$M$177,8,FALSE)=0,\"\",VLOOKUP($L7,invullijst!$A$10:$M$177,8,FALSE))","v":78}]
[3,{"$f":"IF($G$3=\"k\",IF(VLOOKUP($D8,invullijst!$A$10:$M$177,11,FALSE)=0,\" \",VLOOKUP($D8,invullijst!$A$10:$M$177,11,FALSE)),\"\")","v":""},{"$f":"IF(VLOOKUP(D8,invullijst!A$10:F$218,4,FALSE)=\"\",\"\",VLOOKUP(D8,invullijst!A$10:D$218,4,FALSE))","v":"vr"},106,{"$f":"IF(VLOOKUP($D8,invullijst!$A$10:$M$177,2,FALSE)=\"\",\"\",VLOOKUP($D8,invullijst!$A$10:$M$177,2,FALSE))","v":"René Pullens"},null,{"$f":"IF(VLOOKUP($D8,invullijst!$A$10:$M$177,8,FALSE)=0,\"\",VLOOKUP($D8,invullijst!$A$10:$M$177,8,FALSE))","v":84},null,3,{"$f":"IF($O$3=\"k\",IF(VLOOKUP($L8,invullijst!$A$10:$M$177,11,FALSE)=0,\" \",VLOOKUP($L8,invullijst!$A$10:$M$177,11,FALSE)),\"\")","v":""},{"$f":"IF(VLOOKUP($L8,invullijst!$A$10:$M$218,4,FALSE)=\"\",\"\",VLOOKUP($L8,invullijst!$A$10:$M$218,4,FALSE))","v":"vr"},205,{"$f":"IF(VLOOKUP($L8,invullijst!$A$10:$M$177,2,FALSE)=\"\",\"\",VLOOKUP($L8,invullijst!$A$10:$M$177,2,FALSE))","v":"Jos v/d Snepscheut"},null,{"$f":"IF(VLOOKUP($L8,invullijst!$A$10:$M$177,8,FALSE)=0,\"\",VLOOKUP($L8,invullijst!$A$10:$M$177,8,FALSE))","v":79}]
[4,{"$f":"IF($G$3=\"k\",IF(VLOOKUP($D9,invullijst!$A$10:$M$177,11,FALSE)=0,\" \",VLOOKUP($D9,invullijst!$A$10:$M$177,11,FALSE)),\"\")","v":""},{"$f":"IF(VLOOKUP(D9,invullijst!A$10:F$218,4,FALSE)=\"\",\"\",VLOOKUP(D9,invullijst!A$10:D$218,4,FALSE))","v":"vr"},108,{"$f":"IF(VLOOKUP($D9,invullijst!$A$10:$M$177,2,FALSE)=\"\",\"\",VLOOKUP($D9,invullijst!$A$10:$M$177,2,FALSE))","v":"Bram Pullens"},null,{"$f":"IF(VLOOKUP($D9,invullijst!$A$10:$M$177,8,FALSE)=0,\"\",VLOOKUP($D9,invullijst!$A$10:$M$177,8,FALSE))","v":87},null,4,{"$f":"IF($O$3=\"k\",IF(VLOOKUP($L9,invullijst!$A$10:$M$177,11,FALSE)=0,\" \",VLOOKUP($L9,invullijst!$A$10:$M$177,11,FALSE)),\"\")","v":""},{"$f":"IF(VLOOKUP($L9,invullijst!$A$10:$M$218,4,FALSE)=\"\",\"\",VLOOKUP($L9,invullijst!$A$10:$M$218,4,FALSE))","v":"vr"},203,{"$f":"IF(VLOOKUP($L9,invullijst!$A$10:$M$177,2,FALSE)=\"\",\"\",VLOOKUP($L9,invullijst!$A$10:$M$177,2,FALSE))","v":"Frank van den Houdt"},null,{"$f":"IF(VLOOKUP($L9,invullijst!$A$10:$M$177,8,FALSE)=0,\"\",VLOOKUP($L9,invullijst!$A$10:$M$177,8,FALSE))","v":81}]
["Totaal A korps",{"$nulls":5},{"$f":"SUM(G6:G9)","v":313},null,"Totaal A korps",{"$nulls":5},{"$f":"SUM(O6:O9)","v":330}]
[]
[1,{"$f":"IF($G$3=\"k\",IF(VLOOKUP($D12,invullijst!$A$10:$M$177,11,FALSE)=0,\" \",VLOOKUP($D12,invullijst!$A$10:$M$177,11,FALSE)),\"\")","v":""},{"$f":"IF(VLOOKUP(D12,invullijst!A$10:F$218,4,FALSE)=\"\",\"\",VLOOKUP(D12,invullijst!A$10:D$218,4,FALSE))","v":"vr"},103,{"$f":"IF(VLOOKUP($D12,invullijst!$A$10:$M$177,2,FALSE)=\"\",\"\",VLOOKUP($D12,invullijst!$A$10:$M$177,2,FALSE))","v":"Norbert van Buul"},null,{"$f":"IF(VLOOKUP($D12,invullijst!$A$10:$M$177,8,FALSE)=0,\"\",VLOOKUP($D12,invullijst!$A$10:$M$177,8,FALSE))","v":53},null,1,{"$f":"IF($O$3=\"k\",IF(VLOOKUP($L12,invullijst!$A$10:$M$177,11,FALSE)=0,\" \",VLOOKUP($L12,invullijst!$A$10:$M$177,11,FALSE)),\"\")","v":""},{"$f":"IF(VLOOKUP($L12,invullijst!$A$10:$M$218,4,FALSE)=\"\",\"\",VLOOKUP($L12,invullijst!$A$10:$M$218,4,FALSE))","v":"vr"},209,{"$f":"IF(VLOOKUP($L12,invullijst!$A$10:$M$177,2,FALSE)=\"\",\"\",VLOOKUP($L12,invullijst!$A$10:$M$177,2,FALSE))","v":"René van Kuijk"},null,{"$f":"IF(VLOOKUP($L12,invullijst!$A$10:$M$177,8,FALSE)=0,\"\",VLOOKUP($L12,invullijst!$A$10:$M$177,8,FALSE))","v":87}]
[2,{"$f":"IF($G$3=\"k\",IF(VLOOKUP($D13,invullijst!$A$10:$M$177,11,FALSE)=0,\" \",VLOOKUP($D13,invullijst!$A$10:$M$177,11,FALSE)),\"\")","v":""},{"$f":"IF(VLOOKUP(D13,invullijst!A$10:F$218,4,FALSE)=\"\",\"\",VLOOKUP(D13,invullijst!A$10:D$218,4,FALSE))","v":0},null,{"$f":"IF(VLOOKUP($D13,invullijst!$A$10:$M$177,2,FALSE)=\"\",\"\",VLOOKUP($D13,invullijst!$A$10:$M$177,2,FALSE))","v":0},null,{"$f":"IF(VLOOKUP($D13,invullijst!$A$10:$M$177,8,FALSE)=0,\"\",VLOOKUP($D13,invullijst!$A$10:$M$177,8,FALSE))","v":""},null,2,{"$f":"IF($O$3=\"k\",IF(VLOOKUP($L13,invullijst!$A$10:$M$177,11,FALSE)=0,\" \",VLOOKUP($L13,invullijst!$A$10:$M$177,11,FALSE)),\"\")","v":""},{"$f":"IF(VLOOKUP($L13,invullijst!$A$10:$M$218,4,FALSE)=\"\",\"\",VLOOKUP($L13,invullijst!$A$10:$M$218,4,FALSE))","v":"vr"},215,{"$f":"IF(VLOOKUP($L13,invullijst!$A$10:$M$177,2,FALSE)=\"\",\"\",VLOOKUP($L13,invullijst!$A$10:$M$177,2,FALSE))","v":"Pieter Laghuwitz"},null,{"$f":"IF(VLOOKUP($L13,invullijst!$A$10:$M$177,8,FALSE)=0,\"\",VLOOKUP($L13,invullijst!$A$10:$M$177,8,FALSE))","v":86}]
[3,{"$f":"IF($G$3=\"k\",IF(VLOOKUP($D14,invullijst!$A$10:$M$177,11,FALSE)=0,\" \",VLOOKUP($D14,invullijst!$A$10:$M$177,11,FALSE)),\"\")","v":""},{"$f":"IF(VLOOKUP(D14,invullijst!A$10:F$218,4,FALSE)=\"\",\"\",VLOOKUP(D14,invullijst!A$10:D$218,4,FALSE))","v":0},null,{"$f":"IF(VLOOKUP($D14,invullijst!$A$10:$M$177,2,FALSE)=\"\",\"\",VLOOKUP($D14,invullijst!$A$10:$M$177,2,FALSE))","v":0},null,{"$f":"IF(VLOOKUP($D14,invullijst!$A$10:$M$177,8,FALSE)=0,\"\",VLOOKUP($D14,invullijst!$A$10:$M$177,8,FALSE))","v":""},null,3,{"$f":"IF($O$3=\"k\",IF(VLOOKUP($L14,invullijst!$A$10:$M$177,11,FALSE)=0,\" \",VLOOKUP($L14,invullijst!$A$10:$M$177,11,FALSE)),\"\")","v":""},{"$f":"IF(VLOOKUP($L14,invullijst!$A$10:$M$218,4,FALSE)=\"\",\"\",VLOOKUP($L14,invullijst!$A$10:$M$218,4,FALSE))","v":"vr"},216,{"$f":"IF(VLOOKUP($L14,invullijst!$A$10:$M$177,2,FALSE)=\"\",\"\",VLOOKUP($L14,invullijst!$A$10:$M$177,2,FALSE))","v":"Hans Laghuwitz"},null,{"$f":"IF(VLOOKUP($L14,invullijst!$A$10:$M$177,8,FALSE)=0,\"\",VLOOKUP($L14,invullijst!$A$10:$M$177,8,FALSE))","v":82}]
[4,{"$f":"IF($G$3=\"k\",IF(VLOOKUP($D15,invullijst!$A$10:$M$177,11,FALSE)=0,\" \",VLOOKUP($D15,invullijst!$A$10:$M$177,11,FALSE)),\"\")","v":""},{"$f":"IF(VLOOKUP(D15,invullijst!A$10:F$218,4,FALSE)=\"\",\"\",VLOOKUP(D15,invullijst!A$10:D$218,4,FALSE))","v":0},null,{"$f":"IF(VLOOKUP($D15,invullijst!$A$10:$M$177,2,FALSE)=\"\",\"\",VLOOKUP($D15,invullijst!$A$10:$M$177,2,FALSE))","v":0},null,{"$f":"IF(VLOOKUP($D15,invullijst!$A$10:$M$177,8,FALSE)=0,\"\",VLOOKUP($D15,invullijst!$A$10:$M$177,8,FALSE))","v":""},null,4,{"$f":"IF($O$3=\"k\",IF(VLOOKUP($L15,invullijst!$A$10:$M$177,11,FALSE)=0,\" \",VLOOKUP($L15,invullijst!$A$10:$M$177,11,FALSE)),\"\")","v":""},{"$f":"IF(VLOOKUP($L15,invullijst!$A$10:$M$218,4,FALSE)=\"\",\"\",VLOOKUP($L15,invullijst!$A$10:$M$218,4,FALSE))","v":"vr"},204,{"$f":"IF(VLOOKUP($L15,invullijst!$A$10:$M$177,2,FALSE)=\"\",\"\",VLOOKUP($L15,invullijst!$A$10:$M$177,2,FALSE))","v":"Harry de Louw"},null,{"$f":"IF(VLOOKUP($L15,invullijst!$A$10:$M$177,8,FALSE)=0,\"\",VLOOKUP($L15,invullijst!$A$10:$M$177,8,FALSE))","v":85}]
["Totaal B1 korps",{"$nulls":5},{"$f":"SUM(G12:G15)","v":53},null,"Totaal B1 korps",{"$nulls":5},{"$f":"SUM(O12:O15)","v":340}]
[]
[1,{"$f":"IF($G$3=\"k\",IF(VLOOKUP($D18,invullijst!$A$10:$M$177,11,FALSE)=0,\" \",VLOOKUP($D18,invullijst!$A$10:$M$177,11,FALSE)),\"\")","v":""},{"$f":"IF(VLOOKUP(D18,invullijst!A$10:F$218,4,FALSE)=\"\",\"\",VLOOKUP(D18,invullijst!A$10:D$218,4,FALSE))","v":0},null,{"$f":"IF(VLOOKUP($D18,invullijst!$A$10:$M$177,2,FALSE)=\"\",\"\",VLOOKUP($D18,invullijst!$A$10:$M$177,2,FALSE))","v":0},null,{"$f":"IF(VLOOKUP($D18,invullijst!$A$10:$M$177,8,FALSE)=0,\"\",VLOOKUP($D18,invullijst!$A$10:$M$177,8,FALSE))","v":""},null,1,{"$f":"IF($O$3=\"k\",IF(VLOOKUP($L18,invullijst!$A$10:$M$177,11,FALSE)=0,\" \",VLOOKUP($L18,invullijst!$A$10:$M$177,11,FALSE)),\"\")","v":""},{"$f":"IF(VLOOKUP($L18,invullijst!$A$10:$M$218,4,FALSE)=\"\",\"\",VLOOKUP($L18,invullijst!$A$10:$M$218,4,FALSE))","v":"vr"},210,{"$f":"IF(VLOOKUP($L18,invullijst!$A$10:$M$177,2,FALSE)=\"\",\"\",VLOOKUP($L18,invullijst!$A$10:$M$177,2,FALSE))","v":"Nick de Vaan"},null,{"$f":"IF(VLOOKUP($L18,invullijst!$A$10:$M$177,8,FALSE)=0,\"\",VLOOKUP($L18,invullijst!$A$10:$M$177,8,FALSE))","v":74}]
[2,{"$f":"IF($G$3=\"k\",IF(VLOOKUP($D19,invullijst!$A$10:$M$177,11,FALSE)=0,\" \",VLOOKUP($D19,invullijst!$A$10:$M$177,11,FALSE)),\"\")","v":""},{"$f":"IF(VLOOKUP(D19,invullijst!A$10:F$218,4,FALSE)=\"\",\"\",VLOOKUP(D19,invullijst!A$10:D$218,4,FALSE))","v":0},null,{"$f":"IF(VLOOKUP($D19,invullijst!$A$10:$M$177,2,FALSE)=\"\",\"\",VLOOKUP($D19,invullijst!$A$10:$M$177,2,FALSE))","v":0},null,{"$f":"IF(VLOOKUP($D19,invullijst!$A$10:$M$177,8,FALSE)=0,\"\",VLOOKUP($D19,invullijst!$A$10:$M$177,8,FALSE))","v":""},null,2,{"$f":"IF($O$3=\"k\",IF(VLOOKUP($L19,invullijst!$A$10:$M$177,11,FALSE)=0,\" \",VLOOKUP($L19,invullijst!$A$10:$M$177,11,FALSE)),\"\")","v":""},{"$f":"IF(VLOOKUP($L19,invullijst!$A$10:$M$218,4,FALSE)=\"\",\"\",VLOOKUP($L19,invullijst!$A$10:$M$218,4,FALSE))","v":"vr"},202,{"$f":"IF(VLOOKUP($L19,invullijst!$A$10:$M$177,2,FALSE)=\"\",\"\",VLOOKUP($L19,invullijst!$A$10:$M$177,2,FALSE))","v":"Arco van Kuijk"},null,{"$f":"IF(VLOOKUP($L19,invullijst!$A$10:$M$177,8,FALSE)=0,\"\",VLOOKUP($L19,invullijst!$A$10:$M$177,8,FALSE))","v":69}]
[3,{"$f":"IF($G$3=\"k\",IF(VLOOKUP($D20,invullijst!$A$10:$M$177,11,FALSE)=0,\" \",VLOOKUP($D20,invullijst!$A$10:$M$177,11,FALSE)),\"\")","v":""},{"$f":"IF(VLOOKUP(D20,invullijst!A$10:F$218,4,FALSE)=\"\",\"\",VLOOKUP(D20,invullijst!A$10:D$218,4,FALSE))","v":0},null,{"$f":"IF(VLOOKUP($D20,invullijst!$A$10:$M$177,2,FALSE)=\"\",\"\",VLOOKUP($D20,invullijst!$A$10:$M$177,2,FALSE))","v":0},null,{"$f":"IF(VLOOKUP($D20,invullijst!$A$10:$M$177,8,FALSE)=0,\"\",VLOOKUP($D20,invullijst!$A$10:$M$177,8,FALSE))","v":""},null,3,{"$f":"IF($O$3=\"k\",IF(VLOOKUP($L20,invullijst!$A$10:$M$177,11,FALSE)=0,\" \",VLOOKUP($L20,invullijst!$A$10:$M$177,11,FALSE)),\"\")","v":""},{"$f":"IF(VLOOKUP($L20,invullijst!$A$10:$M$218,4,FALSE)=\"\",\"\",VLOOKUP($L20,invullijst!$A$10:$M$218,4,FALSE))","v":"vr"},217,{"$f":"IF(VLOOKUP($L20,invullijst!$A$10:$M$177,2,FALSE)=\"\",\"\",VLOOKUP($L20,invullijst!$A$10:$M$177,2,FALSE))","v":"Jānis Jākobsons"},null,{"$f":"IF(VLOOKUP($L20,invullijst!$A$10:$M$177,8,FALSE)=0,\"\",VLOOKUP($L20,invullijst!$A$10:$M$177,8,FALSE))","v":81}]
[4,{"$f":"IF($G$3=\"k\",IF(VLOOKUP($D21,invullijst!$A$10:$M$177,11,FALSE)=0,\" \",VLOOKUP($D21,invullijst!$A$10:$M$177,11,FALSE)),\"\")","v":""},{"$f":"IF(VLOOKUP(D21,invullijst!A$10:F$218,4,FALSE)=\"\",\"\",VLOOKUP(D21,invullijst!A$10:D$218,4,FALSE))","v":0},null,{"$f":"IF(VLOOKUP($D21,invullijst!$A$10:$M$177,2,FALSE)=\"\",\"\",VLOOKUP($D21,invullijst!$A$10:$M$177,2,FALSE))","v":0},null,{"$f":"IF(VLOOKUP($D21,invullijst!$A$10:$M$177,8,FALSE)=0,\"\",VLOOKUP($D21,invullijst!$A$10:$M$177,8,FALSE))","v":""},null,4,{"$f":"IF($O$3=\"k\",IF(VLOOKUP($L21,invullijst!$A$10:$M$177,11,FALSE)=0,\" \",VLOOKUP($L21,invullijst!$A$10:$M$177,11,FALSE)),\"\")","v":""},{"$f":"IF(VLOOKUP($L21,invullijst!$A$10:$M$218,4,FALSE)=\"\",\"\",VLOOKUP($L21,invullijst!$A$10:$M$218,4,FALSE))","v":0},null,{"$f":"IF(VLOOKUP($L21,invullijst!$A$10:$M$177,2,FALSE)=\"\",\"\",VLOOKUP($L21,invullijst!$A$10:$M$177,2,FALSE))","v":0},null,{"$f":"IF(VLOOKUP($L21,invullijst!$A$10:$M$177,8,FALSE)=0,\"\",VLOOKUP($L21,invullijst!$A$10:$M$177,8,FALSE))","v":""}]
["DIVERSEN / INHAAL",{"$nulls":7},"DIVERSEN / INHAAL"]
[]
["OPGELEGD (Jeugd <16 en 65+)"]
[1,{"$f":"IF($G$3=\"k\",IF(VLOOKUP($D25,invullijst!$A$10:$M$177,11,FALSE)=0,\" \",VLOOKUP($D25,invullijst!$A$10:$M$177,11,FALSE)),\"\")","v":""},{"$f":"IF(VLOOKUP(D25,invullijst!A$10:F$218,4,FALSE)=\"\",\"\",VLOOKUP(D25,invullijst!A$10:D$218,4,FALSE))","v":"65+"},111,{"$f":"IF(VLOOKUP($D25,invullijst!$A$10:$M$177,2,FALSE)=\"\",\"\",VLOOKUP($D25,invullijst!$A$10:$M$177,2,FALSE))","v":"Frans van Buul"},null,{"$f":"IF(VLOOKUP($D25,invullijst!$A$10:$M$177,8,FALSE)=0,\"\",VLOOKUP($D25,invullijst!$A$10:$M$177,8,FALSE))","v":81},null,1,{"$f":"IF($O$3=\"k\",IF(VLOOKUP($L25,invullijst!$A$10:$M$177,11,FALSE)=0,\" \",VLOOKUP($L25,invullijst!$A$10:$M$177,11,FALSE)),\"\")","v":""},{"$f":"IF(VLOOKUP($L25,invullijst!$A$10:$M$218,4,FALSE)=\"\",\"\",VLOOKUP($L25,invullijst!$A$10:$M$218,4,FALSE))","v":"65+"},211,{"$f":"IF(VLOOKUP($L25,invullijst!$A$10:$M$177,2,FALSE)=\"\",\"\",VLOOKUP($L25,invullijst!$A$10:$M$177,2,FALSE))","v":"Ad van den houdt"},null,{"$f":"IF(VLOOKUP($L25,invullijst!$A$10:$M$177,8,FALSE)=0,\"\",VLOOKUP($L25,invullijst!$A$10:$M$177,8,FALSE))","v":92}]
[2,{"$f":"IF($G$3=\"k\",IF(VLOOKUP($D26,invullijst!$A$10:$M$177,11,FALSE)=0,\" \",VLOOKUP($D26,invullijst!$A$10:$M$177,11,FALSE)),\"\")","v":""},{"$f":"IF(VLOOKUP(D26,invullijst!A$10:F$218,4,FALSE)=\"\",\"\",VLOOKUP(D26,invullijst!A$10:D$218,4,FALSE))","v":"J"},109,{"$f":"IF(VLOOKUP($D26,invullijst!$A$10:$M$177,2,FALSE)=\"\",\"\",VLOOKUP($D26,invullijst!$A$10:$M$177,2,FALSE))","v":"Gijs Pullens"},null,{"$f":"IF(VLOOKUP($D26,invullijst!$A$10:$M$177,8,FALSE)=0,\"\",VLOOKUP($D26,invullijst!$A$10:$M$177,8,FALSE))","v":92},null,2,{"$f":"IF($O$3=\"k\",IF(VLOOKUP($L26,invullijst!$A$10:$M$177,11,FALSE)=0,\" \",VLOOKUP($L26,invullijst!$A$10:$M$177,11,FALSE)),\"\")","v":""},{"$f":"IF(VLOOKUP($L26,invullijst!$A$10:$M$218,4,FALSE)=\"\",\"\",VLOOKUP($L26,invullijst!$A$10:$M$218,4,FALSE))","v":"65+"},212,{"$f":"IF(VLOOKUP($L26,invullijst!$A$10:$M$177,2,FALSE)=\"\",\"\",VLOOKUP($L26,invullijst!$A$10:$M$177,2,FALSE))","v":"René Duquesnoy"},null,92]
[3,{"$f":"IF($G$3=\"k\",IF(VLOOKUP($D27,invullijst!$A$10:$M$177,11,FALSE)=0,\" \",VLOOKUP($D27,invullijst!$A$10:$M$177,11,FALSE)),\"\")","v":""},{"$f":"IF(VLOOKUP(D27,invullijst!A$10:F$218,4,FALSE)=\"\",\"\",VLOOKUP(D27,invullijst!A$10:D$218,4,FALSE))","v":"65+"},113,{"$f":"IF(VLOOKUP($D27,invullijst!$A$10:$M$177,2,FALSE)=\"\",\"\",VLOOKUP($D27,invullijst!$A$10:$M$177,2,FALSE))","v":"Kees Coppens"},null,{"$f":"IF(VLOOKUP($D27,invullijst!$A$10:$M$177,8,FALSE)=0,\"\",VLOOKUP($D27,invullijst!$A$10:$M$177,8,FALSE))","v":88},null,3,{"$f":"IF($O$3=\"k\",IF(VLOOKUP($L27,invullijst!$A$10:$M$177,11,FALSE)=0,\" \",VLOOKUP($L27,invullijst!$A$10:$M$177,11,FALSE)),\"\")","v":""},{"$f":"IF(VLOOKUP($L27,invullijst!$A$10:$M$218,4,FALSE)=\"\",\"\",VLOOKUP($L27,invullijst!$A$10:$M$218,4,FALSE))","v":"65+"},214,{"$f":"IF(VLOOKUP($L27,invullijst!$A$10:$M$177,2,FALSE)=\"\",\"\",VLOOKUP($L27,invullijst!$A$10:$M$177,2,FALSE))","v":"André de Vaan"},null,{"$f":"IF(VLOOKUP($L27,invullijst!$A$10:$M$177,8,FALSE)=0,\"\",VLOOKUP($L27,invullijst!$A$10:$M$177,8,FALSE))","v":91}]
["Totaal korps opgelegd A1",{"$nulls":5},{"$f":"SUM(G25:G27)","v":261},null,"Totaal korps opgelegd A1",{"$nulls":5},{"$f":"SUM(O25:O27)","v":275}]
[]
[1,{"$f":"IF($G$3=\"k\",IF(VLOOKUP($D30,invullijst!$A$10:$M$177,11,FALSE)=0,\" \",VLOOKUP($D30,invullijst!$A$10:$M$177,11,FALSE)),\"\")","v":""},{"$f":"IF(VLOOKUP(D30,invullijst!A$10:F$218,4,FALSE)=\"\",\"\",VLOOKUP(D30,invullijst!A$10:D$218,4,FALSE))","v":0},null,{"$f":"IF(VLOOKUP($D30,invullijst!$A$10:$M$177,2,FALSE)=\"\",\"\",VLOOKUP($D30,invullijst!$A$10:$M$177,2,FALSE))","v":0},null,{"$f":"IF(VLOOKUP($D30,invullijst!$A$10:$M$177,8,FALSE)=0,\"\",VLOOKUP($D30,invullijst!$A$10:$M$177,8,FALSE))","v":""},null,1,{"$f":"IF($O$3=\"k\",IF(VLOOKUP($L30,invullijst!$A$10:$M$177,11,FALSE)=0,\" \",VLOOKUP($L30,invullijst!$A$10:$M$177,11,FALSE)),\"\")","v":""},{"$f":"IF(VLOOKUP($L30,invullijst!$A$10:$M$218,4,FALSE)=\"\",\"\",VLOOKUP($L30,invullijst!$A$10:$M$218,4,FALSE))","v":0},null,{"$f":"IF(VLOOKUP($L30,invullijst!$A$10:$M$177,2,FALSE)=\"\",\"\",VLOOKUP($L30,invullijst!$A$10:$M$177,2,FALSE))","v":0},null,{"$f":"IF(VLOOKUP($L30,invullijst!$A$10:$M$177,8,FALSE)=0,\"\",VLOOKUP($L30,invullijst!$A$10:$M$177,8,FALSE))","v":""}]
[2,{"$f":"IF($G$3=\"k\",IF(VLOOKUP($D31,invullijst!$A$10:$M$177,11,FALSE)=0,\" \",VLOOKUP($D31,invullijst!$A$10:$M$177,11,FALSE)),\"\")","v":""},{"$f":"IF(VLOOKUP(D31,invullijst!A$10:F$218,4,FALSE)=\"\",\"\",VLOOKUP(D31,invullijst!A$10:D$218,4,FALSE))","v":0},null,{"$f":"IF(VLOOKUP($D31,invullijst!$A$10:$M$177,2,FALSE)=\"\",\"\",VLOOKUP($D31,invullijst!$A$10:$M$177,2,FALSE))","v":0},null,{"$f":"IF(VLOOKUP($D31,invullijst!$A$10:$M$177,8,FALSE)=0,\"\",VLOOKUP($D31,invullijst!$A$10:$M$177,8,FALSE))","v":""},null,2,{"$f":"IF($O$3=\"k\",IF(VLOOKUP($L31,invullijst!$A$10:$M$177,11,FALSE)=0,\" \",VLOOKUP($L31,invullijst!$A$10:$M$177,11,FALSE)),\"\")","v":""},{"$f":"IF(VLOOKUP($L31,invullijst!$A$10:$M$218,4,FALSE)=\"\",\"\",VLOOKUP($L31,invullijst!$A$10:$M$218,4,FALSE))","v":0},null,{"$f":"IF(VLOOKUP($L31,invullijst!$A$10:$M$177,2,FALSE)=\"\",\"\",VLOOKUP($L31,invullijst!$A$10:$M$177,2,FALSE))","v":0},null,{"$f":"IF(VLOOKUP($L31,invullijst!$A$10:$M$177,8,FALSE)=0,\"\",VLOOKUP($L31,invullijst!$A$10:$M$177,8,FALSE))","v":""}]
[3,{"$f":"IF($G$3=\"k\",IF(VLOOKUP($D32,invullijst!$A$10:$M$177,11,FALSE)=0,\" \",VLOOKUP($D32,invullijst!$A$10:$M$177,11,FALSE)),\"\")","v":""},{"$f":"IF(VLOOKUP(D32,invullijst!A$10:F$218,4,FALSE)=\"\",\"\",VLOOKUP(D32,invullijst!A$10:D$218,4,FALSE))","v":0},null,{"$f":"IF(VLOOKUP($D32,invullijst!$A$10:$M$177,2,FALSE)=\"\",\"\",VLOOKUP($D32,invullijst!$A$10:$M$177,2,FALSE))","v":0},null,{"$f":"IF(VLOOKUP($D32,invullijst!$A$10:$M$177,8,FALSE)=0,\"\",VLOOKUP($D32,invullijst!$A$10:$M$177,8,FALSE))","v":""},null,3,{"$f":"IF($O$3=\"k\",IF(VLOOKUP($L32,invullijst!$A$10:$M$177,11,FALSE)=0,\" \",VLOOKUP($L32,invullijst!$A$10:$M$177,11,FALSE)),\"\")","v":""},{"$f":"IF(VLOOKUP($L32,invullijst!$A$10:$M$218,4,FALSE)=\"\",\"\",VLOOKUP($L32,invullijst!$A$10:$M$218,4,FALSE))","v":0},null,{"$f":"IF(VLOOKUP($L32,invullijst!$A$10:$M$177,2,FALSE)=\"\",\"\",VLOOKUP($L32,invullijst!$A$10:$M$177,2,FALSE))","v":0},null,{"$f":"IF(VLOOKUP($L32,invullijst!$A$10:$M$177,8,FALSE)=0,\"\",VLOOKUP($L32,invullijst!$A$10:$M$177,8,FALSE))","v":""}]
["Totaal korps opgelegd A2",{"$nulls":5},0,null,"Totaal korps opgelegd A2",{"$nulls":5},{"$f":"SUM(O30:O32)","v":0}]
[]
[1,{"$f":"IF($G$3=\"k\",IF(VLOOKUP($D35,invullijst!$A$10:$M$177,11,FALSE)=0,\" \",VLOOKUP($D35,invullijst!$A$10:$M$177,11,FALSE)),\"\")","v":""},{"$f":"IF(VLOOKUP(D35,invullijst!A$10:F$218,4,FALSE)=\"\",\"\",VLOOKUP(D35,invullijst!A$10:D$218,4,FALSE))","v":0},null,{"$f":"IF(VLOOKUP($D35,invullijst!$A$10:$M$177,2,FALSE)=\"\",\"\",VLOOKUP($D35,invullijst!$A$10:$M$177,2,FALSE))","v":0},null,{"$f":"IF(VLOOKUP($D35,invullijst!$A$10:$M$177,8,FALSE)=0,\"\",VLOOKUP($D35,invullijst!$A$10:$M$177,8,FALSE))","v":""},null,1,{"$f":"IF($O$3=\"k\",IF(VLOOKUP($L35,invullijst!$A$10:$M$177,11,FALSE)=0,\" \",VLOOKUP($L35,invullijst!$A$10:$M$177,11,FALSE)),\"\")","v":""},{"$f":"IF(VLOOKUP($L35,invullijst!$A$10:$M$218,4,FALSE)=\"\",\"\",VLOOKUP($L35,invullijst!$A$10:$M$218,4,FALSE))","v":0},null,"Arco van Kuijk (bij)",null,68]
[2,{"$f":"IF($G$3=\"k\",IF(VLOOKUP($D36,invullijst!$A$10:$M$177,11,FALSE)=0,\" \",VLOOKUP($D36,invullijst!$A$10:$M$177,11,FALSE)),\"\")","v":""},{"$f":"IF(VLOOKUP(D36,invullijst!A$10:F$218,4,FALSE)=\"\",\"\",VLOOKUP(D36,invullijst!A$10:D$218,4,FALSE))","v":0},null,{"$f":"IF(VLOOKUP($D36,invullijst!$A$10:$M$177,2,FALSE)=\"\",\"\",VLOOKUP($D36,invullijst!$A$10:$M$177,2,FALSE))","v":0},null,{"$f":"IF(VLOOKUP($D36,invullijst!$A$10:$M$177,8,FALSE)=0,\"\",VLOOKUP($D36,invullijst!$A$10:$M$177,8,FALSE))","v":""},null,2,{"$f":"IF($O$3=\"k\",IF(VLOOKUP($L36,invullijst!$A$10:$M$177,11,FALSE)=0,\" \",VLOOKUP($L36,invullijst!$A$10:$M$177,11,FALSE)),\"\")","v":""},{"$f":"IF(VLOOKUP($L36,invullijst!$A$10:$M$218,4,FALSE)=\"\",\"\",VLOOKUP($L36,invullijst!$A$10:$M$218,4,FALSE))","v":0},null,{"$f":"IF(VLOOKUP($L36,invullijst!$A$10:$M$177,2,FALSE)=\"\",\"\",VLOOKUP($L36,invullijst!$A$10:$M$177,2,FALSE))","v":0},null,{"$f":"IF(VLOOKUP($L36,invullijst!$A$10:$M$177,8,FALSE)=0,\"\",VLOOKUP($L36,invullijst!$A$10:$M$177,8,FALSE))","v":""}]
[3,{"$f":"IF($G$3=\"k\",IF(VLOOKUP($D37,invullijst!$A$10:$M$177,11,FALSE)=0,\" \",VLOOKUP($D37,invullijst!$A$10:$M$177,11,FALSE)),\"\")","v":""},{"$f":"IF(VLOOKUP(D37,invullijst!A$10:F$218,4,FALSE)=\"\",\"\",VLOOKUP(D37,invullijst!A$10:D$218,4,FALSE))","v":0},null,{"$f":"IF(VLOOKUP($D37,invullijst!$A$10:$M$177,2,FALSE)=\"\",\"\",VLOOKUP($D37,invullijst!$A$10:$M$177,2,FALSE))","v":0},null,{"$f":"IF(VLOOKUP($D37,invullijst!$A$10:$M$177,8,FALSE)=0,\"\",VLOOKUP($D37,invullijst!$A$10:$M$177,8,FALSE))","v":""},null,3,{"$f":"IF($O$3=\"k\",IF(VLOOKUP($L37,invullijst!$A$10:$M$177,11,FALSE)=0,\" \",VLOOKUP($L37,invullijst!$A$10:$M$177,11,FALSE)),\"\")","v":""},{"$f":"IF(VLOOKUP($L37,invullijst!$A$10:$M$218,4,FALSE)=\"\",\"\",VLOOKUP($L37,invullijst!$A$10:$M$218,4,FALSE))","v":0},null,{"$f":"IF(VLOOKUP($L37,invullijst!$A$10:$M$177,2,FALSE)=\"\",\"\",VLOOKUP($L37,invullijst!$A$10:$M$177,2,FALSE))","v":0},null,{"$f":"IF(VLOOKUP($L37,invullijst!$A$10:$M$177,8,FALSE)=0,\"\",VLOOKUP($L37,invullijst!$A$10:$M$177,8,FALSE))","v":""}]
["Totaal korps opgelegd A3",{"$nulls":5},{"$f":"SUM(G35:G37)","v":0},null,"Totaal korps opgelegd A3",{"$nulls":5},{"$f":"SUM(O35:O37)","v":68}]

{"sheet":"wedstrijd 3B","index":10,"n_rows":38,"n_cols":15,"rows_kept":38,"merged":[[0,0,0,4],[0,5,0,7],[0,8,0,14],[1,0,1,11],[1,12,1,14],[2,1,2,5],[2,9,2,13],[4,0,4,14],[5,4,5,5],[5,12,5,13],[6,4,6,5],[6,12,6,13],[7,4,7,5],[7,12,7,13],[8,4,8,5],[8,12,8,13],[9,0,9,5],[9,8,9,13],[11,4,11,5],[11,12,11,13],[12,4,12,5],[12,12,12,13],[13,4,13,5],[13,12,13,13],[14,4,14,5],[14,12,14,13],[15,0,15,5],[15,8,15,13],[17,4,17,5],[17,12,17,13],[18,4,18,5],[18,12,18,13],[19,4,19,5],[19,12,19,13],[20,4,20,5],[20,12,20,13],[21,0,21,5],[21,8,21,13],[23,0,23,14],[24,4,24,5],[24,12,24,13],[25,4,25,5],[25,12,25,13],[26,4,26,5],[26,12,26,13],[27,0,27,5],[27,8,27,13],[29,4,29,5],[29,12,29,13],[30,4,30,5],[30,12,30,13],[31,4,31,5],[31,12,31,13],[32,0,32,5],[32,8,32,13],[34,4,34,5],[34,12,34,13],[35,4,35,5],[35,12,35,13],[36,4,36,5],[36,12,36,13],[37,0,37,5],[37,8,37,13]]}
[{"$f":"invullijst!F1","v":"Organisatie"},{"$nulls":4},{"$f":"invullijst!H2","v":"2023 - 2024"},null,null,{"$f":"invullijst!F3","v":"St. Crispinus & Crispinianus Besoijen"}]
["Datum: ",{"$nulls":11},"2024-02-18"]
[3,{"$f":"IF(VLOOKUP(A3,invullijst!A1:F5,2,FALSE)=\"\",\"\",VLOOKUP(A3,invullijst!A1:F5,2,FALSE))","v":"O.L.V. Schuts Elshout"},{"$nulls":6},5,{"$f":"IF(VLOOKUP(I3,invullijst!A1:C5,2,FALSE)=\"\",\"\",VLOOKUP(I3,invullijst!A1:C5,2,FALSE))","v":"Sint Jan Baptist Kaatsheuvel"}]
[]
["vrijehand"]
[1,{"$f":"IF($G$3=\"k\",IF(VLOOKUP($D6,invullijst!$A$10:$M$177,11,FALSE)=0,\" \",VLOOKUP($D6,invullijst!$A$10:$M$177,11,FALSE)),\"\")","v":""},{"$f":"IF(VLOOKUP(D6,invullijst!A$10:F$218,4,FALSE)=\"\",\"\",VLOOKUP(D6,invullijst!A$10:D$218,4,FALSE))","v":"vr"},302,{"$f":"IF(VLOOKUP($D6,invullijst!$A$10:$M$177,2,FALSE)=\"\",\"\",VLOOKUP($D6,invullijst!$A$10:$M$177,2,FALSE))","v":"Freek de Jong"},null,{"$f":"IF(VLOOKUP($D6,invullijst!$A$10:$M$177,8,FALSE)=0,\"\",VLOOKUP($D6,invullijst!$A$10:$M$177,8,FALSE))","v":90},null,1,{"$f":"IF($O$3=\"k\",IF(VLOOKUP($L6,invullijst!$A$10:$M$177,11,FALSE)=0,\" \",VLOOKUP($L6,invullijst!$A$10:$M$177,11,FALSE)),\"\")","v":""},{"$f":"IF(VLOOKUP($L6,invullijst!$A$10:$M$218,4,FALSE)=\"\",\"\",VLOOKUP($L6,invullijst!$A$10:$M$218,4,FALSE))","v":"vr"},504,{"$f":"IF(VLOOKUP($L6,invullijst!$A$10:$M$177,2,FALSE)=\"\",\"\",VLOOKUP($L6,invullijst!$A$10:$M$177,2,FALSE))","v":"Koen v/d Ven"},null,{"$f":"IF(VLOOKUP($L6,invullijst!$A$10:$M$177,8,FALSE)=0,\"\",VLOOKUP($L6,invullijst!$A$10:$M$177,8,FALSE))","v":87}]
[2,{"$f":"IF($G$3=\"k\",IF(VLOOKUP($D7,invullijst!$A$10:$M$177,11,FALSE)=0,\" \",VLOOKUP($D7,invullijst!$A$10:$M$177,11,FALSE)),\"\")","v":""},{"$f":"IF(VLOOKUP(D7,invullijst!A$10:F$218,4,FALSE)=\"\",\"\",VLOOKUP(D7,invullijst!A$10:D$218,4,FALSE))","v":"vr"},305,{"$f":"IF(VLOOKUP($D7,invullijst!$A$10:$M$177,2,FALSE)=\"\",\"\",VLOOKUP($D7,invullijst!$A$10:$M$177,2,FALSE))","v":"Johan Klerx"},null,{"$f":"IF(VLOOKUP($D7,invullijst!$A$10:$M$177,8,FALSE)=0,\"\",VLOOKUP($D7,invullijst!$A$10:$M$177,8,FALSE))","v":89},null,2,{"$f":"IF($O$3=\"k\",IF(VLOOKUP($L7,invullijst!$A$10:$M$177,11,FALSE)=0,\" \",VLOOKUP($L7,invullijst!$A$10:$M$177,11,FALSE)),\"\")","v":""},{"$f":"IF(VLOOKUP($L7,invullijst!$A$10:$M$218,4,FALSE)=\"\",\"\",VLOOKUP($L7,invullijst!$A$10:$M$218,4,FALSE))","v":"vr"},501,{"$f":"IF(VLOOKUP($L7,invullijst!$A$10:$M$177,2,FALSE)=\"\",\"\",VLOOKUP($L7,invullijst!$A$10:$M$177,2,FALSE))","v":"Annette Vos"},null,{"$f":"IF(VLOOKUP($L7,invullijst!$A$10:$M$177,8,FALSE)=0,\"\",VLOOKUP($L7,invullijst!$A$10:$M$177,8,FALSE))","v":83}]
[3,{"$f":"IF($G$3=\"k\",IF(VLOOKUP($D8,invullijst!$A$10:$M$177,11,FALSE)=0,\" \",VLOOKUP($D8,invullijst!$A$10:$M$177,11,FALSE)),\"\")","v":""},{"$f":"IF(VLOOKUP(D8,invullijst!A$10:F$218,4,FALSE)=\"\",\"\",VLOOKUP(D8,invullijst!A$10:D$218,4,FALSE))","v":"vr"},306,{"$f":"IF(VLOOKUP($D8,invullijst!$A$10:$M$177,2,FALSE)=\"\",\"\",VLOOKUP($D8,invullijst!$A$10:$M$177,2,FALSE))","v":"Ron Groot"},null,{"$f":"IF(VLOOKUP($D8,invullijst!$A$10:$M$177,8,FALSE)=0,\"\",VLOOKUP($D8,invullijst!$A$10:$M$177,8,FALSE))","v":91},null,3,{"$f":"IF($O$3=\"k\",IF(VLOOKUP($L8,invullijst!$A$10:$M$177,11,FALSE)=0,\" \",VLOOKUP($L8,invullijst!$A$10:$M$177,11,FALSE)),\"\")","v":""},{"$f":"IF(VLOOKUP($L8,invullijst!$A$10:$M$218,4,FALSE)=\"\",\"\",VLOOKUP($L8,invullijst!$A$10:$M$218,4,FALSE))","v":"vr"},507,{"$f":"IF(VLOOKUP($L8,invullijst!$A$10:$M$177,2,FALSE)=\"\",\"\",VLOOKUP($L8,invullijst!$A$10:$M$177,2,FALSE))","v":"Michael Blaauwbroek"},null,{"$f":"IF(VLOOKUP($L8,invullijst!$A$10:$M$177,8,FALSE)=0,\"\",VLOOKUP($L8,invullijst!$A$10:$M$177,8,FALSE))","v":77}]
[4,{"$f":"IF($G$3=\"k\",IF(VLOOKUP($D9,invullijst!$A$10:$M$177,11,FALSE)=0,\" \",VLOOKUP($D9,invullijst!$A$10:$M$177,11,FALSE)),\"\")","v":""},{"$f":"IF(VLOOKUP(D9,invullijst!A$10:F$218,4,FALSE)=\"\",\"\",VLOOKUP(D9,invullijst!A$10:D$218,4,FALSE))","v":"vr"},304,{"$f":"IF(VLOOKUP($D9,invullijst!$A$10:$M$177,2,FALSE)=\"\",\"\",VLOOKUP($D9,invullijst!$A$10:$M$177,2,FALSE))","v":"Henk Bruurmijn "},null,{"$f":"IF(VLOOKUP($D9,invullijst!$A$10:$M$177,8,FALSE)=0,\"\",VLOOKUP($D9,invullijst!$A$10:$M$177,8,FALSE))","v":78},null,4,{"$f":"IF($O$3=\"k\",IF(VLOOKUP($L9,invullijst!$A$10:$M$177,11,FALSE)=0,\" \",VLOOKUP($L9,invullijst!$A$10:$M$177,11,FALSE)),\"\")","v":""},{"$f":"IF(VLOOKUP($L9,invullijst!$A$10:$M$218,4,FALSE)=\"\",\"\",VLOOKUP($L9,invullijst!$A$10:$M$218,4,FALSE))","v":"vr"},506,{"$f":"IF(VLOOKUP($L9,invullijst!$A$10:$M$177,2,FALSE)=\"\",\"\",VLOOKUP($L9,invullijst!$A$10:$M$177,2,FALSE))","v":"Maikel Monden"},null,{"$f":"IF(VLOOKUP($L9,invullijst!$A$10:$M$177,8,FALSE)=0,\"\",VLOOKUP($L9,invullijst!$A$10:$M$177,8,FALSE))","v":80}]
["Totaal A korps",{"$nulls":5},{"$f":"SUM(G6:G9)","v":348},null,"Totaal A korps",{"$nulls":5},{"$f":"SUM(O6:O9)","v":327}]
[]
[1,{"$f":"IF($G$3=\"k\",IF(VLOOKUP($D12,invullijst!$A$10:$M$177,11,FALSE)=0,\" \",VLOOKUP($D12,invullijst!$A$10:$M$177,11,FALSE)),\"\")","v":""},{"$f":"IF(VLOOKUP(D12,invullijst!A$10:F$218,4,FALSE)=\"\",\"\",VLOOKUP(D12,invullijst!A$10:D$218,4,FALSE))","v":"vr"},311,{"$f":"IF(VLOOKUP($D12,invullijst!$A$10:$M$177,2,FALSE)=\"\",\"\",VLOOKUP($D12,invullijst!$A$10:$M$177,2,FALSE))","v":"Ton Kolmans"},null,{"$f":"IF(VLOOKUP($D12,invullijst!$A$10:$M$177,8,FALSE)=0,\"\",VLOOKUP($D12,invullijst!$A$10:$M$177,8,FALSE))","v":80},null,1,{"$f":"IF($O$3=\"k\",IF(VLOOKUP($L12,invullijst!$A$10:$M$177,11,FALSE)=0,\" \",VLOOKUP($L12,invullijst!$A$10:$M$177,11,FALSE)),\"\")","v":""},{"$f":"IF(VLOOKUP($L12,invullijst!$A$10:$M$218,4,FALSE)=\"\",\"\",VLOOKUP($L12,invullijst!$A$10:$M$218,4,FALSE))","v":"vr"},512,{"$f":"IF(VLOOKUP($L12,invullijst!$A$10:$M$177,2,FALSE)=\"\",\"\",VLOOKUP($L12,invullijst!$A$10:$M$177,2,FALSE))","v":"Hans Bergakker"},null,{"$f":"IF(VLOOKUP($L12,invullijst!$A$10:$M$177,8,FALSE)=0,\"\",VLOOKUP($L12,invullijst!$A$10:$M$177,8,FALSE))","v":71}]
[2,{"$f":"IF($G$3=\"k\",IF(VLOOKUP($D13,invullijst!$A$10:$M$177,11,FALSE)=0,\" \",VLOOKUP($D13,invullijst!$A$10:$M$177,11,FALSE)),\"\")","v":""},{"$f":"IF(VLOOKUP(D13,invullijst!A$10:F$218,4,FALSE)=\"\",\"\",VLOOKUP(D13,invullijst!A$10:D$218,4,FALSE))","v":0},null,{"$f":"IF(VLOOKUP($D13,invullijst!$A$10:$M$177,2,FALSE)=\"\",\"\",VLOOKUP($D13,invullijst!$A$10:$M$177,2,FALSE))","v":0},null,{"$f":"IF(VLOOKUP($D13,invullijst!$A$10:$M$177,8,FALSE)=0,\"\",VLOOKUP($D13,invullijst!$A$10:$M$177,8,FALSE))","v":""},null,2,{"$f":"IF($O$3=\"k\",IF(VLOOKUP($L13,invullijst!$A$10:$M$177,11,FALSE)=0,\" \",VLOOKUP($L13,invullijst!$A$10:$M$177,11,FALSE)),\"\")","v":""},{"$f":"IF(VLOOKUP($L13,invullijst!$A$10:$M$218,4,FALSE)=\"\",\"\",VLOOKUP($L13,invullijst!$A$10:$M$218,4,FALSE))","v":"vr"},508,{"$f":"IF(VLOOKUP($L13,invullijst!$A$10:$M$177,2,FALSE)=\"\",\"\",VLOOKUP($L13,invullijst!$A$10:$M$177,2,FALSE))","v":"Rowan Dobbelsteen"},null,{"$f":"IF(VLOOKUP($L13,invullijst!$A$10:$M$177,8,FALSE)=0,\"\",VLOOKUP($L13,invullijst!$A$10:$M$177,8,FALSE))","v":83}]
[3,{"$f":"IF($G$3=\"k\",IF(VLOOKUP($D14,invullijst!$A$10:$M$177,11,FALSE)=0,\" \",VLOOKUP($D14,invullijst!$A$10:$M$177,11,FALSE)),\"\")","v":""},{"$f":"IF(VLOOKUP(D14,invullijst!A$10:F$218,4,FALSE)=\"\",\"\",VLOOKUP(D14,invullijst!A$10:D$218,4,FALSE))","v":0},null,{"$f":"IF(VLOOKUP($D14,invullijst!$A$10:$M$177,2,FALSE)=\"\",\"\",VLOOKUP($D14,invullijst!$A$10:$M$177,2,FALSE))","v":0},null,{"$f":"IF(VLOOKUP($D14,invullijst!$A$10:$M$177,8,FALSE)=0,\"\",VLOOKUP($D14,invullijst!$A$10:$M$177,8,FALSE))","v":""},null,3,{"$f":"IF($O$3=\"k\",IF(VLOOKUP($L14,invullijst!$A$10:$M$177,11,FALSE)=0,\" \",VLOOKUP($L14,invullijst!$A$10:$M$177,11,FALSE)),\"\")","v":""},{"$f":"IF(VLOOKUP($L14,invullijst!$A$10:$M$218,4,FALSE)=\"\",\"\",VLOOKUP($L14,invullijst!$A$10:$M$218,4,FALSE))","v":"vr"},502,{"$f":"IF(VLOOKUP($L14,invullijst!$A$10:$M$177,2,FALSE)=\"\",\"\",VLOOKUP($L14,invullijst!$A$10:$M$177,2,FALSE))","v":"Diny Vos"},null,{"$f":"IF(VLOOKUP($L14,invullijst!$A$10:$M$177,8,FALSE)=0,\"\",VLOOKUP($L14,invullijst!$A$10:$M$177,8,FALSE))","v":81}]
[4,{"$f":"IF($G$3=\"k\",IF(VLOOKUP($D15,invullijst!$A$10:$M$177,11,FALSE)=0,\" \",VLOOKUP($D15,invullijst!$A$10:$M$177,11,FALSE)),\"\")","v":""},{"$f":"IF(VLOOKUP(D15,invullijst!A$10:F$218,4,FALSE)=\"\",\"\",VLOOKUP(D15,invullijst!A$10:D$218,4,FALSE))","v":0},null,{"$f":"IF(VLOOKUP($D15,invullijst!$A$10:$M$177,2,FALSE)=\"\",\"\",VLOOKUP($D15,invullijst!$A$10:$M$177,2,FALSE))","v":0},null,{"$f":"IF(VLOOKUP($D15,invullijst!$A$10:$M$177,8,FALSE)=0,\"\",VLOOKUP($D15,invullijst!$A$10:$M$177,8,FALSE))","v":""},null,4,{"$f":"IF($O$3=\"k\",IF(VLOOKUP($L15,invullijst!$A$10:$M$177,11,FALSE)=0,\" \",VLOOKUP($L15,invullijst!$A$10:$M$177,11,FALSE)),\"\")","v":""},{"$f":"IF(VLOOKUP($L15,invullijst!$A$10:$M$218,4,FALSE)=\"\",\"\",VLOOKUP($L15,invullijst!$A$10:$M$218,4,FALSE))","v":0},null,{"$f":"IF(VLOOKUP($L15,invullijst!$A$10:$M$177,2,FALSE)=\"\",\"\",VLOOKUP($L15,invullijst!$A$10:$M$177,2,FALSE))","v":0},null,{"$f":"IF(VLOOKUP($L15,invullijst!$A$10:$M$177,8,FALSE)=0,\"\",VLOOKUP($L15,invullijst!$A$10:$M$177,8,FALSE))","v":""}]
["Totaal B1 korps",{"$nulls":5},{"$f":"SUM(G12:G15)","v":80},null,"Totaal B1 korps",{"$nulls":5},{"$f":"SUM(O12:O15)","v":235}]
[]
[1,{"$f":"IF($G$3=\"k\",IF(VLOOKUP($D18,invullijst!$A$10:$M$177,11,FALSE)=0,\" \",VLOOKUP($D18,invullijst!$A$10:$M$177,11,FALSE)),\"\")","v":""},{"$f":"IF(VLOOKUP(D18,invullijst!A$10:F$218,4,FALSE)=\"\",\"\",VLOOKUP(D18,invullijst!A$10:D$218,4,FALSE))","v":0},null,{"$f":"IF(VLOOKUP($D18,invullijst!$A$10:$M$177,2,FALSE)=\"\",\"\",VLOOKUP($D18,invullijst!$A$10:$M$177,2,FALSE))","v":0},null,{"$f":"IF(VLOOKUP($D18,invullijst!$A$10:$M$177,8,FALSE)=0,\"\",VLOOKUP($D18,invullijst!$A$10:$M$177,8,FALSE))","v":""},null,1,{"$f":"IF($O$3=\"k\",IF(VLOOKUP($L18,invullijst!$A$10:$M$177,11,FALSE)=0,\" \",VLOOKUP($L18,invullijst!$A$10:$M$177,11,FALSE)),\"\")","v":""},{"$f":"IF(VLOOKUP($L18,invullijst!$A$10:$M$218,4,FALSE)=\"\",\"\",VLOOKUP($L18,invullijst!$A$10:$M$218,4,FALSE))","v":0},null,{"$f":"IF(VLOOKUP($L18,invullijst!$A$10:$M$177,2,FALSE)=\"\",\"\",VLOOKUP($L18,invullijst!$A$10:$M$177,2,FALSE))","v":0},null,{"$f":"IF(VLOOKUP($L18,invullijst!$A$10:$M$177,8,FALSE)=0,\"\",VLOOKUP($L18,invullijst!$A$10:$M$177,8,FALSE))","v":""}]
[2,{"$f":"IF($G$3=\"k\",IF(VLOOKUP($D19,invullijst!$A$10:$M$177,11,FALSE)=0,\" \",VLOOKUP($D19,invullijst!$A$10:$M$177,11,FALSE)),\"\")","v":""},{"$f":"IF(VLOOKUP(D19,invullijst!A$10:F$218,4,FALSE)=\"\",\"\",VLOOKUP(D19,invullijst!A$10:D$218,4,FALSE))","v":0},null,{"$f":"IF(VLOOKUP($D19,invullijst!$A$10:$M$177,2,FALSE)=\"\",\"\",VLOOKUP($D19,invullijst!$A$10:$M$177,2,FALSE))","v":0},null,{"$f":"IF(VLOOKUP($D19,invullijst!$A$10:$M$177,8,FALSE)=0,\"\",VLOOKUP($D19,invullijst!$A$10:$M$177,8,FALSE))","v":""},null,2,{"$f":"IF($O$3=\"k\",IF(VLOOKUP($L19,invullijst!$A$10:$M$177,11,FALSE)=0,\" \",VLOOKUP($L19,invullijst!$A$10:$M$177,11,FALSE)),\"\")","v":""},{"$f":"IF(VLOOKUP($L19,invullijst!$A$10:$M$218,4,FALSE)=\"\",\"\",VLOOKUP($L19,invullijst!$A$10:$M$218,4,FALSE))","v":0},null,{"$f":"IF(VLOOKUP($L19,invullijst!$A$10:$M$177,2,FALSE)=\"\",\"\",VLOOKUP($L19,invullijst!$A$10:$M$177,2,FALSE))","v":0},null,{"$f":"IF(VLOOKUP($L19,invullijst!$A$10:$M$177,8,FALSE)=0,\"\",VLOOKUP($L19,invullijst!$A$10:$M$177,8,FALSE))","v":""}]
[3,{"$f":"IF($G$3=\"k\",IF(VLOOKUP($D20,invullijst!$A$10:$M$177,11,FALSE)=0,\" \",VLOOKUP($D20,invullijst!$A$10:$M$177,11,FALSE)),\"\")","v":""},{"$f":"IF(VLOOKUP(D20,invullijst!A$10:F$218,4,FALSE)=\"\",\"\",VLOOKUP(D20,invullijst!A$10:D$218,4,FALSE))","v":0},null,{"$f":"IF(VLOOKUP($D20,invullijst!$A$10:$M$177,2,FALSE)=\"\",\"\",VLOOKUP($D20,invullijst!$A$10:$M$177,2,FALSE))","v":0},null,{"$f":"IF(VLOOKUP($D20,invullijst!$A$10:$M$177,8,FALSE)=0,\"\",VLOOKUP($D20,invullijst!$A$10:$M$177,8,FALSE))","v":""},null,3,{"$f":"IF($O$3=\"k\",IF(VLOOKUP($L20,invullijst!$A$10:$M$177,11,FALSE)=0,\" \",VLOOKUP($L20,invullijst!$A$10:$M$177,11,FALSE)),\"\")","v":""},{"$f":"IF(VLOOKUP($L20,invullijst!$A$10:$M$218,4,FALSE)=\"\",\"\",VLOOKUP($L20,invullijst!$A$10:$M$218,4,FALSE))","v":0},null,{"$f":"IF(VLOOKUP($L20,invullijst!$A$10:$M$177,2,FALSE)=\"\",\"\",VLOOKUP($L20,invullijst!$A$10:$M$177,2,FALSE))","v":0},null,{"$f":"IF(VLOOKUP($L20,invullijst!$A$10:$M$177,8,FALSE)=0,\"\",VLOOKUP($L20,invullijst!$A$10:$M$177,8,FALSE))","v":""}]
[4,{"$f":"IF($G$3=\"k\",IF(VLOOKUP($D21,invullijst!$A$10:$M$177,11,FALSE)=0,\" \",VLOOKUP($D21,invullijst!$A$10:$M$177,11,FALSE)),\"\")","v":""},{"$f":"IF(VLOOKUP(D21,invullijst!A$10:F$218,4,FALSE)=\"\",\"\",VLOOKUP(D21,invullijst!A$10:D$218,4,FALSE))","v":0},null,{"$f":"IF(VLOOKUP($D21,invullijst!$A$10:$M$177,2,FALSE)=\"\",\"\",VLOOKUP($D21,invullijst!$A$10:$M$177,2,FALSE))","v":0},null,{"$f":"IF(VLOOKUP($D21,invullijst!$A$10:$M$177,8,FALSE)=0,\"\",VLOOKUP($D21,invullijst!$A$10:$M$177,8,FALSE))","v":""},null,4,{"$f":"IF($O$3=\"k\",IF(VLOOKUP($L21,invullijst!$A$10:$M$177,11,FALSE)=0,\" \",VLOOKUP($L21,invullijst!$A$10:$M$177,11,FALSE)),\"\")","v":""},{"$f":"IF(VLOOKUP($L21,invullijst!$A$10:$M$218,4,FALSE)=\"\",\"\",VLOOKUP($L21,invullijst!$A$10:$M$218,4,FALSE))","v":0},null,{"$f":"IF(VLOOKUP($L21,invullijst!$A$10:$M$177,2,FALSE)=\"\",\"\",VLOOKUP($L21,invullijst!$A$10:$M$177,2,FALSE))","v":0},null,{"$f":"IF(VLOOKUP($L21,invullijst!$A$10:$M$177,8,FALSE)=0,\"\",VLOOKUP($L21,invullijst!$A$10:$M$177,8,FALSE))","v":""}]
["DIVERSEN / INHAAL",{"$nulls":7},"DIVERSEN / INHAAL"]
[]
["OPGELEGD (Jeugd <16 en 65+)"]
[1,{"$f":"IF($G$3=\"k\",IF(VLOOKUP($D25,invullijst!$A$10:$M$177,11,FALSE)=0,\" \",VLOOKUP($D25,invullijst!$A$10:$M$177,11,FALSE)),\"\")","v":""},{"$f":"IF(VLOOKUP(D25,invullijst!A$10:F$218,4,FALSE)=\"\",\"\",VLOOKUP(D25,invullijst!A$10:D$218,4,FALSE))","v":"65+"},307,{"$f":"IF(VLOOKUP($D25,invullijst!$A$10:$M$177,2,FALSE)=\"\",\"\",VLOOKUP($D25,invullijst!$A$10:$M$177,2,FALSE))","v":"Bert van Engelen"},null,{"$f":"IF(VLOOKUP($D25,invullijst!$A$10:$M$177,8,FALSE)=0,\"\",VLOOKUP($D25,invullijst!$A$10:$M$177,8,FALSE))","v":93},null,1,{"$f":"IF($O$3=\"k\",IF(VLOOKUP($L25,invullijst!$A$10:$M$177,11,FALSE)=0,\" \",VLOOKUP($L25,invullijst!$A$10:$M$177,11,FALSE)),\"\")","v":""},{"$f":"IF(VLOOKUP($L25,invullijst!$A$10:$M$218,4,FALSE)=\"\",\"\",VLOOKUP($L25,invullijst!$A$10:$M$218,4,FALSE))","v":"65+"},515,{"$f":"IF(VLOOKUP($L25,invullijst!$A$10:$M$177,2,FALSE)=\"\",\"\",VLOOKUP($L25,invullijst!$A$10:$M$177,2,FALSE))","v":"Ilona Bergakker disp"},null,{"$f":"IF(VLOOKUP($L25,invullijst!$A$10:$M$177,8,FALSE)=0,\"\",VLOOKUP($L25,invullijst!$A$10:$M$177,8,FALSE))","v":89}]
[2,{"$f":"IF($G$3=\"k\",IF(VLOOKUP($D26,invullijst!$A$10:$M$177,11,FALSE)=0,\" \",VLOOKUP($D26,invullijst!$A$10:$M$177,11,FALSE)),\"\")","v":""},{"$f":"IF(VLOOKUP(D26,invullijst!A$10:F$218,4,FALSE)=\"\",\"\",VLOOKUP(D26,invullijst!A$10:D$218,4,FALSE))","v":"65+"},310,{"$f":"IF(VLOOKUP($D26,invullijst!$A$10:$M$177,2,FALSE)=\"\",\"\",VLOOKUP($D26,invullijst!$A$10:$M$177,2,FALSE))","v":"Tini Boom"},null,{"$f":"IF(VLOOKUP($D26,invullijst!$A$10:$M$177,8,FALSE)=0,\"\",VLOOKUP($D26,invullijst!$A$10:$M$177,8,FALSE))","v":93},null,2,{"$f":"IF($O$3=\"k\",IF(VLOOKUP($L26,invullijst!$A$10:$M$177,11,FALSE)=0,\" \",VLOOKUP($L26,invullijst!$A$10:$M$177,11,FALSE)),\"\")","v":""},{"$f":"IF(VLOOKUP($L26,invullijst!$A$10:$M$218,4,FALSE)=\"\",\"\",VLOOKUP($L26,invullijst!$A$10:$M$218,4,FALSE))","v":"65+"},511,{"$f":"IF(VLOOKUP($L26,invullijst!$A$10:$M$177,2,FALSE)=\"\",\"\",VLOOKUP($L26,invullijst!$A$10:$M$177,2,FALSE))","v":"Ton Stans"},null,{"$f":"IF(VLOOKUP($L26,invullijst!$A$10:$M$177,8,FALSE)=0,\"\",VLOOKUP($L26,invullijst!$A$10:$M$177,8,FALSE))","v":82}]
[3,{"$f":"IF($G$3=\"k\",IF(VLOOKUP($D27,invullijst!$A$10:$M$177,11,FALSE)=0,\" \",VLOOKUP($D27,invullijst!$A$10:$M$177,11,FALSE)),\"\")","v":""},{"$f":"IF(VLOOKUP(D27,invullijst!A$10:F$218,4,FALSE)=\"\",\"\",VLOOKUP(D27,invullijst!A$10:D$218,4,FALSE))","v":"J"},312,{"$f":"IF(VLOOKUP($D27,invullijst!$A$10:$M$177,2,FALSE)=\"\",\"\",VLOOKUP($D27,invullijst!$A$10:$M$177,2,FALSE))","v":"Floor de Jong"},null,{"$f":"IF(VLOOKUP($D27,invullijst!$A$10:$M$177,8,FALSE)=0,\"\",VLOOKUP($D27,invullijst!$A$10:$M$177,8,FALSE))","v":91},null,3,{"$f":"IF($O$3=\"k\",IF(VLOOKUP($L27,invullijst!$A$10:$M$177,11,FALSE)=0,\" \",VLOOKUP($L27,invullijst!$A$10:$M$177,11,FALSE)),\"\")","v":""},{"$f":"IF(VLOOKUP($L27,invullijst!$A$10:$M$218,4,FALSE)=\"\",\"\",VLOOKUP($L27,invullijst!$A$10:$M$218,4,FALSE))","v":"65+"},509,{"$f":"IF(VLOOKUP($L27,invullijst!$A$10:$M$177,2,FALSE)=\"\",\"\",VLOOKUP($L27,invullijst!$A$10:$M$177,2,FALSE))","v":"Adwan de Pinth"},null,{"$f":"IF(VLOOKUP($L27,invullijst!$A$10:$M$177,8,FALSE)=0,\"\",VLOOKUP($L27,invullijst!$A$10:$M$177,8,FALSE))","v":95}]
["Totaal korps opgelegd A1",{"$nulls":5},{"$f":"SUM(G25:G27)","v":277},null,"Totaal korps opgelegd A1",{"$nulls":5},{"$f":"SUM(O25:O27)","v":266}]
[]
[1,{"$f":"IF($G$3=\"k\",IF(VLOOKUP($D30,invullijst!$A$10:$M$177,11,FALSE)=0,\" \",VLOOKUP($D30,invullijst!$A$10:$M$177,11,FALSE)),\"\")","v":""},{"$f":"IF(VLOOKUP(D30,invullijst!A$10:F$218,4,FALSE)=\"\",\"\",VLOOKUP(D30,invullijst!A$10:D$218,4,FALSE))","v":"65+"},309,{"$f":"IF(VLOOKUP($D30,invullijst!$A$10:$M$177,2,FALSE)=\"\",\"\",VLOOKUP($D30,invullijst!$A$10:$M$177,2,FALSE))","v":"René de Jong"},null,{"$f":"IF(VLOOKUP($D30,invullijst!$A$10:$M$177,8,FALSE)=0,\"\",VLOOKUP($D30,invullijst!$A$10:$M$177,8,FALSE))","v":94},null,1,{"$f":"IF($O$3=\"k\",IF(VLOOKUP($L30,invullijst!$A$10:$M$177,11,FALSE)=0,\" \",VLOOKUP($L30,invullijst!$A$10:$M$177,11,FALSE)),\"\")","v":""},{"$f":"IF(VLOOKUP($L30,invullijst!$A$10:$M$218,4,FALSE)=\"\",\"\",VLOOKUP($L30,invullijst!$A$10:$M$218,4,FALSE))","v":"65+"},516,{"$f":"IF(VLOOKUP($L30,invullijst!$A$10:$M$177,2,FALSE)=\"\",\"\",VLOOKUP($L30,invullijst!$A$10:$M$177,2,FALSE))","v":"Henry Bergakker disp"},null,{"$f":"IF(VLOOKUP($L30,invullijst!$A$10:$M$177,8,FALSE)=0,\"\",VLOOKUP($L30,invullijst!$A$10:$M$177,8,FALSE))","v":88}]
[2,{"$f":"IF($G$3=\"k\",IF(VLOOKUP($D31,invullijst!$A$10:$M$177,11,FALSE)=0,\" \",VLOOKUP($D31,invullijst!$A$10:$M$177,11,FALSE)),\"\")","v":""},{"$f":"IF(VLOOKUP(D31,invullijst!A$10:F$218,4,FALSE)=\"\",\"\",VLOOKUP(D31,invullijst!A$10:D$218,4,FALSE))","v":"65+"},301,{"$f":"IF(VLOOKUP($D31,invullijst!$A$10:$M$177,2,FALSE)=\"\",\"\",VLOOKUP($D31,invullijst!$A$10:$M$177,2,FALSE))","v":"Arjen van Assem disp"},null,{"$f":"IF(VLOOKUP($D31,invullijst!$A$10:$M$177,8,FALSE)=0,\"\",VLOOKUP($D31,invullijst!$A$10:$M$177,8,FALSE))","v":93},null,2,{"$f":"IF($O$3=\"k\",IF(VLOOKUP($L31,invullijst!$A$10:$M$177,11,FALSE)=0,\" \",VLOOKUP($L31,invullijst!$A$10:$M$177,11,FALSE)),\"\")","v":""},{"$f":"IF(VLOOKUP($L31,invullijst!$A$10:$M$218,4,FALSE)=\"\",\"\",VLOOKUP($L31,invullijst!$A$10:$M$218,4,FALSE))","v":"65+"},514,{"$f":"IF(VLOOKUP($L31,invullijst!$A$10:$M$177,2,FALSE)=\"\",\"\",VLOOKUP($L31,invullijst!$A$10:$M$177,2,FALSE))","v":"Toon Ophorst"},null,{"$f":"IF(VLOOKUP($L31,invullijst!$A$10:$M$177,8,FALSE)=0,\"\",VLOOKUP($L31,invullijst!$A$10:$M$177,8,FALSE))","v":75}]
[3,{"$f":"IF($G$3=\"k\",IF(VLOOKUP($D32,invullijst!$A$10:$M$177,11,FALSE)=0,\" \",VLOOKUP($D32,invullijst!$A$10:$M$177,11,FALSE)),\"\")","v":""},{"$f":"IF(VLOOKUP(D32,invullijst!A$10:F$218,4,FALSE)=\"\",\"\",VLOOKUP(D32,invullijst!A$10:D$218,4,FALSE))","v":0},null,{"$f":"IF(VLOOKUP($D32,invullijst!$A$10:$M$177,2,FALSE)=\"\",\"\",VLOOKUP($D32,invullijst!$A$10:$M$177,2,FALSE))","v":0},null,{"$f":"IF(VLOOKUP($D32,invullijst!$A$10:$M$177,8,FALSE)=0,\"\",VLOOKUP($D32,invullijst!$A$10:$M$177,8,FALSE))","v":""},null,3,{"$f":"IF($O$3=\"k\",IF(VLOOKUP($L32,invullijst!$A$10:$M$177,11,FALSE)=0,\" \",VLOOKUP($L32,invullijst!$A$10:$M$177,11,FALSE)),\"\")","v":""},{"$f":"IF(VLOOKUP($L32,invullijst!$A$10:$M$218,4,FALSE)=\"\",\"\",VLOOKUP($L32,invullijst!$A$10:$M$218,4,FALSE))","v":"65+"},505,{"$f":"IF(VLOOKUP($L32,invullijst!$A$10:$M$177,2,FALSE)=\"\",\"\",VLOOKUP($L32,invullijst!$A$10:$M$177,2,FALSE))","v":"Leo Wagemakers"},null,{"$f":"IF(VLOOKUP($L32,invullijst!$A$10:$M$177,8,FALSE)=0,\"\",VLOOKUP($L32,invullijst!$A$10:$M$177,8,FALSE))","v":58}]
["Totaal korps opgelegd A2",{"$nulls":5},{"$f":"SUM(G30:G32)","v":187},null,"Totaal korps opgelegd A2",{"$nulls":5},{"$f":"SUM(O30:O32)","v":221}]
[]
[1,{"$f":"IF($G$3=\"k\",IF(VLOOKUP($D35,invullijst!$A$10:$M$177,11,FALSE)=0,\" \",VLOOKUP($D35,invullijst!$A$10:$M$177,11,FALSE)),\"\")","v":""},{"$f":"IF(VLOOKUP(D35,invullijst!A$10:F$218,4,FALSE)=\"\",\"\",VLOOKUP(D35,invullijst!A$10:D$218,4,FALSE))","v":0},null,{"$f":"IF(VLOOKUP($D35,invullijst!$A$10:$M$177,2,FALSE)=\"\",\"\",VLOOKUP($D35,invullijst!$A$10:$M$177,2,FALSE))","v":0},null,{"$f":"IF(VLOOKUP($D35,invullijst!$A$10:$M$177,8,FALSE)=0,\"\",VLOOKUP($D35,invullijst!$A$10:$M$177,8,FALSE))","v":""},null,1,{"$f":"IF($O$3=\"k\",IF(VLOOKUP($L35,invullijst!$A$10:$M$177,11,FALSE)=0,\" \",VLOOKUP($L35,invullijst!$A$10:$M$177,11,FALSE)),\"\")","v":""},{"$f":"IF(VLOOKUP($L35,invullijst!$A$10:$M$218,4,FALSE)=\"\",\"\",VLOOKUP($L35,invullijst!$A$10:$M$218,4,FALSE))","v":0},null,{"$f":"IF(VLOOKUP($L35,invullijst!$A$10:$M$177,2,FALSE)=\"\",\"\",VLOOKUP($L35,invullijst!$A$10:$M$177,2,FALSE))","v":0},null,{"$f":"IF(VLOOKUP($L35,invullijst!$A$10:$M$177,8,FALSE)=0,\"\",VLOOKUP($L35,invullijst!$A$10:$M$177,8,FALSE))","v":""}]
[2,{"$f":"IF($G$3=\"k\",IF(VLOOKUP($D36,invullijst!$A$10:$M$177,11,FALSE)=0,\" \",VLOOKUP($D36,invullijst!$A$10:$M$177,11,FALSE)),\"\")","v":""},{"$f":"IF(VLOOKUP(D36,invullijst!A$10:F$218,4,FALSE)=\"\",\"\",VLOOKUP(D36,invullijst!A$10:D$218,4,FALSE))","v":0},null,{"$f":"IF(VLOOKUP($D36,invullijst!$A$10:$M$177,2,FALSE)=\"\",\"\",VLOOKUP($D36,invullijst!$A$10:$M$177,2,FALSE))","v":0},null,{"$f":"IF(VLOOKUP($D36,invullijst!$A$10:$M$177,8,FALSE)=0,\"\",VLOOKUP($D36,invullijst!$A$10:$M$177,8,FALSE))","v":""},null,2,{"$f":"IF($O$3=\"k\",IF(VLOOKUP($L36,invullijst!$A$10:$M$177,11,FALSE)=0,\" \",VLOOKUP($L36,invullijst!$A$10:$M$177,11,FALSE)),\"\")","v":""},{"$f":"IF(VLOOKUP($L36,invullijst!$A$10:$M$218,4,FALSE)=\"\",\"\",VLOOKUP($L36,invullijst!$A$10:$M$218,4,FALSE))","v":0},null,{"$f":"IF(VLOOKUP($L36,invullijst!$A$10:$M$177,2,FALSE)=\"\",\"\",VLOOKUP($L36,invullijst!$A$10:$M$177,2,FALSE))","v":0},null,{"$f":"IF(VLOOKUP($L36,invullijst!$A$10:$M$177,8,FALSE)=0,\"\",VLOOKUP($L36,invullijst!$A$10:$M$177,8,FALSE))","v":""}]
[3,{"$f":"IF($G$3=\"k\",IF(VLOOKUP($D37,invullijst!$A$10:$M$177,11,FALSE)=0,\" \",VLOOKUP($D37,invullijst!$A$10:$M$177,11,FALSE)),\"\")","v":""},{"$f":"IF(VLOOKUP(D37,invullijst!A$10:F$218,4,FALSE)=\"\",\"\",VLOOKUP(D37,invullijst!A$10:D$218,4,FALSE))","v":0},null,{"$f":"IF(VLOOKUP($D37,invullijst!$A$10:$M$177,2,FALSE)=\"\",\"\",VLOOKUP($D37,invullijst!$A$10:$M$177,2,FALSE))","v":0},null,{"$f":"IF(VLOOKUP($D37,invullijst!$A$10:$M$177,8,FALSE)=0,\"\",VLOOKUP($D37,invullijst!$A$10:$M$177,8,FALSE))","v":""},null,3,{"$f":"IF($O$3=\"k\",IF(VLOOKUP($L37,invullijst!$A$10:$M$177,11,FALSE)=0,\" \",VLOOKUP($L37,invullijst!$A$10:$M$177,11,FALSE)),\"\")","v":""},{"$f":"IF(VLOOKUP($L37,invullijst!$A$10:$M$218,4,FALSE)=\"\",\"\",VLOOKUP($L37,invullijst!$A$10:$M$218,4,FALSE))","v":0},null,{"$f":"IF(VLOOKUP($L37,invullijst!$A$10:$M$177,2,FALSE)=\"\",\"\",VLOOKUP($L37,invullijst!$A$10:$M$177,2,FALSE))","v":0},null,{"$f":"IF(VLOOKUP($L37,invullijst!$A$10:$M$177,8,FALSE)=0,\"\",VLOOKUP($L37,invullijst!$A$10:$M$177,8,FALSE))","v":""}]
["Totaal korps opgelegd A3",{"$nulls":5},{"$f":"SUM(G35:G37)","v":0},null,"Totaal korps opgelegd A3",{"$nulls":5},{"$f":"SUM(O35:O37)","v":0}]

{"sheet":"wedstrijd 4A","index":11,"n_rows":38,"n_cols":15,"rows_kept":38,"merged":[[0,0,0,4],[0,5,0,7],[0,8,0,14],[1,0,1,11],[1,12,1,14],[2,1,2,5],[2,9,2,13],[4,0,4,14],[5,4,5,5],[5,12,5,13],[6,4,6,5],[6,12,6,13],[7,4,7,5],[7,12,7,13],[8,4,8,5],[8,12,8,13],[9,0,9,5],[9,8,9,13],[11,4,11,5],[11,12,11,13],[12,4,12,5],[12,12,12,13],[13,4,13,5],[13,12,13,13],[14,4,14,5],[14,12,14,13],[15,0,15,5],[15,8,15,13],[17,4,17,5],[17,12,17,13],[18,4,18,5],[18,12,18,13],[19,4,19,5],[19,12,19,13],[20,4,20,5],[20,12,20,13],[21,0,21,5],[21,8,21,13],[23,0,23,14],[24,4,24,5],[24,12,24,13],[25,4,25,5],[25,12,25,13],[26,4,26,5],[26,12,26,13],[27,0,27,5],[27,8,27,13],[29,4,29,5],[29,12,29,13],[30,4,30,5],[30,12,30,13],[31,4,31,5],[31,12,31,13],[32,0,32,5],[32,8,32,13],[34,4,34,5],[34,12,34,13],[35,4,35,5],[35,12,35,13],[36,4,36,5],[36,12,36,13],[37,0,37,5],[37,8,37,13]]}
[{"$f":"invullijst!F1","v":"Organisatie"},{"$nulls":4},{"$f":"invullijst!H2","v":"2023 - 2024"},null,null,{"$f":"invullijst!F3","v":"St. Crispinus & Crispinianus Besoijen"}]
["Datum: ",{"$nulls":11},"2024-03-03"]
[3,{"$f":"IF(VLOOKUP(A3,invullijst!A1:F5,2,FALSE)=\"\",\"\",VLOOKUP(A3,invullijst!A1:F5,2,FALSE))","v":"O.L.V. Schuts Elshout"},{"$nulls":6},2,{"$f":"IF(VLOOKUP(I3,invullijst!A1:C5,2,FALSE)=\"\",\"\",VLOOKUP(I3,invullijst!A1:C5,2,FALSE))","v":"St. Crispinus & Crispinianus Besoijen"}]
[]
["vrijehand"]
[1,{"$f":"IF($G$3=\"k\",IF(VLOOKUP($D6,invullijst!$A$10:$M$177,11,FALSE)=0,\" \",VLOOKUP($D6,invullijst!$A$10:$M$177,11,FALSE)),\"\")","v":""},{"$f":"IF(VLOOKUP(D6,invullijst!A$10:F$218,4,FALSE)=\"\",\"\",VLOOKUP(D6,invullijst!A$10:D$218,4,FALSE))","v":"vr"},302,{"$f":"IF(VLOOKUP($D6,invullijst!$A$10:$M$177,2,FALSE)=\"\",\"\",VLOOKUP($D6,invullijst!$A$10:$M$177,2,FALSE))","v":"Freek de Jong"},null,{"$f":"IF(VLOOKUP($D6,invullijst!$A$10:$M$177,9,FALSE)=0,\"\",VLOOKUP($D6,invullijst!$A$10:$M$177,9,FALSE))","v":88},null,1,{"$f":"IF($O$3=\"k\",IF(VLOOKUP($L6,invullijst!$A$10:$M$177,11,FALSE)=0,\" \",VLOOKUP($L6,invullijst!$A$10:$M$177,11,FALSE)),\"\")","v":""},{"$f":"IF(VLOOKUP($L6,invullijst!$A$10:$M$218,4,FALSE)=\"\",\"\",VLOOKUP($L6,invullijst!$A$10:$M$218,4,FALSE))","v":"vr"},201,{"$f":"IF(VLOOKUP($L6,invullijst!$A$10:$M$177,2,FALSE)=\"\",\"\",VLOOKUP($L6,invullijst!$A$10:$M$177,2,FALSE))","v":"Sander Oome"},null,{"$f":"IF(VLOOKUP($L6,invullijst!$A$10:$M$177,9,FALSE)=0,\"\",VLOOKUP($L6,invullijst!$A$10:$M$177,9,FALSE))","v":92}]
[2,{"$f":"IF($G$3=\"k\",IF(VLOOKUP($D7,invullijst!$A$10:$M$177,11,FALSE)=0,\" \",VLOOKUP($D7,invullijst!$A$10:$M$177,11,FALSE)),\"\")","v":""},{"$f":"IF(VLOOKUP(D7,invullijst!A$10:F$218,4,FALSE)=\"\",\"\",VLOOKUP(D7,invullijst!A$10:D$218,4,FALSE))","v":"vr"},311,{"$f":"IF(VLOOKUP($D7,invullijst!$A$10:$M$177,2,FALSE)=\"\",\"\",VLOOKUP($D7,invullijst!$A$10:$M$177,2,FALSE))","v":"Ton Kolmans"},null,{"$f":"IF(VLOOKUP($D7,invullijst!$A$10:$M$177,9,FALSE)=0,\"\",VLOOKUP($D7,invullijst!$A$10:$M$177,9,FALSE))","v":86},null,2,{"$f":"IF($O$3=\"k\",IF(VLOOKUP($L7,invullijst!$A$10:$M$177,11,FALSE)=0,\" \",VLOOKUP($L7,invullijst!$A$10:$M$177,11,FALSE)),\"\")","v":""},{"$f":"IF(VLOOKUP($L7,invullijst!$A$10:$M$218,4,FALSE)=\"\",\"\",VLOOKUP($L7,invullijst!$A$10:$M$218,4,FALSE))","v":"vr"},203,{"$f":"IF(VLOOKUP($L7,invullijst!$A$10:$M$177,2,FALSE)=\"\",\"\",VLOOKUP($L7,invullijst!$A$10:$M$177,2,FALSE))","v":"Frank van den Houdt"},null,{"$f":"IF(VLOOKUP($L7,invullijst!$A$10:$M$177,9,FALSE)=0,\"\",VLOOKUP($L7,invullijst!$A$10:$M$177,9,FALSE))","v":85}]
[3,{"$f":"IF($G$3=\"k\",IF(VLOOKUP($D8,invullijst!$A$10:$M$177,11,FALSE)=0,\" \",VLOOKUP($D8,invullijst!$A$10:$M$177,11,FALSE)),\"\")","v":""},{"$f":"IF(VLOOKUP(D8,invullijst!A$10:F$218,4,FALSE)=\"\",\"\",VLOOKUP(D8,invullijst!A$10:D$218,4,FALSE))","v":"vr"},306,{"$f":"IF(VLOOKUP($D8,invullijst!$A$10:$M$177,2,FALSE)=\"\",\"\",VLOOKUP($D8,invullijst!$A$10:$M$177,2,FALSE))","v":"Ron Groot"},null,{"$f":"IF(VLOOKUP($D8,invullijst!$A$10:$M$177,9,FALSE)=0,\"\",VLOOKUP($D8,invullijst!$A$10:$M$177,9,FALSE))","v":84},null,3,{"$f":"IF($O$3=\"k\",IF(VLOOKUP($L8,invullijst!$A$10:$M$177,11,FALSE)=0,\" \",VLOOKUP($L8,invullijst!$A$10:$M$177,11,FALSE)),\"\")","v":""},{"$f":"IF(VLOOKUP($L8,invullijst!$A$10:$M$218,4,FALSE)=\"\",\"\",VLOOKUP($L8,invullijst!$A$10:$M$218,4,FALSE))","v":"vr"},215,{"$f":"IF(VLOOKUP($L8,invullijst!$A$10:$M$177,2,FALSE)=\"\",\"\",VLOOKUP($L8,invullijst!$A$10:$M$177,2,FALSE))","v":"Pieter Laghuwitz"},null,{"$f":"IF(VLOOKUP($L8,invullijst!$A$10:$M$177,9,FALSE)=0,\"\",VLOOKUP($L8,invullijst!$A$10:$M$177,9,FALSE))","v":83}]
[4,{"$f":"IF($G$3=\"k\",IF(VLOOKUP($D9,invullijst!$A$10:$M$177,11,FALSE)=0,\" \",VLOOKUP($D9,invullijst!$A$10:$M$177,11,FALSE)),\"\")","v":""},{"$f":"IF(VLOOKUP(D9,invullijst!A$10:F$218,4,FALSE)=\"\",\"\",VLOOKUP(D9,invullijst!A$10:D$218,4,FALSE))","v":"vr"},305,{"$f":"IF(VLOOKUP($D9,invullijst!$A$10:$M$177,2,FALSE)=\"\",\"\",VLOOKUP($D9,invullijst!$A$10:$M$177,2,FALSE))","v":"Johan Klerx"},null,{"$f":"IF(VLOOKUP($D9,invullijst!$A$10:$M$177,9,FALSE)=0,\"\",VLOOKUP($D9,invullijst!$A$10:$M$177,9,FALSE))","v":84},null,4,{"$f":"IF($O$3=\"k\",IF(VLOOKUP($L9,invullijst!$A$10:$M$177,11,FALSE)=0,\" \",VLOOKUP($L9,invullijst!$A$10:$M$177,11,FALSE)),\"\")","v":""},{"$f":"IF(VLOOKUP($L9,invullijst!$A$10:$M$218,4,FALSE)=\"\",\"\",VLOOKUP($L9,invullijst!$A$10:$M$218,4,FALSE))","v":"vr"},209,{"$f":"IF(VLOOKUP($L9,invullijst!$A$10:$M$177,2,FALSE)=\"\",\"\",VLOOKUP($L9,invullijst!$A$10:$M$177,2,FALSE))","v":"René van Kuijk"},null,{"$f":"IF(VLOOKUP($L9,invullijst!$A$10:$M$177,9,FALSE)=0,\"\",VLOOKUP($L9,invullijst!$A$10:$M$177,9,FALSE))","v":82}]
["Totaal A korps",{"$nulls":5},{"$f":"SUM(G6:G9)","v":342},null,"Totaal A korps",{"$nulls":5},{"$f":"SUM(O6:O9)","v":342}]
[]
[1,{"$f":"IF($G$3=\"k\",IF(VLOOKUP($D12,invullijst!$A$10:$M$177,11,FALSE)=0,\" \",VLOOKUP($D12,invullijst!$A$10:$M$177,11,FALSE)),\"\")","v":""},{"$f":"IF(VLOOKUP(D12,invullijst!A$10:F$218,4,FALSE)=\"\",\"\",VLOOKUP(D12,invullijst!A$10:D$218,4,FALSE))","v":"vr"},304,{"$f":"IF(VLOOKUP($D12,invullijst!$A$10:$M$177,2,FALSE)=\"\",\"\",VLOOKUP($D12,invullijst!$A$10:$M$177,2,FALSE))","v":"Henk Bruurmijn "},null,{"$f":"IF(VLOOKUP($D12,invullijst!$A$10:$M$177,9,FALSE)=0,\"\",VLOOKUP($D12,invullijst!$A$10:$M$177,9,FALSE))","v":68},null,1,{"$f":"IF($O$3=\"k\",IF(VLOOKUP($L12,invullijst!$A$10:$M$177,11,FALSE)=0,\" \",VLOOKUP($L12,invullijst!$A$10:$M$177,11,FALSE)),\"\")","v":""},{"$f":"IF(VLOOKUP($L12,invullijst!$A$10:$M$218,4,FALSE)=\"\",\"\",VLOOKUP($L12,invullijst!$A$10:$M$218,4,FALSE))","v":"vr"},205,{"$f":"IF(VLOOKUP($L12,invullijst!$A$10:$M$177,2,FALSE)=\"\",\"\",VLOOKUP($L12,invullijst!$A$10:$M$177,2,FALSE))","v":"Jos v/d Snepscheut"},null,{"$f":"IF(VLOOKUP($L12,invullijst!$A$10:$M$177,9,FALSE)=0,\"\",VLOOKUP($L12,invullijst!$A$10:$M$177,9,FALSE))","v":82}]
[2,{"$f":"IF($G$3=\"k\",IF(VLOOKUP($D13,invullijst!$A$10:$M$177,11,FALSE)=0,\" \",VLOOKUP($D13,invullijst!$A$10:$M$177,11,FALSE)),\"\")","v":""},{"$f":"IF(VLOOKUP(D13,invullijst!A$10:F$218,4,FALSE)=\"\",\"\",VLOOKUP(D13,invullijst!A$10:D$218,4,FALSE))","v":0},null,{"$f":"IF(VLOOKUP($D13,invullijst!$A$10:$M$177,2,FALSE)=\"\",\"\",VLOOKUP($D13,invullijst!$A$10:$M$177,2,FALSE))","v":0},null,{"$f":"IF(VLOOKUP($D13,invullijst!$A$10:$M$177,9,FALSE)=0,\"\",VLOOKUP($D13,invullijst!$A$10:$M$177,9,FALSE))","v":""},null,2,{"$f":"IF($O$3=\"k\",IF(VLOOKUP($L13,invullijst!$A$10:$M$177,11,FALSE)=0,\" \",VLOOKUP($L13,invullijst!$A$10:$M$177,11,FALSE)),\"\")","v":""},{"$f":"IF(VLOOKUP($L13,invullijst!$A$10:$M$218,4,FALSE)=\"\",\"\",VLOOKUP($L13,invullijst!$A$10:$M$218,4,FALSE))","v":"vr"},208,{"$f":"IF(VLOOKUP($L13,invullijst!$A$10:$M$177,2,FALSE)=\"\",\"\",VLOOKUP($L13,invullijst!$A$10:$M$177,2,FALSE))","v":"Erin van Hulten"},null,{"$f":"IF(VLOOKUP($L13,invullijst!$A$10:$M$177,9,FALSE)=0,\"\",VLOOKUP($L13,invullijst!$A$10:$M$177,9,FALSE))","v":81}]
[3,{"$f":"IF($G$3=\"k\",IF(VLOOKUP($D14,invullijst!$A$10:$M$177,11,FALSE)=0,\" \",VLOOKUP($D14,invullijst!$A$10:$M$177,11,FALSE)),\"\")","v":""},{"$f":"IF(VLOOKUP(D14,invullijst!A$10:F$218,4,FALSE)=\"\",\"\",VLOOKUP(D14,invullijst!A$10:D$218,4,FALSE))","v":0},null,{"$f":"IF(VLOOKUP($D14,invullijst!$A$10:$M$177,2,FALSE)=\"\",\"\",VLOOKUP($D14,invullijst!$A$10:$M$177,2,FALSE))","v":0},null,{"$f":"IF(VLOOKUP($D14,invullijst!$A$10:$M$177,9,FALSE)=0,\"\",VLOOKUP($D14,invullijst!$A$10:$M$177,9,FALSE))","v":""},null,3,{"$f":"IF($O$3=\"k\",IF(VLOOKUP($L14,invullijst!$A$10:$M$177,11,FALSE)=0,\" \",VLOOKUP($L14,invullijst!$A$10:$M$177,11,FALSE)),\"\")","v":""},{"$f":"IF(VLOOKUP($L14,invullijst!$A$10:$M$218,4,FALSE)=\"\",\"\",VLOOKUP($L14,invullijst!$A$10:$M$218,4,FALSE))","v":"vr"},204,{"$f":"IF(VLOOKUP($L14,invullijst!$A$10:$M$177,2,FALSE)=\"\",\"\",VLOOKUP($L14,invullijst!$A$10:$M$177,2,FALSE))","v":"Harry de Louw"},null,{"$f":"IF(VLOOKUP($L14,invullijst!$A$10:$M$177,9,FALSE)=0,\"\",VLOOKUP($L14,invullijst!$A$10:$M$177,9,FALSE))","v":80}]
[4,{"$f":"IF($G$3=\"k\",IF(VLOOKUP($D15,invullijst!$A$10:$M$177,11,FALSE)=0,\" \",VLOOKUP($D15,invullijst!$A$10:$M$177,11,FALSE)),\"\")","v":""},{"$f":"IF(VLOOKUP(D15,invullijst!A$10:F$218,4,FALSE)=\"\",\"\",VLOOKUP(D15,invullijst!A$10:D$218,4,FALSE))","v":0},null,{"$f":"IF(VLOOKUP($D15,invullijst!$A$10:$M$177,2,FALSE)=\"\",\"\",VLOOKUP($D15,invullijst!$A$10:$M$177,2,FALSE))","v":0},null,{"$f":"IF(VLOOKUP($D15,invullijst!$A$10:$M$177,9,FALSE)=0,\"\",VLOOKUP($D15,invullijst!$A$10:$M$177,9,FALSE))","v":""},null,4,{"$f":"IF($O$3=\"k\",IF(VLOOKUP($L15,invullijst!$A$10:$M$177,11,FALSE)=0,\" \",VLOOKUP($L15,invullijst!$A$10:$M$177,11,FALSE)),\"\")","v":""},{"$f":"IF(VLOOKUP($L15,invullijst!$A$10:$M$218,4,FALSE)=\"\",\"\",VLOOKUP($L15,invullijst!$A$10:$M$218,4,FALSE))","v":"vr"},213,{"$f":"IF(VLOOKUP($L15,invullijst!$A$10:$M$177,2,FALSE)=\"\",\"\",VLOOKUP($L15,invullijst!$A$10:$M$177,2,FALSE))","v":"Roland van Delft"},null,{"$f":"IF(VLOOKUP($L15,invullijst!$A$10:$M$177,9,FALSE)=0,\"\",VLOOKUP($L15,invullijst!$A$10:$M$177,9,FALSE))","v":77}]
["Totaal B1 korps",{"$nulls":5},{"$f":"SUM(G12:G15)","v":68},null,"Totaal B1 korps",{"$nulls":5},{"$f":"SUM(O12:O15)","v":320}]
[]
[1,{"$f":"IF($G$3=\"k\",IF(VLOOKUP($D18,invullijst!$A$10:$M$177,11,FALSE)=0,\" \",VLOOKUP($D18,invullijst!$A$10:$M$177,11,FALSE)),\"\")","v":""},{"$nulls":6},1,{"$f":"IF($O$3=\"k\",IF(VLOOKUP($L18,invullijst!$A$10:$M$177,11,FALSE)=0,\" \",VLOOKUP($L18,invullijst!$A$10:$M$177,11,FALSE)),\"\")","v":""},{"$f":"IF(VLOOKUP($L18,invullijst!$A$10:$M$218,4,FALSE)=\"\",\"\",VLOOKUP($L18,invullijst!$A$10:$M$218,4,FALSE))","v":"vr"},202,{"$f":"IF(VLOOKUP($L18,invullijst!$A$10:$M$177,2,FALSE)=\"\",\"\",VLOOKUP($L18,invullijst!$A$10:$M$177,2,FALSE))","v":"Arco van Kuijk"},null,{"$f":"IF(VLOOKUP($L18,invullijst!$A$10:$M$177,9,FALSE)=0,\"\",VLOOKUP($L18,invullijst!$A$10:$M$177,9,FALSE))","v":60}]
[2,{"$f":"IF($G$3=\"k\",IF(VLOOKUP($D19,invullijst!$A$10:$M$177,11,FALSE)=0,\" \",VLOOKUP($D19,invullijst!$A$10:$M$177,11,FALSE)),\"\")","v":""},null,null,"Ron groot (inhaal)",null,86,null,2,{"$f":"IF($O$3=\"k\",IF(VLOOKUP($L19,invullijst!$A$10:$M$177,11,FALSE)=0,\" \",VLOOKUP($L19,invullijst!$A$10:$M$177,11,FALSE)),\"\")","v":""},{"$f":"IF(VLOOKUP($L19,invullijst!$A$10:$M$218,4,FALSE)=\"\",\"\",VLOOKUP($L19,invullijst!$A$10:$M$218,4,FALSE))","v":"vr"},210,{"$f":"IF(VLOOKUP($L19,invullijst!$A$10:$M$177,2,FALSE)=\"\",\"\",VLOOKUP($L19,invullijst!$A$10:$M$177,2,FALSE))","v":"Nick de Vaan"},null,{"$f":"IF(VLOOKUP($L19,invullijst!$A$10:$M$177,9,FALSE)=0,\"\",VLOOKUP($L19,invullijst!$A$10:$M$177,9,FALSE))","v":75}]
[3,{"$f":"IF($G$3=\"k\",IF(VLOOKUP($D20,invullijst!$A$10:$M$177,11,FALSE)=0,\" \",VLOOKUP($D20,invullijst!$A$10:$M$177,11,FALSE)),\"\")","v":""},{"$nulls":6},3,{"$f":"IF($O$3=\"k\",IF(VLOOKUP($L20,invullijst!$A$10:$M$177,11,FALSE)=0,\" \",VLOOKUP($L20,invullijst!$A$10:$M$177,11,FALSE)),\"\")","v":""},{"$f":"IF(VLOOKUP($L20,invullijst!$A$10:$M$218,4,FALSE)=\"\",\"\",VLOOKUP($L20,invullijst!$A$10:$M$218,4,FALSE))","v":"vr"},217,{"$f":"IF(VLOOKUP($L20,invullijst!$A$10:$M$177,2,FALSE)=\"\",\"\",VLOOKUP($L20,invullijst!$A$10:$M$177,2,FALSE))","v":"Jānis Jākobsons"},null,{"$f":"IF(VLOOKUP($L20,invullijst!$A$10:$M$177,9,FALSE)=0,\"\",VLOOKUP($L20,invullijst!$A$10:$M$177,9,FALSE))","v":79}]
[4,{"$f":"IF($G$3=\"k\",IF(VLOOKUP($D21,invullijst!$A$10:$M$177,11,FALSE)=0,\" \",VLOOKUP($D21,invullijst!$A$10:$M$177,11,FALSE)),\"\")","v":""},{"$nulls":6},4,{"$f":"IF($O$3=\"k\",IF(VLOOKUP($L21,invullijst!$A$10:$M$177,11,FALSE)=0,\" \",VLOOKUP($L21,invullijst!$A$10:$M$177,11,FALSE)),\"\")","v":""},{"$f":"IF(VLOOKUP($L21,invullijst!$A$10:$M$218,4,FALSE)=\"\",\"\",VLOOKUP($L21,invullijst!$A$10:$M$218,4,FALSE))","v":0},null,{"$f":"IF(VLOOKUP($L21,invullijst!$A$10:$M$177,2,FALSE)=\"\",\"\",VLOOKUP($L21,invullijst!$A$10:$M$177,2,FALSE))","v":0},null,{"$f":"IF(VLOOKUP($L21,invullijst!$A$10:$M$177,9,FALSE)=0,\"\",VLOOKUP($L21,invullijst!$A$10:$M$177,9,FALSE))","v":""}]
["DIVERSEN / INHAAL",{"$nulls":7},"DIVERSEN / INHAAL"]
[]
["OPGELEGD (Jeugd <16 en 65+)"]
[1,{"$f":"IF($G$3=\"k\",IF(VLOOKUP($D25,invullijst!$A$10:$M$177,11,FALSE)=0,\" \",VLOOKUP($D25,invullijst!$A$10:$M$177,11,FALSE)),\"\")","v":""},{"$f":"IF(VLOOKUP(D25,invullijst!A$10:F$218,4,FALSE)=\"\",\"\",VLOOKUP(D25,invullijst!A$10:D$218,4,FALSE))","v":"65+"},310,{"$f":"IF(VLOOKUP($D25,invullijst!$A$10:$M$177,2,FALSE)=\"\",\"\",VLOOKUP($D25,invullijst!$A$10:$M$177,2,FALSE))","v":"Tini Boom"},null,{"$f":"IF(VLOOKUP($D25,invullijst!$A$10:$M$177,9,FALSE)=0,\"\",VLOOKUP($D25,invullijst!$A$10:$M$177,9,FALSE))","v":94},null,1,{"$f":"IF($O$3=\"k\",IF(VLOOKUP($L25,invullijst!$A$10:$M$177,11,FALSE)=0,\" \",VLOOKUP($L25,invullijst!$A$10:$M$177,11,FALSE)),\"\")","v":""},{"$f":"IF(VLOOKUP($L25,invullijst!$A$10:$M$218,4,FALSE)=\"\",\"\",VLOOKUP($L25,invullijst!$A$10:$M$218,4,FALSE))","v":"65+"},212,{"$f":"IF(VLOOKUP($L25,invullijst!$A$10:$M$177,2,FALSE)=\"\",\"\",VLOOKUP($L25,invullijst!$A$10:$M$177,2,FALSE))","v":"René Duquesnoy"},null,{"$f":"IF(VLOOKUP($L25,invullijst!$A$10:$M$177,9,FALSE)=0,\"\",VLOOKUP($L25,invullijst!$A$10:$M$177,9,FALSE))","v":87}]
[2,{"$f":"IF($G$3=\"k\",IF(VLOOKUP($D26,invullijst!$A$10:$M$177,11,FALSE)=0,\" \",VLOOKUP($D26,invullijst!$A$10:$M$177,11,FALSE)),\"\")","v":""},{"$f":"IF(VLOOKUP(D26,invullijst!A$10:F$218,4,FALSE)=\"\",\"\",VLOOKUP(D26,invullijst!A$10:D$218,4,FALSE))","v":"65+"},307,{"$f":"IF(VLOOKUP($D26,invullijst!$A$10:$M$177,2,FALSE)=\"\",\"\",VLOOKUP($D26,invullijst!$A$10:$M$177,2,FALSE))","v":"Bert van Engelen"},null,{"$f":"IF(VLOOKUP($D26,invullijst!$A$10:$M$177,9,FALSE)=0,\"\",VLOOKUP($D26,invullijst!$A$10:$M$177,9,FALSE))","v":93},null,2,{"$f":"IF($O$3=\"k\",IF(VLOOKUP($L26,invullijst!$A$10:$M$177,11,FALSE)=0,\" \",VLOOKUP($L26,invullijst!$A$10:$M$177,11,FALSE)),\"\")","v":""},{"$f":"IF(VLOOKUP($L26,invullijst!$A$10:$M$218,4,FALSE)=\"\",\"\",VLOOKUP($L26,invullijst!$A$10:$M$218,4,FALSE))","v":"65+"},211,{"$f":"IF(VLOOKUP($L26,invullijst!$A$10:$M$177,2,FALSE)=\"\",\"\",VLOOKUP($L26,invullijst!$A$10:$M$177,2,FALSE))","v":"Ad van den houdt"},null,{"$f":"IF(VLOOKUP($L26,invullijst!$A$10:$M$177,9,FALSE)=0,\"\",VLOOKUP($L26,invullijst!$A$10:$M$177,9,FALSE))","v":90}]
[3,{"$f":"IF($G$3=\"k\",IF(VLOOKUP($D27,invullijst!$A$10:$M$177,11,FALSE)=0,\" \",VLOOKUP($D27,invullijst!$A$10:$M$177,11,FALSE)),\"\")","v":""},{"$f":"IF(VLOOKUP(D27,invullijst!A$10:F$218,4,FALSE)=\"\",\"\",VLOOKUP(D27,invullijst!A$10:D$218,4,FALSE))","v":"J"},312,{"$f":"IF(VLOOKUP($D27,invullijst!$A$10:$M$177,2,FALSE)=\"\",\"\",VLOOKUP($D27,invullijst!$A$10:$M$177,2,FALSE))","v":"Floor de Jong"},null,{"$f":"IF(VLOOKUP($D27,invullijst!$A$10:$M$177,9,FALSE)=0,\"\",VLOOKUP($D27,invullijst!$A$10:$M$177,9,FALSE))","v":90},null,3,{"$f":"IF($O$3=\"k\",IF(VLOOKUP($L27,invullijst!$A$10:$M$177,11,FALSE)=0,\" \",VLOOKUP($L27,invullijst!$A$10:$M$177,11,FALSE)),\"\")","v":""},{"$f":"IF(VLOOKUP($L27,invullijst!$A$10:$M$218,4,FALSE)=\"\",\"\",VLOOKUP($L27,invullijst!$A$10:$M$218,4,FALSE))","v":"65+"},214,{"$f":"IF(VLOOKUP($L27,invullijst!$A$10:$M$177,2,FALSE)=\"\",\"\",VLOOKUP($L27,invullijst!$A$10:$M$177,2,FALSE))","v":"André de Vaan"},null,{"$f":"IF(VLOOKUP($L27,invullijst!$A$10:$M$177,9,FALSE)=0,\"\",VLOOKUP($L27,invullijst!$A$10:$M$177,9,FALSE))","v":96}]
["Totaal korps opgelegd A1",{"$nulls":5},{"$f":"SUM(G25:G27)","v":277},null,"Totaal korps opgelegd A1",{"$nulls":5},{"$f":"SUM(O25:O27)","v":273}]
[]
[1,{"$f":"IF($G$3=\"k\",IF(VLOOKUP($D30,invullijst!$A$10:$M$177,11,FALSE)=0,\" \",VLOOKUP($D30,invullijst!$A$10:$M$177,11,FALSE)),\"\")","v":""},{"$f":"IF(VLOOKUP(D30,invullijst!A$10:F$218,4,FALSE)=\"\",\"\",VLOOKUP(D30,invullijst!A$10:D$218,4,FALSE))","v":"65+"},309,{"$f":"IF(VLOOKUP($D30,invullijst!$A$10:$M$177,2,FALSE)=\"\",\"\",VLOOKUP($D30,invullijst!$A$10:$M$177,2,FALSE))","v":"René de Jong"},null,{"$f":"IF(VLOOKUP($D30,invullijst!$A$10:$M$177,9,FALSE)=0,\"\",VLOOKUP($D30,invullijst!$A$10:$M$177,9,FALSE))","v":93},null,1,{"$f":"IF($O$3=\"k\",IF(VLOOKUP($L30,invullijst!$A$10:$M$177,11,FALSE)=0,\" \",VLOOKUP($L30,invullijst!$A$10:$M$177,11,FALSE)),\"\")","v":""},{"$f":"IF(VLOOKUP($L30,invullijst!$A$10:$M$218,4,FALSE)=\"\",\"\",VLOOKUP($L30,invullijst!$A$10:$M$218,4,FALSE))","v":0},null,{"$f":"IF(VLOOKUP($L30,invullijst!$A$10:$M$177,2,FALSE)=\"\",\"\",VLOOKUP($L30,invullijst!$A$10:$M$177,2,FALSE))","v":0},null,{"$f":"IF(VLOOKUP($L30,invullijst!$A$10:$M$177,9,FALSE)=0,\"\",VLOOKUP($L30,invullijst!$A$10:$M$177,9,FALSE))","v":""}]
[2,{"$f":"IF($G$3=\"k\",IF(VLOOKUP($D31,invullijst!$A$10:$M$177,11,FALSE)=0,\" \",VLOOKUP($D31,invullijst!$A$10:$M$177,11,FALSE)),\"\")","v":""},{"$f":"IF(VLOOKUP(D31,invullijst!A$10:F$218,4,FALSE)=\"\",\"\",VLOOKUP(D31,invullijst!A$10:D$218,4,FALSE))","v":"65+"},301,{"$f":"IF(VLOOKUP($D31,invullijst!$A$10:$M$177,2,FALSE)=\"\",\"\",VLOOKUP($D31,invullijst!$A$10:$M$177,2,FALSE))","v":"Arjen van Assem disp"},null,{"$f":"IF(VLOOKUP($D31,invullijst!$A$10:$M$177,9,FALSE)=0,\"\",VLOOKUP($D31,invullijst!$A$10:$M$177,9,FALSE))","v":89},null,2,{"$f":"IF($O$3=\"k\",IF(VLOOKUP($L31,invullijst!$A$10:$M$177,11,FALSE)=0,\" \",VLOOKUP($L31,invullijst!$A$10:$M$177,11,FALSE)),\"\")","v":""},{"$f":"IF(VLOOKUP($L31,invullijst!$A$10:$M$218,4,FALSE)=\"\",\"\",VLOOKUP($L31,invullijst!$A$10:$M$218,4,FALSE))","v":0},null,{"$f":"IF(VLOOKUP($L31,invullijst!$A$10:$M$177,2,FALSE)=\"\",\"\",VLOOKUP($L31,invullijst!$A$10:$M$177,2,FALSE))","v":0},null,{"$f":"IF(VLOOKUP($L31,invullijst!$A$10:$M$177,9,FALSE)=0,\"\",VLOOKUP($L31,invullijst!$A$10:$M$177,9,FALSE))","v":""}]
[3,{"$f":"IF($G$3=\"k\",IF(VLOOKUP($D32,invullijst!$A$10:$M$177,11,FALSE)=0,\" \",VLOOKUP($D32,invullijst!$A$10:$M$177,11,FALSE)),\"\")","v":""},{"$f":"IF(VLOOKUP(D32,invullijst!A$10:F$218,4,FALSE)=\"\",\"\",VLOOKUP(D32,invullijst!A$10:D$218,4,FALSE))","v":0},null,{"$f":"IF(VLOOKUP($D32,invullijst!$A$10:$M$177,2,FALSE)=\"\",\"\",VLOOKUP($D32,invullijst!$A$10:$M$177,2,FALSE))","v":0},null,{"$f":"IF(VLOOKUP($D32,invullijst!$A$10:$M$177,9,FALSE)=0,\"\",VLOOKUP($D32,invullijst!$A$10:$M$177,9,FALSE))","v":""},null,3,{"$f":"IF($O$3=\"k\",IF(VLOOKUP($L32,invullijst!$A$10:$M$177,11,FALSE)=0,\" \",VLOOKUP($L32,invullijst!$A$10:$M$177,11,FALSE)),\"\")","v":""},{"$f":"IF(VLOOKUP($L32,invullijst!$A$10:$M$218,4,FALSE)=\"\",\"\",VLOOKUP($L32,invullijst!$A$10:$M$218,4,FALSE))","v":0},null,{"$f":"IF(VLOOKUP($L32,invullijst!$A$10:$M$177,2,FALSE)=\"\",\"\",VLOOKUP($L32,invullijst!$A$10:$M$177,2,FALSE))","v":0},null,{"$f":"IF(VLOOKUP($L32,invullijst!$A$10:$M$177,9,FALSE)=0,\"\",VLOOKUP($L32,invullijst!$A$10:$M$177,9,FALSE))","v":""}]
["Totaal korps opgelegd A2",{"$nulls":5},{"$f":"SUM(G30:G32)","v":182},null,"Totaal korps opgelegd A2",{"$nulls":5},{"$f":"SUM(O30:O32)","v":0}]
[]
[1,{"$f":"IF($G$3=\"k\",IF(VLOOKUP($D35,invullijst!$A$10:$M$177,11,FALSE)=0,\" \",VLOOKUP($D35,invullijst!$A$10:$M$177,11,FALSE)),\"\")","v":""},{"$f":"IF(VLOOKUP(D35,invullijst!A$10:F$218,4,FALSE)=\"\",\"\",VLOOKUP(D35,invullijst!A$10:D$218,4,FALSE))","v":0},null,{"$f":"IF(VLOOKUP($D35,invullijst!$A$10:$M$177,2,FALSE)=\"\",\"\",VLOOKUP($D35,invullijst!$A$10:$M$177,2,FALSE))","v":0},null,{"$f":"IF(VLOOKUP($D35,invullijst!$A$10:$M$177,9,FALSE)=0,\"\",VLOOKUP($D35,invullijst!$A$10:$M$177,9,FALSE))","v":""},null,1,{"$f":"IF($O$3=\"k\",IF(VLOOKUP($L35,invullijst!$A$10:$M$177,11,FALSE)=0,\" \",VLOOKUP($L35,invullijst!$A$10:$M$177,11,FALSE)),\"\")","v":""},{"$f":"IF(VLOOKUP($L35,invullijst!$A$10:$M$218,4,FALSE)=\"\",\"\",VLOOKUP($L35,invullijst!$A$10:$M$218,4,FALSE))","v":0},null,{"$f":"IF(VLOOKUP($L35,invullijst!$A$10:$M$177,2,FALSE)=\"\",\"\",VLOOKUP($L35,invullijst!$A$10:$M$177,2,FALSE))","v":0},null,{"$f":"IF(VLOOKUP($L35,invullijst!$A$10:$M$177,9,FALSE)=0,\"\",VLOOKUP($L35,invullijst!$A$10:$M$177,9,FALSE))","v":""}]
[2,{"$f":"IF($G$3=\"k\",IF(VLOOKUP($D36,invullijst!$A$10:$M$177,11,FALSE)=0,\" \",VLOOKUP($D36,invullijst!$A$10:$M$177,11,FALSE)),\"\")","v":""},{"$f":"IF(VLOOKUP(D36,invullijst!A$10:F$218,4,FALSE)=\"\",\"\",VLOOKUP(D36,invullijst!A$10:D$218,4,FALSE))","v":0},null,{"$f":"IF(VLOOKUP($D36,invullijst!$A$10:$M$177,2,FALSE)=\"\",\"\",VLOOKUP($D36,invullijst!$A$10:$M$177,2,FALSE))","v":0},null,{"$f":"IF(VLOOKUP($D36,invullijst!$A$10:$M$177,9,FALSE)=0,\"\",VLOOKUP($D36,invullijst!$A$10:$M$177,9,FALSE))","v":""},null,2,{"$f":"IF($O$3=\"k\",IF(VLOOKUP($L36,invullijst!$A$10:$M$177,11,FALSE)=0,\" \",VLOOKUP($L36,invullijst!$A$10:$M$177,11,FALSE)),\"\")","v":""},{"$f":"IF(VLOOKUP($L36,invullijst!$A$10:$M$218,4,FALSE)=\"\",\"\",VLOOKUP($L36,invullijst!$A$10:$M$218,4,FALSE))","v":0},null,{"$f":"IF(VLOOKUP($L36,invullijst!$A$10:$M$177,2,FALSE)=\"\",\"\",VLOOKUP($L36,invullijst!$A$10:$M$177,2,FALSE))","v":0},null,{"$f":"IF(VLOOKUP($L36,invullijst!$A$10:$M$177,9,FALSE)=0,\"\",VLOOKUP($L36,invullijst!$A$10:$M$177,9,FALSE))","v":""}]
[3,{"$f":"IF($G$3=\"k\",IF(VLOOKUP($D37,invullijst!$A$10:$M$177,11,FALSE)=0,\" \",VLOOKUP($D37,invullijst!$A$10:$M$177,11,FALSE)),\"\")","v":""},{"$f":"IF(VLOOKUP(D37,invullijst!A$10:F$218,4,FALSE)=\"\",\"\",VLOOKUP(D37,invullijst!A$10:D$218,4,FALSE))","v":0},null,{"$f":"IF(VLOOKUP($D37,invullijst!$A$10:$M$177,2,FALSE)=\"\",\"\",VLOOKUP($D37,invullijst!$A$10:$M$177,2,FALSE))","v":0},null,{"$f":"IF(VLOOKUP($D37,invullijst!$A$10:$M$177,9,FALSE)=0,\"\",VLOOKUP($D37,invullijst!$A$10:$M$177,9,FALSE))","v":""},null,3,{"$f":"IF($O$3=\"k\",IF(VLOOKUP($L37,invullijst!$A$10:$M$177,11,FALSE)=0,\" \",VLOOKUP($L37,invullijst!$A$10:$M$177,11,FALSE)),\"\")","v":""},{"$f":"IF(VLOOKUP($L37,invullijst!$A$10:$M$218,4,FALSE)=\"\",\"\",VLOOKUP($L37,invullijst!$A$10:$M$218,4,FALSE))","v":0},null,{"$f":"IF(VLOOKUP($L37,invullijst!$A$10:$M$177,2,FALSE)=\"\",\"\",VLOOKUP($L37,invullijst!$A$10:$M$177,2,FALSE))","v":0},null,{"$f":"IF(VLOOKUP($L37,invullijst!$A$10:$M$177,9,FALSE)=0,\"\",VLOOKUP($L37,invullijst!$A$10:$M$177,9,FALSE))","v":""}]
["Totaal korps opgelegd A3",{"$nulls":5},{"$f":"SUM(G35:G37)","v":0},null,"Totaal korps opgelegd A3",{"$nulls":5},{"$f":"SUM(O35:O37)","v":0}]

{"sheet":"wedstrijd 4B","index":12,"n_rows":38,"n_cols":15,"rows_kept":38,"merged":[[0,0,0,4],[0,5,0,7],[0,8,0,14],[1,0,1,11],[1,12,1,14],[2,1,2,5],[2,9,2,13],[4,0,4,14],[5,4,5,5],[5,12,5,13],[6,4,6,5],[6,12,6,13],[7,4,7,5],[7,12,7,13],[8,4,8,5],[8,12,8,13],[9,0,9,5],[9,8,9,13],[11,4,11,5],[11,12,11,13],[12,4,12,5],[12,12,12,13],[13,4,13,5],[13,12,13,13],[14,4,14,5],[14,12,14,13],[15,0,15,5],[15,8,15,13],[17,4,17,5],[17,12,17,13],[18,4,18,5],[18,12,18,13],[19,4,19,5],[19,12,19,13],[20,4,20,5],[20,12,20,13],[21,0,21,5],[21,8,21,13],[23,0,23,14],[24,4,24,5],[24,12,24,13],[25,4,25,5],[25,12,25,13],[26,4,26,5],[26,12,26,13],[27,0,27,5],[27,8,27,13],[29,4,29,5],[29,12,29,13],[30,4,30,5],[30,12,30,13],[31,4,31,5],[31,12,31,13],[32,0,32,5],[32,8,32,13],[34,4,34,5],[34,12,34,13],[35,4,35,5],[35,12,35,13],[36,4,36,5],[36,12,36,13],[37,0,37,5],[37,8,37,13]]}
[{"$f":"invullijst!F1","v":"Organisatie"},{"$nulls":4},{"$f":"invullijst!H2","v":"2023 - 2024"},null,null,{"$f":"invullijst!F3","v":"St. Crispinus & Crispinianus Besoijen"}]
["Datum: ",{"$nulls":11},"2024-03-03"]
[1,{"$f":"IF(VLOOKUP(A3,invullijst!A1:F5,2,FALSE)=\"\",\"\",VLOOKUP(A3,invullijst!A1:F5,2,FALSE))","v":"Sint Ambrosius Baardwijk"},{"$nulls":6},4,{"$f":"IF(VLOOKUP(I3,invullijst!A1:C5,2,FALSE)=\"\",\"\",VLOOKUP(I3,invullijst!A1:C5,2,FALSE))","v":"Sint Ambrosius Haarsteeg"}]
[]
["vrijehand"]
[1,{"$f":"IF($G$3=\"k\",IF(VLOOKUP($D6,invullijst!$A$10:$M$177,11,FALSE)=0,\" \",VLOOKUP($D6,invullijst!$A$10:$M$177,11,FALSE)),\"\")","v":""},{"$f":"IF(VLOOKUP(D6,invullijst!A$10:F$218,4,FALSE)=\"\",\"\",VLOOKUP(D6,invullijst!A$10:D$218,4,FALSE))","v":"vr"},102,{"$f":"IF(VLOOKUP($D6,invullijst!$A$10:$M$177,2,FALSE)=\"\",\"\",VLOOKUP($D6,invullijst!$A$10:$M$177,2,FALSE))","v":"John de Jong"},null,{"$f":"IF(VLOOKUP($D6,invullijst!$A$10:$M$177,9,FALSE)=0,\"\",VLOOKUP($D6,invullijst!$A$10:$M$177,9,FALSE))","v":65},null,1,{"$f":"IF($O$3=\"k\",IF(VLOOKUP($L6,invullijst!$A$10:$M$177,11,FALSE)=0,\" \",VLOOKUP($L6,invullijst!$A$10:$M$177,11,FALSE)),\"\")","v":""},{"$f":"IF(VLOOKUP($L6,invullijst!$A$10:$M$218,4,FALSE)=\"\",\"\",VLOOKUP($L6,invullijst!$A$10:$M$218,4,FALSE))","v":"vr"},405,{"$f":"IF(VLOOKUP($L6,invullijst!$A$10:$M$177,2,FALSE)=\"\",\"\",VLOOKUP($L6,invullijst!$A$10:$M$177,2,FALSE))","v":"Jan de Vaan"},null,{"$f":"IF(VLOOKUP($L6,invullijst!$A$10:$M$177,9,FALSE)=0,\"\",VLOOKUP($L6,invullijst!$A$10:$M$177,9,FALSE))","v":81}]
[2,{"$f":"IF($G$3=\"k\",IF(VLOOKUP($D7,invullijst!$A$10:$M$177,11,FALSE)=0,\" \",VLOOKUP($D7,invullijst!$A$10:$M$177,11,FALSE)),\"\")","v":""},{"$f":"IF(VLOOKUP(D7,invullijst!A$10:F$218,4,FALSE)=\"\",\"\",VLOOKUP(D7,invullijst!A$10:D$218,4,FALSE))","v":"vr"},105,{"$f":"IF(VLOOKUP($D7,invullijst!$A$10:$M$177,2,FALSE)=\"\",\"\",VLOOKUP($D7,invullijst!$A$10:$M$177,2,FALSE))","v":"René Klijn"},null,{"$f":"IF(VLOOKUP($D7,invullijst!$A$10:$M$177,9,FALSE)=0,\"\",VLOOKUP($D7,invullijst!$A$10:$M$177,9,FALSE))","v":83},null,2,{"$f":"IF($O$3=\"k\",IF(VLOOKUP($L7,invullijst!$A$10:$M$177,11,FALSE)=0,\" \",VLOOKUP($L7,invullijst!$A$10:$M$177,11,FALSE)),\"\")","v":""},{"$f":"IF(VLOOKUP($L7,invullijst!$A$10:$M$218,4,FALSE)=\"\",\"\",VLOOKUP($L7,invullijst!$A$10:$M$218,4,FALSE))","v":"vr"},406,{"$f":"IF(VLOOKUP($L7,invullijst!$A$10:$M$177,2,FALSE)=\"\",\"\",VLOOKUP($L7,invullijst!$A$10:$M$177,2,FALSE))","v":"Jeroen van Oss"},null,{"$f":"IF(VLOOKUP($L7,invullijst!$A$10:$M$177,9,FALSE)=0,\"\",VLOOKUP($L7,invullijst!$A$10:$M$177,9,FALSE))","v":83}]
[3,{"$f":"IF($G$3=\"k\",IF(VLOOKUP($D8,invullijst!$A$10:$M$177,11,FALSE)=0,\" \",VLOOKUP($D8,invullijst!$A$10:$M$177,11,FALSE)),\"\")","v":""},{"$f":"IF(VLOOKUP(D8,invullijst!A$10:F$218,4,FALSE)=\"\",\"\",VLOOKUP(D8,invullijst!A$10:D$218,4,FALSE))","v":"vr"},106,{"$f":"IF(VLOOKUP($D8,invullijst!$A$10:$M$177,2,FALSE)=\"\",\"\",VLOOKUP($D8,invullijst!$A$10:$M$177,2,FALSE))","v":"René Pullens"},null,{"$f":"IF(VLOOKUP($D8,invullijst!$A$10:$M$177,9,FALSE)=0,\"\",VLOOKUP($D8,invullijst!$A$10:$M$177,9,FALSE))","v":79},null,3,{"$f":"IF($O$3=\"k\",IF(VLOOKUP($L8,invullijst!$A$10:$M$177,11,FALSE)=0,\" \",VLOOKUP($L8,invullijst!$A$10:$M$177,11,FALSE)),\"\")","v":""},{"$f":"IF(VLOOKUP($L8,invullijst!$A$10:$M$218,4,FALSE)=\"\",\"\",VLOOKUP($L8,invullijst!$A$10:$M$218,4,FALSE))","v":"vr"},408,{"$f":"IF(VLOOKUP($L8,invullijst!$A$10:$M$177,2,FALSE)=\"\",\"\",VLOOKUP($L8,invullijst!$A$10:$M$177,2,FALSE))","v":"Rudy van Falier"},null,{"$f":"IF(VLOOKUP($L8,invullijst!$A$10:$M$177,9,FALSE)=0,\"\",VLOOKUP($L8,invullijst!$A$10:$M$177,9,FALSE))","v":80}]
[4,{"$f":"IF($G$3=\"k\",IF(VLOOKUP($D9,invullijst!$A$10:$M$177,11,FALSE)=0,\" \",VLOOKUP($D9,invullijst!$A$10:$M$177,11,FALSE)),\"\")","v":""},{"$f":"IF(VLOOKUP(D9,invullijst!A$10:F$218,4,FALSE)=\"\",\"\",VLOOKUP(D9,invullijst!A$10:D$218,4,FALSE))","v":"vr"},108,{"$f":"IF(VLOOKUP($D9,invullijst!$A$10:$M$177,2,FALSE)=\"\",\"\",VLOOKUP($D9,invullijst!$A$10:$M$177,2,FALSE))","v":"Bram Pullens"},null,{"$f":"IF(VLOOKUP($D9,invullijst!$A$10:$M$177,9,FALSE)=0,\"\",VLOOKUP($D9,invullijst!$A$10:$M$177,9,FALSE))","v":76},null,4,{"$f":"IF($O$3=\"k\",IF(VLOOKUP($L9,invullijst!$A$10:$M$177,11,FALSE)=0,\" \",VLOOKUP($L9,invullijst!$A$10:$M$177,11,FALSE)),\"\")","v":""},{"$f":"IF(VLOOKUP($L9,invullijst!$A$10:$M$218,4,FALSE)=\"\",\"\",VLOOKUP($L9,invullijst!$A$10:$M$218,4,FALSE))","v":"vr"},410,{"$f":"IF(VLOOKUP($L9,invullijst!$A$10:$M$177,2,FALSE)=\"\",\"\",VLOOKUP($L9,invullijst!$A$10:$M$177,2,FALSE))","v":"Tonnie Koks"},null,{"$f":"IF(VLOOKUP($L9,invullijst!$A$10:$M$177,9,FALSE)=0,\"\",VLOOKUP($L9,invullijst!$A$10:$M$177,9,FALSE))","v":82}]
["Totaal A korps",{"$nulls":5},{"$f":"SUM(G6:G9)","v":303},null,"Totaal A korps",{"$nulls":5},{"$f":"SUM(O6:O9)","v":326}]
[]
[1,{"$f":"IF($G$3=\"k\",IF(VLOOKUP($D12,invullijst!$A$10:$M$177,11,FALSE)=0,\" \",VLOOKUP($D12,invullijst!$A$10:$M$177,11,FALSE)),\"\")","v":""},{"$f":"IF(VLOOKUP(D12,invullijst!A$10:F$218,4,FALSE)=\"\",\"\",VLOOKUP(D12,invullijst!A$10:D$218,4,FALSE))","v":0},null,{"$f":"IF(VLOOKUP($D12,invullijst!$A$10:$M$177,2,FALSE)=\"\",\"\",VLOOKUP($D12,invullijst!$A$10:$M$177,2,FALSE))","v":0},null,{"$f":"IF(VLOOKUP($D12,invullijst!$A$10:$M$177,9,FALSE)=0,\"\",VLOOKUP($D12,invullijst!$A$10:$M$177,9,FALSE))","v":""},null,1,{"$f":"IF($O$3=\"k\",IF(VLOOKUP($L12,invullijst!$A$10:$M$177,11,FALSE)=0,\" \",VLOOKUP($L12,invullijst!$A$10:$M$177,11,FALSE)),\"\")","v":""},{"$f":"IF(VLOOKUP($L12,invullijst!$A$10:$M$218,4,FALSE)=\"\",\"\",VLOOKUP($L12,invullijst!$A$10:$M$218,4,FALSE))","v":"vr"},407,{"$f":"IF(VLOOKUP($L12,invullijst!$A$10:$M$177,2,FALSE)=\"\",\"\",VLOOKUP($L12,invullijst!$A$10:$M$177,2,FALSE))","v":"Justin van Son"},null,{"$f":"IF(VLOOKUP($L12,invullijst!$A$10:$M$177,9,FALSE)=0,\"\",VLOOKUP($L12,invullijst!$A$10:$M$177,9,FALSE))","v":79}]
[2,{"$f":"IF($G$3=\"k\",IF(VLOOKUP($D13,invullijst!$A$10:$M$177,11,FALSE)=0,\" \",VLOOKUP($D13,invullijst!$A$10:$M$177,11,FALSE)),\"\")","v":""},{"$f":"IF(VLOOKUP(D13,invullijst!A$10:F$218,4,FALSE)=\"\",\"\",VLOOKUP(D13,invullijst!A$10:D$218,4,FALSE))","v":0},null,{"$f":"IF(VLOOKUP($D13,invullijst!$A$10:$M$177,2,FALSE)=\"\",\"\",VLOOKUP($D13,invullijst!$A$10:$M$177,2,FALSE))","v":0},null,{"$f":"IF(VLOOKUP($D13,invullijst!$A$10:$M$177,9,FALSE)=0,\"\",VLOOKUP($D13,invullijst!$A$10:$M$177,9,FALSE))","v":""},null,2,{"$f":"IF($O$3=\"k\",IF(VLOOKUP($L13,invullijst!$A$10:$M$177,11,FALSE)=0,\" \",VLOOKUP($L13,invullijst!$A$10:$M$177,11,FALSE)),\"\")","v":""},{"$f":"IF(VLOOKUP($L13,invullijst!$A$10:$M$218,4,FALSE)=\"\",\"\",VLOOKUP($L13,invullijst!$A$10:$M$218,4,FALSE))","v":"vr"},402,{"$f":"IF(VLOOKUP($L13,invullijst!$A$10:$M$177,2,FALSE)=\"\",\"\",VLOOKUP($L13,invullijst!$A$10:$M$177,2,FALSE))","v":"Daniëlle v/d Lee"},null,{"$f":"IF(VLOOKUP($L13,invullijst!$A$10:$M$177,9,FALSE)=0,\"\",VLOOKUP($L13,invullijst!$A$10:$M$177,9,FALSE))","v":75}]
[3,{"$f":"IF($G$3=\"k\",IF(VLOOKUP($D14,invullijst!$A$10:$M$177,11,FALSE)=0,\" \",VLOOKUP($D14,invullijst!$A$10:$M$177,11,FALSE)),\"\")","v":""},{"$f":"IF(VLOOKUP(D14,invullijst!A$10:F$218,4,FALSE)=\"\",\"\",VLOOKUP(D14,invullijst!A$10:D$218,4,FALSE))","v":0},null,{"$f":"IF(VLOOKUP($D14,invullijst!$A$10:$M$177,2,FALSE)=\"\",\"\",VLOOKUP($D14,invullijst!$A$10:$M$177,2,FALSE))","v":0},null,{"$f":"IF(VLOOKUP($D14,invullijst!$A$10:$M$177,9,FALSE)=0,\"\",VLOOKUP($D14,invullijst!$A$10:$M$177,9,FALSE))","v":""},null,3,{"$f":"IF($O$3=\"k\",IF(VLOOKUP($L14,invullijst!$A$10:$M$177,11,FALSE)=0,\" \",VLOOKUP($L14,invullijst!$A$10:$M$177,11,FALSE)),\"\")","v":""},{"$f":"IF(VLOOKUP($L14,invullijst!$A$10:$M$218,4,FALSE)=\"\",\"\",VLOOKUP($L14,invullijst!$A$10:$M$218,4,FALSE))","v":0},null,{"$f":"IF(VLOOKUP($L14,invullijst!$A$10:$M$177,2,FALSE)=\"\",\"\",VLOOKUP($L14,invullijst!$A$10:$M$177,2,FALSE))","v":0},null,{"$f":"IF(VLOOKUP($L14,invullijst!$A$10:$M$177,9,FALSE)=0,\"\",VLOOKUP($L14,invullijst!$A$10:$M$177,9,FALSE))","v":""}]
[4,{"$f":"IF($G$3=\"k\",IF(VLOOKUP($D15,invullijst!$A$10:$M$177,11,FALSE)=0,\" \",VLOOKUP($D15,invullijst!$A$10:$M$177,11,FALSE)),\"\")","v":""},{"$f":"IF(VLOOKUP(D15,invullijst!A$10:F$218,4,FALSE)=\"\",\"\",VLOOKUP(D15,invullijst!A$10:D$218,4,FALSE))","v":0},null,{"$f":"IF(VLOOKUP($D15,invullijst!$A$10:$M$177,2,FALSE)=\"\",\"\",VLOOKUP($D15,invullijst!$A$10:$M$177,2,FALSE))","v":0},null,{"$f":"IF(VLOOKUP($D15,invullijst!$A$10:$M$177,9,FALSE)=0,\"\",VLOOKUP($D15,invullijst!$A$10:$M$177,9,FALSE))","v":""},null,4,{"$f":"IF($O$3=\"k\",IF(VLOOKUP($L15,invullijst!$A$10:$M$177,11,FALSE)=0,\" \",VLOOKUP($L15,invullijst!$A$10:$M$177,11,FALSE)),\"\")","v":""},{"$f":"IF(VLOOKUP($L15,invullijst!$A$10:$M$218,4,FALSE)=\"\",\"\",VLOOKUP($L15,invullijst!$A$10:$M$218,4,FALSE))","v":0},null,{"$f":"IF(VLOOKUP($L15,invullijst!$A$10:$M$177,2,FALSE)=\"\",\"\",VLOOKUP($L15,invullijst!$A$10:$M$177,2,FALSE))","v":0},null,{"$f":"IF(VLOOKUP($L15,invullijst!$A$10:$M$177,9,FALSE)=0,\"\",VLOOKUP($L15,invullijst!$A$10:$M$177,9,FALSE))","v":""}]
["Totaal B1 korps",{"$nulls":5},{"$f":"SUM(G12:G15)","v":0},null,"Totaal B1 korps",{"$nulls":5},154]
[]
[1,{"$f":"IF($G$3=\"k\",IF(VLOOKUP($D18,invullijst!$A$10:$M$177,11,FALSE)=0,\" \",VLOOKUP($D18,invullijst!$A$10:$M$177,11,FALSE)),\"\")","v":""},{"$f":"IF(VLOOKUP(D18,invullijst!A$10:F$218,4,FALSE)=\"\",\"\",VLOOKUP(D18,invullijst!A$10:D$218,4,FALSE))","v":0},null,{"$f":"IF(VLOOKUP($D18,invullijst!$A$10:$M$177,2,FALSE)=\"\",\"\",VLOOKUP($D18,invullijst!$A$10:$M$177,2,FALSE))","v":0},null,{"$f":"IF(VLOOKUP($D18,invullijst!$A$10:$M$177,9,FALSE)=0,\"\",VLOOKUP($D18,invullijst!$A$10:$M$177,9,FALSE))","v":""},null,1,{"$f":"IF($O$3=\"k\",IF(VLOOKUP($L18,invullijst!$A$10:$M$177,11,FALSE)=0,\" \",VLOOKUP($L18,invullijst!$A$10:$M$177,11,FALSE)),\"\")","v":""},null,null,"Justin van Son (inhaal)",null,85]
[2,{"$f":"IF($G$3=\"k\",IF(VLOOKUP($D19,invullijst!$A$10:$M$177,11,FALSE)=0,\" \",VLOOKUP($D19,invullijst!$A$10:$M$177,11,FALSE)),\"\")","v":""},{"$f":"IF(VLOOKUP(D19,invullijst!A$10:F$218,4,FALSE)=\"\",\"\",VLOOKUP(D19,invullijst!A$10:D$218,4,FALSE))","v":0},null,{"$f":"IF(VLOOKUP($D19,invullijst!$A$10:$M$177,2,FALSE)=\"\",\"\",VLOOKUP($D19,invullijst!$A$10:$M$177,2,FALSE))","v":0},null,{"$f":"IF(VLOOKUP($D19,invullijst!$A$10:$M$177,9,FALSE)=0,\"\",VLOOKUP($D19,invullijst!$A$10:$M$177,9,FALSE))","v":""},null,2,{"$f":"IF($O$3=\"k\",IF(VLOOKUP($L19,invullijst!$A$10:$M$177,11,FALSE)=0,\" \",VLOOKUP($L19,invullijst!$A$10:$M$177,11,FALSE)),\"\")","v":""}]
[3,{"$f":"IF($G$3=\"k\",IF(VLOOKUP($D20,invullijst!$A$10:$M$177,11,FALSE)=0,\" \",VLOOKUP($D20,invullijst!$A$10:$M$177,11,FALSE)),\"\")","v":""},{"$f":"IF(VLOOKUP(D20,invullijst!A$10:F$218,4,FALSE)=\"\",\"\",VLOOKUP(D20,invullijst!A$10:D$218,4,FALSE))","v":0},null,{"$f":"IF(VLOOKUP($D20,invullijst!$A$10:$M$177,2,FALSE)=\"\",\"\",VLOOKUP($D20,invullijst!$A$10:$M$177,2,FALSE))","v":0},null,{"$f":"IF(VLOOKUP($D20,invullijst!$A$10:$M$177,9,FALSE)=0,\"\",VLOOKUP($D20,invullijst!$A$10:$M$177,9,FALSE))","v":""},null,3,{"$f":"IF($O$3=\"k\",IF(VLOOKUP($L20,invullijst!$A$10:$M$177,11,FALSE)=0,\" \",VLOOKUP($L20,invullijst!$A$10:$M$177,11,FALSE)),\"\")","v":""}]
[4,{"$f":"IF($G$3=\"k\",IF(VLOOKUP($D21,invullijst!$A$10:$M$177,11,FALSE)=0,\" \",VLOOKUP($D21,invullijst!$A$10:$M$177,11,FALSE)),\"\")","v":""},{"$f":"IF(VLOOKUP(D21,invullijst!A$10:F$218,4,FALSE)=\"\",\"\",VLOOKUP(D21,invullijst!A$10:D$218,4,FALSE))","v":0},null,{"$f":"IF(VLOOKUP($D21,invullijst!$A$10:$M$177,2,FALSE)=\"\",\"\",VLOOKUP($D21,invullijst!$A$10:$M$177,2,FALSE))","v":0},null,{"$f":"IF(VLOOKUP($D21,invullijst!$A$10:$M$177,9,FALSE)=0,\"\",VLOOKUP($D21,invullijst!$A$10:$M$177,9,FALSE))","v":""},null,4,{"$f":"IF($O$3=\"k\",IF(VLOOKUP($L21,invullijst!$A$10:$M$177,11,FALSE)=0,\" \",VLOOKUP($L21,invullijst!$A$10:$M$177,11,FALSE)),\"\")","v":""}]
["DIVERSEN / INHAAL",{"$nulls":7},"DIVERSEN / INHAAL"]
[]
["OPGELEGD (Jeugd <16 en 65+)"]
[1,{"$f":"IF($G$3=\"k\",IF(VLOOKUP($D25,invullijst!$A$10:$M$177,11,FALSE)=0,\" \",VLOOKUP($D25,invullijst!$A$10:$M$177,11,FALSE)),\"\")","v":""},{"$f":"IF(VLOOKUP(D25,invullijst!A$10:F$218,4,FALSE)=\"\",\"\",VLOOKUP(D25,invullijst!A$10:D$218,4,FALSE))","v":"65+"},111,{"$f":"IF(VLOOKUP($D25,invullijst!$A$10:$M$177,2,FALSE)=\"\",\"\",VLOOKUP($D25,invullijst!$A$10:$M$177,2,FALSE))","v":"Frans van Buul"},null,{"$f":"IF(VLOOKUP($D25,invullijst!$A$10:$M$177,9,FALSE)=0,\"\",VLOOKUP($D25,invullijst!$A$10:$M$177,9,FALSE))","v":66},null,1,{"$f":"IF($O$3=\"k\",IF(VLOOKUP($L25,invullijst!$A$10:$M$177,11,FALSE)=0,\" \",VLOOKUP($L25,invullijst!$A$10:$M$177,11,FALSE)),\"\")","v":""},{"$f":"IF(VLOOKUP($L25,invullijst!$A$10:$M$218,4,FALSE)=\"\",\"\",VLOOKUP($L25,invullijst!$A$10:$M$218,4,FALSE))","v":"65+"},401,{"$f":"IF(VLOOKUP($L25,invullijst!$A$10:$M$177,2,FALSE)=\"\",\"\",VLOOKUP($L25,invullijst!$A$10:$M$177,2,FALSE))","v":"Frans van Beurden"},null,{"$f":"IF(VLOOKUP($L25,invullijst!$A$10:$M$177,9,FALSE)=0,\"\",VLOOKUP($L25,invullijst!$A$10:$M$177,9,FALSE))","v":94}]
[2,{"$f":"IF($G$3=\"k\",IF(VLOOKUP($D26,invullijst!$A$10:$M$177,11,FALSE)=0,\" \",VLOOKUP($D26,invullijst!$A$10:$M$177,11,FALSE)),\"\")","v":""},{"$f":"IF(VLOOKUP(D26,invullijst!A$10:F$218,4,FALSE)=\"\",\"\",VLOOKUP(D26,invullijst!A$10:D$218,4,FALSE))","v":"65+"},113,{"$f":"IF(VLOOKUP($D26,invullijst!$A$10:$M$177,2,FALSE)=\"\",\"\",VLOOKUP($D26,invullijst!$A$10:$M$177,2,FALSE))","v":"Kees Coppens"},null,{"$f":"IF(VLOOKUP($D26,invullijst!$A$10:$M$177,9,FALSE)=0,\"\",VLOOKUP($D26,invullijst!$A$10:$M$177,9,FALSE))","v":68},null,2,{"$f":"IF($O$3=\"k\",IF(VLOOKUP($L26,invullijst!$A$10:$M$177,11,FALSE)=0,\" \",VLOOKUP($L26,invullijst!$A$10:$M$177,11,FALSE)),\"\")","v":""},{"$f":"IF(VLOOKUP($L26,invullijst!$A$10:$M$218,4,FALSE)=\"\",\"\",VLOOKUP($L26,invullijst!$A$10:$M$218,4,FALSE))","v":"65+"},404,{"$f":"IF(VLOOKUP($L26,invullijst!$A$10:$M$177,2,FALSE)=\"\",\"\",VLOOKUP($L26,invullijst!$A$10:$M$177,2,FALSE))","v":"Gerard van Beurden"},null,{"$f":"IF(VLOOKUP($L26,invullijst!$A$10:$M$177,9,FALSE)=0,\"\",VLOOKUP($L26,invullijst!$A$10:$M$177,9,FALSE))","v":98}]
[3,{"$f":"IF($G$3=\"k\",IF(VLOOKUP($D27,invullijst!$A$10:$M$177,11,FALSE)=0,\" \",VLOOKUP($D27,invullijst!$A$10:$M$177,11,FALSE)),\"\")","v":""},{"$f":"IF(VLOOKUP(D27,invullijst!A$10:F$218,4,FALSE)=\"\",\"\",VLOOKUP(D27,invullijst!A$10:D$218,4,FALSE))","v":"J"},109,{"$f":"IF(VLOOKUP($D27,invullijst!$A$10:$M$177,2,FALSE)=\"\",\"\",VLOOKUP($D27,invullijst!$A$10:$M$177,2,FALSE))","v":"Gijs Pullens"},null,{"$f":"IF(VLOOKUP($D27,invullijst!$A$10:$M$177,9,FALSE)=0,\"\",VLOOKUP($D27,invullijst!$A$10:$M$177,9,FALSE))","v":83},null,3,{"$f":"IF($O$3=\"k\",IF(VLOOKUP($L27,invullijst!$A$10:$M$177,11,FALSE)=0,\" \",VLOOKUP($L27,invullijst!$A$10:$M$177,11,FALSE)),\"\")","v":""},{"$f":"IF(VLOOKUP($L27,invullijst!$A$10:$M$218,4,FALSE)=\"\",\"\",VLOOKUP($L27,invullijst!$A$10:$M$218,4,FALSE))","v":"65+"},413,{"$f":"IF(VLOOKUP($L27,invullijst!$A$10:$M$177,2,FALSE)=\"\",\"\",VLOOKUP($L27,invullijst!$A$10:$M$177,2,FALSE))","v":"Frans Mommersteeg"},null,{"$f":"IF(VLOOKUP($L27,invullijst!$A$10:$M$177,9,FALSE)=0,\"\",VLOOKUP($L27,invullijst!$A$10:$M$177,9,FALSE))","v":95}]
["Totaal korps opgelegd A1",{"$nulls":5},{"$f":"SUM(G25:G27)","v":217},null,"Totaal korps opgelegd A1",{"$nulls":5},{"$f":"SUM(O25:O27)","v":287}]
[]
[1,{"$f":"IF($G$3=\"k\",IF(VLOOKUP($D30,invullijst!$A$10:$M$177,11,FALSE)=0,\" \",VLOOKUP($D30,invullijst!$A$10:$M$177,11,FALSE)),\"\")","v":""},{"$f":"IF(VLOOKUP(D30,invullijst!A$10:F$218,4,FALSE)=\"\",\"\",VLOOKUP(D30,invullijst!A$10:D$218,4,FALSE))","v":"65+"},112,{"$f":"IF(VLOOKUP($D30,invullijst!$A$10:$M$177,2,FALSE)=\"\",\"\",VLOOKUP($D30,invullijst!$A$10:$M$177,2,FALSE))","v":"Toon van Buul"},null,{"$f":"IF(VLOOKUP($D30,invullijst!$A$10:$M$177,9,FALSE)=0,\"\",VLOOKUP($D30,invullijst!$A$10:$M$177,9,FALSE))","v":65},null,1,{"$f":"IF($O$3=\"k\",IF(VLOOKUP($L30,invullijst!$A$10:$M$177,11,FALSE)=0,\" \",VLOOKUP($L30,invullijst!$A$10:$M$177,11,FALSE)),\"\")","v":""},{"$f":"IF(VLOOKUP($L30,invullijst!$A$10:$M$218,4,FALSE)=\"\",\"\",VLOOKUP($L30,invullijst!$A$10:$M$218,4,FALSE))","v":"65+"},403,{"$f":"IF(VLOOKUP($L30,invullijst!$A$10:$M$177,2,FALSE)=\"\",\"\",VLOOKUP($L30,invullijst!$A$10:$M$177,2,FALSE))","v":"Dorien de Kort"},null,{"$f":"IF(VLOOKUP($L30,invullijst!$A$10:$M$177,9,FALSE)=0,\"\",VLOOKUP($L30,invullijst!$A$10:$M$177,9,FALSE))","v":94}]
[2,{"$f":"IF($G$3=\"k\",IF(VLOOKUP($D31,invullijst!$A$10:$M$177,11,FALSE)=0,\" \",VLOOKUP($D31,invullijst!$A$10:$M$177,11,FALSE)),\"\")","v":""},{"$f":"IF(VLOOKUP(D31,invullijst!A$10:F$218,4,FALSE)=\"\",\"\",VLOOKUP(D31,invullijst!A$10:D$218,4,FALSE))","v":0},null,{"$f":"IF(VLOOKUP($D31,invullijst!$A$10:$M$177,2,FALSE)=\"\",\"\",VLOOKUP($D31,invullijst!$A$10:$M$177,2,FALSE))","v":0},null,{"$f":"IF(VLOOKUP($D31,invullijst!$A$10:$M$177,9,FALSE)=0,\"\",VLOOKUP($D31,invullijst!$A$10:$M$177,9,FALSE))","v":""},null,2,{"$f":"IF($O$3=\"k\",IF(VLOOKUP($L31,invullijst!$A$10:$M$177,11,FALSE)=0,\" \",VLOOKUP($L31,invullijst!$A$10:$M$177,11,FALSE)),\"\")","v":""},{"$f":"IF(VLOOKUP($L31,invullijst!$A$10:$M$218,4,FALSE)=\"\",\"\",VLOOKUP($L31,invullijst!$A$10:$M$218,4,FALSE))","v":"65+"},412,{"$f":"IF(VLOOKUP($L31,invullijst!$A$10:$M$177,2,FALSE)=\"\",\"\",VLOOKUP($L31,invullijst!$A$10:$M$177,2,FALSE))","v":"Francien v/d Wiel"},null,{"$f":"IF(VLOOKUP($L31,invullijst!$A$10:$M$177,9,FALSE)=0,\"\",VLOOKUP($L31,invullijst!$A$10:$M$177,9,FALSE))","v":92}]
[3,{"$f":"IF($G$3=\"k\",IF(VLOOKUP($D32,invullijst!$A$10:$M$177,11,FALSE)=0,\" \",VLOOKUP($D32,invullijst!$A$10:$M$177,11,FALSE)),\"\")","v":""},{"$f":"IF(VLOOKUP(D32,invullijst!A$10:F$218,4,FALSE)=\"\",\"\",VLOOKUP(D32,invullijst!A$10:D$218,4,FALSE))","v":0},null,{"$f":"IF(VLOOKUP($D32,invullijst!$A$10:$M$177,2,FALSE)=\"\",\"\",VLOOKUP($D32,invullijst!$A$10:$M$177,2,FALSE))","v":0},null,{"$f":"IF(VLOOKUP($D32,invullijst!$A$10:$M$177,9,FALSE)=0,\"\",VLOOKUP($D32,invullijst!$A$10:$M$177,9,FALSE))","v":""},null,3,{"$f":"IF($O$3=\"k\",IF(VLOOKUP($L32,invullijst!$A$10:$M$177,11,FALSE)=0,\" \",VLOOKUP($L32,invullijst!$A$10:$M$177,11,FALSE)),\"\")","v":""},{"$f":"IF(VLOOKUP($L32,invullijst!$A$10:$M$218,4,FALSE)=\"\",\"\",VLOOKUP($L32,invullijst!$A$10:$M$218,4,FALSE))","v":"65+"},415,{"$f":"IF(VLOOKUP($L32,invullijst!$A$10:$M$177,2,FALSE)=\"\",\"\",VLOOKUP($L32,invullijst!$A$10:$M$177,2,FALSE))","v":"Wim de Gouw"},null,{"$f":"IF(VLOOKUP($L32,invullijst!$A$10:$M$177,9,FALSE)=0,\"\",VLOOKUP($L32,invullijst!$A$10:$M$177,9,FALSE))","v":95}]
["Totaal korps opgelegd A2",{"$nulls":5},{"$f":"SUM(G30:G32)","v":65},null,"Totaal korps opgelegd A2",{"$nulls":5},{"$f":"SUM(O30:O32)","v":281}]
[]
[1,{"$f":"IF($G$3=\"k\",IF(VLOOKUP($D35,invullijst!$A$10:$M$177,11,FALSE)=0,\" \",VLOOKUP($D35,invullijst!$A$10:$M$177,11,FALSE)),\"\")","v":""},{"$f":"IF(VLOOKUP(D35,invullijst!A$10:F$218,4,FALSE)=\"\",\"\",VLOOKUP(D35,invullijst!A$10:D$218,4,FALSE))","v":0},null,{"$f":"IF(VLOOKUP($D35,invullijst!$A$10:$M$177,2,FALSE)=\"\",\"\",VLOOKUP($D35,invullijst!$A$10:$M$177,2,FALSE))","v":0},null,{"$f":"IF(VLOOKUP($D35,invullijst!$A$10:$M$177,9,FALSE)=0,\"\",VLOOKUP($D35,invullijst!$A$10:$M$177,9,FALSE))","v":""},null,1,{"$f":"IF($O$3=\"k\",IF(VLOOKUP($L35,invullijst!$A$10:$M$177,11,FALSE)=0,\" \",VLOOKUP($L35,invullijst!$A$10:$M$177,11,FALSE)),\"\")","v":""},{"$f":"IF(VLOOKUP($L35,invullijst!$A$10:$M$218,4,FALSE)=\"\",\"\",VLOOKUP($L35,invullijst!$A$10:$M$218,4,FALSE))","v":0},null,{"$f":"IF(VLOOKUP($L35,invullijst!$A$10:$M$177,2,FALSE)=\"\",\"\",VLOOKUP($L35,invullijst!$A$10:$M$177,2,FALSE))","v":0},null,{"$f":"IF(VLOOKUP($L35,invullijst!$A$10:$M$177,9,FALSE)=0,\"\",VLOOKUP($L35,invullijst!$A$10:$M$177,9,FALSE))","v":""}]
[2,{"$f":"IF($G$3=\"k\",IF(VLOOKUP($D36,invullijst!$A$10:$M$177,11,FALSE)=0,\" \",VLOOKUP($D36,invullijst!$A$10:$M$177,11,FALSE)),\"\")","v":""},{"$f":"IF(VLOOKUP(D36,invullijst!A$10:F$218,4,FALSE)=\"\",\"\",VLOOKUP(D36,invullijst!A$10:D$218,4,FALSE))","v":0},null,{"$f":"IF(VLOOKUP($D36,invullijst!$A$10:$M$177,2,FALSE)=\"\",\"\",VLOOKUP($D36,invullijst!$A$10:$M$177,2,FALSE))","v":0},null,{"$f":"IF(VLOOKUP($D36,invullijst!$A$10:$M$177,9,FALSE)=0,\"\",VLOOKUP($D36,invullijst!$A$10:$M$177,9,FALSE))","v":""},null,2,{"$f":"IF($O$3=\"k\",IF(VLOOKUP($L36,invullijst!$A$10:$M$177,11,FALSE)=0,\" \",VLOOKUP($L36,invullijst!$A$10:$M$177,11,FALSE)),\"\")","v":""},{"$f":"IF(VLOOKUP($L36,invullijst!$A$10:$M$218,4,FALSE)=\"\",\"\",VLOOKUP($L36,invullijst!$A$10:$M$218,4,FALSE))","v":0},null,{"$f":"IF(VLOOKUP($L36,invullijst!$A$10:$M$177,2,FALSE)=\"\",\"\",VLOOKUP($L36,invullijst!$A$10:$M$177,2,FALSE))","v":0},null,{"$f":"IF(VLOOKUP($L36,invullijst!$A$10:$M$177,9,FALSE)=0,\"\",VLOOKUP($L36,invullijst!$A$10:$M$177,9,FALSE))","v":""}]
[3,{"$f":"IF($G$3=\"k\",IF(VLOOKUP($D37,invullijst!$A$10:$M$177,11,FALSE)=0,\" \",VLOOKUP($D37,invullijst!$A$10:$M$177,11,FALSE)),\"\")","v":""},{"$f":"IF(VLOOKUP(D37,invullijst!A$10:F$218,4,FALSE)=\"\",\"\",VLOOKUP(D37,invullijst!A$10:D$218,4,FALSE))","v":0},null,{"$f":"IF(VLOOKUP($D37,invullijst!$A$10:$M$177,2,FALSE)=\"\",\"\",VLOOKUP($D37,invullijst!$A$10:$M$177,2,FALSE))","v":0},null,{"$f":"IF(VLOOKUP($D37,invullijst!$A$10:$M$177,9,FALSE)=0,\"\",VLOOKUP($D37,invullijst!$A$10:$M$177,9,FALSE))","v":""},null,3,{"$f":"IF($O$3=\"k\",IF(VLOOKUP($L37,invullijst!$A$10:$M$177,11,FALSE)=0,\" \",VLOOKUP($L37,invullijst!$A$10:$M$177,11,FALSE)),\"\")","v":""},{"$f":"IF(VLOOKUP($L37,invullijst!$A$10:$M$218,4,FALSE)=\"\",\"\",VLOOKUP($L37,invullijst!$A$10:$M$218,4,FALSE))","v":0},null,{"$f":"IF(VLOOKUP($L37,invullijst!$A$10:$M$177,2,FALSE)=\"\",\"\",VLOOKUP($L37,invullijst!$A$10:$M$177,2,FALSE))","v":0},null,{"$f":"IF(VLOOKUP($L37,invullijst!$A$10:$M$177,9,FALSE)=0,\"\",VLOOKUP($L37,invullijst!$A$10:$M$177,9,FALSE))","v":""}]
["Totaal korps opgelegd A3",{"$nulls":5},{"$f":"SUM(G35:G37)","v":0},null,"Totaal korps opgelegd A3",{"$nulls":5},{"$f":"SUM(O35:O37)","v":0}]

{"sheet":"wedstrijd 5A","index":13,"n_rows":38,"n_cols":15,"rows_kept":38,"merged":[[0,0,0,4],[0,5,0,7],[0,8,0,14],[1,0,1,11],[1,12,1,14],[2,1,2,5],[2,9,2,13],[4,0,4,14],[5,4,5,5],[5,12,5,13],[6,4,6,5],[6,12,6,13],[7,4,7,5],[7,12,7,13],[8,4,8,5],[8,12,8,13],[9,0,9,5],[9,8,9,13],[11,4,11,5],[11,12,11,13],[12,4,12,5],[12,12,12,13],[13,4,13,5],[13,12,13,13],[14,4,14,5],[14,12,14,13],[15,0,15,5],[15,8,15,13],[17,4,17,5],[17,12,17,13],[18,4,18,5],[18,12,18,13],[19,4,19,5],[19,12,19,13],[20,4,20,5],[20,12,20,13],[21,0,21,5],[21,8,21,13],[23,0,23,14],[24,4,24,5],[24,12,24,13],[25,4,25,5],[25,12,25,13],[26,4,26,5],[26,12,26,13],[27,0,27,5],[27,8,27,13],[29,4,29,5],[29,12,29,13],[30,4,30,5],[30,12,30,13],[31,4,31,5],[31,12,31,13],[32,0,32,5],[32,8,32,13],[34,4,34,5],[34,12,34,13],[35,4,35,5],[35,12,35,13],[36,4,36,5],[36,12,36,13],[37,0,37,5],[37,8,37,13]]}
[{"$f":"invullijst!F1","v":"Organisatie"},{"$nulls":4},{"$f":"invullijst!H2","v":"2023 - 2024"},null,null,{"$f":"invullijst!F3","v":"St. Crispinus & Crispinianus Besoijen"}]
["Datum: ",{"$nulls":11},"2024-03-17"]
[3,{"$f":"IF(VLOOKUP(A3,invullijst!A1:F5,2,FALSE)=\"\",\"\",VLOOKUP(A3,invullijst!A1:F5,2,FALSE))","v":"O.L.V. Schuts Elshout"},{"$nulls":6},1,{"$f":"IF(VLOOKUP(I3,invullijst!A1:C5,2,FALSE)=\"\",\"\",VLOOKUP(I3,invullijst!A1:C5,2,FALSE))","v":"Sint Ambrosius Baardwijk"}]
[]
["vrijehand"]
[1,{"$f":"IF($G$3=\"k\",IF(VLOOKUP($D6,invullijst!$A$10:$M$177,11,FALSE)=0,\" \",VLOOKUP($D6,invullijst!$A$10:$M$177,11,FALSE)),\"\")","v":""},{"$f":"IF(VLOOKUP(D6,invullijst!A$10:F$218,4,FALSE)=\"\",\"\",VLOOKUP(D6,invullijst!A$10:D$218,4,FALSE))","v":"vr"},302,{"$f":"IF(VLOOKUP($D6,invullijst!$A$10:$M$177,2,FALSE)=\"\",\"\",VLOOKUP($D6,invullijst!$A$10:$M$177,2,FALSE))","v":"Freek de Jong"},null,{"$f":"IF(VLOOKUP($D6,invullijst!$A$10:$M$177,10,FALSE)=0,\"\",VLOOKUP($D6,invullijst!$A$10:$M$177,10,FALSE))","v":90},null,1,{"$f":"IF($O$3=\"k\",IF(VLOOKUP($L6,invullijst!$A$10:$M$177,11,FALSE)=0,\" \",VLOOKUP($L6,invullijst!$A$10:$M$177,11,FALSE)),\"\")","v":""},{"$f":"IF(VLOOKUP($L6,invullijst!$A$10:$M$218,4,FALSE)=\"\",\"\",VLOOKUP($L6,invullijst!$A$10:$M$218,4,FALSE))","v":"vr"},105,{"$f":"IF(VLOOKUP($L6,invullijst!$A$10:$M$177,2,FALSE)=\"\",\"\",VLOOKUP($L6,invullijst!$A$10:$M$177,2,FALSE))","v":"René Klijn"},null,{"$f":"IF(VLOOKUP($L6,invullijst!$A$10:$M$177,10,FALSE)=0,\"\",VLOOKUP($L6,invullijst!$A$10:$M$177,10,FALSE))","v":84}]
[2,{"$f":"IF($G$3=\"k\",IF(VLOOKUP($D7,invullijst!$A$10:$M$177,11,FALSE)=0,\" \",VLOOKUP($D7,invullijst!$A$10:$M$177,11,FALSE)),\"\")","v":""},{"$f":"IF(VLOOKUP(D7,invullijst!A$10:F$218,4,FALSE)=\"\",\"\",VLOOKUP(D7,invullijst!A$10:D$218,4,FALSE))","v":"vr"},311,{"$f":"IF(VLOOKUP($D7,invullijst!$A$10:$M$177,2,FALSE)=\"\",\"\",VLOOKUP($D7,invullijst!$A$10:$M$177,2,FALSE))","v":"Ton Kolmans"},null,{"$f":"IF(VLOOKUP($D7,invullijst!$A$10:$M$177,10,FALSE)=0,\"\",VLOOKUP($D7,invullijst!$A$10:$M$177,10,FALSE))","v":83},null,2,{"$f":"IF($O$3=\"k\",IF(VLOOKUP($L7,invullijst!$A$10:$M$177,11,FALSE)=0,\" \",VLOOKUP($L7,invullijst!$A$10:$M$177,11,FALSE)),\"\")","v":""},{"$f":"IF(VLOOKUP($L7,invullijst!$A$10:$M$218,4,FALSE)=\"\",\"\",VLOOKUP($L7,invullijst!$A$10:$M$218,4,FALSE))","v":"vr"},102,{"$f":"IF(VLOOKUP($L7,invullijst!$A$10:$M$177,2,FALSE)=\"\",\"\",VLOOKUP($L7,invullijst!$A$10:$M$177,2,FALSE))","v":"John de Jong"},null,{"$f":"IF(VLOOKUP($L7,invullijst!$A$10:$M$177,10,FALSE)=0,\"\",VLOOKUP($L7,invullijst!$A$10:$M$177,10,FALSE))","v":77}]
[3,{"$f":"IF($G$3=\"k\",IF(VLOOKUP($D8,invullijst!$A$10:$M$177,11,FALSE)=0,\" \",VLOOKUP($D8,invullijst!$A$10:$M$177,11,FALSE)),\"\")","v":""},{"$f":"IF(VLOOKUP(D8,invullijst!A$10:F$218,4,FALSE)=\"\",\"\",VLOOKUP(D8,invullijst!A$10:D$218,4,FALSE))","v":"vr"},305,{"$f":"IF(VLOOKUP($D8,invullijst!$A$10:$M$177,2,FALSE)=\"\",\"\",VLOOKUP($D8,invullijst!$A$10:$M$177,2,FALSE))","v":"Johan Klerx"},null,{"$f":"IF(VLOOKUP($D8,invullijst!$A$10:$M$177,10,FALSE)=0,\"\",VLOOKUP($D8,invullijst!$A$10:$M$177,10,FALSE))","v":82},null,3,{"$f":"IF($O$3=\"k\",IF(VLOOKUP($L8,invullijst!$A$10:$M$177,11,FALSE)=0,\" \",VLOOKUP($L8,invullijst!$A$10:$M$177,11,FALSE)),\"\")","v":""},{"$f":"IF(VLOOKUP($L8,invullijst!$A$10:$M$218,4,FALSE)=\"\",\"\",VLOOKUP($L8,invullijst!$A$10:$M$218,4,FALSE))","v":"vr"},106,{"$f":"IF(VLOOKUP($L8,invullijst!$A$10:$M$177,2,FALSE)=\"\",\"\",VLOOKUP($L8,invullijst!$A$10:$M$177,2,FALSE))","v":"René Pullens"},null,{"$f":"IF(VLOOKUP($L8,invullijst!$A$10:$M$177,10,FALSE)=0,\"\",VLOOKUP($L8,invullijst!$A$10:$M$177,10,FALSE))","v":88}]
[4,{"$f":"IF($G$3=\"k\",IF(VLOOKUP($D9,invullijst!$A$10:$M$177,11,FALSE)=0,\" \",VLOOKUP($D9,invullijst!$A$10:$M$177,11,FALSE)),\"\")","v":""},{"$f":"IF(VLOOKUP(D9,invullijst!A$10:F$218,4,FALSE)=\"\",\"\",VLOOKUP(D9,invullijst!A$10:D$218,4,FALSE))","v":"vr"},306,{"$f":"IF(VLOOKUP($D9,invullijst!$A$10:$M$177,2,FALSE)=\"\",\"\",VLOOKUP($D9,invullijst!$A$10:$M$177,2,FALSE))","v":"Ron Groot"},null,{"$f":"IF(VLOOKUP($D9,invullijst!$A$10:$M$177,10,FALSE)=0,\"\",VLOOKUP($D9,invullijst!$A$10:$M$177,10,FALSE))","v":85},null,4,{"$f":"IF($O$3=\"k\",IF(VLOOKUP($L9,invullijst!$A$10:$M$177,11,FALSE)=0,\" \",VLOOKUP($L9,invullijst!$A$10:$M$177,11,FALSE)),\"\")","v":""},{"$f":"IF(VLOOKUP($L9,invullijst!$A$10:$M$218,4,FALSE)=\"\",\"\",VLOOKUP($L9,invullijst!$A$10:$M$218,4,FALSE))","v":"vr"},108,{"$f":"IF(VLOOKUP($L9,invullijst!$A$10:$M$177,2,FALSE)=\"\",\"\",VLOOKUP($L9,invullijst!$A$10:$M$177,2,FALSE))","v":"Bram Pullens"},null,{"$f":"IF(VLOOKUP($L9,invullijst!$A$10:$M$177,10,FALSE)=0,\"\",VLOOKUP($L9,invullijst!$A$10:$M$177,10,FALSE))","v":75}]
["Totaal A korps",{"$nulls":5},{"$f":"SUM(G6:G9)","v":340},null,"Totaal A korps",{"$nulls":5},{"$f":"SUM(O6:O9)","v":324}]
[]
[1,{"$f":"IF($G$3=\"k\",IF(VLOOKUP($D12,invullijst!$A$10:$M$177,11,FALSE)=0,\" \",VLOOKUP($D12,invullijst!$A$10:$M$177,11,FALSE)),\"\")","v":""},{"$f":"IF(VLOOKUP(D12,invullijst!A$10:F$218,4,FALSE)=\"\",\"\",VLOOKUP(D12,invullijst!A$10:D$218,4,FALSE))","v":"vr"},304,{"$f":"IF(VLOOKUP($D12,invullijst!$A$10:$M$177,2,FALSE)=\"\",\"\",VLOOKUP($D12,invullijst!$A$10:$M$177,2,FALSE))","v":"Henk Bruurmijn "},null,{"$f":"IF(VLOOKUP($D12,invullijst!$A$10:$M$177,10,FALSE)=0,\"\",VLOOKUP($D12,invullijst!$A$10:$M$177,10,FALSE))","v":68},null,1,{"$f":"IF($O$3=\"k\",IF(VLOOKUP($L12,invullijst!$A$10:$M$177,11,FALSE)=0,\" \",VLOOKUP($L12,invullijst!$A$10:$M$177,11,FALSE)),\"\")","v":""},{"$f":"IF(VLOOKUP($L12,invullijst!$A$10:$M$218,4,FALSE)=\"\",\"\",VLOOKUP($L12,invullijst!$A$10:$M$218,4,FALSE))","v":0},null,{"$f":"IF(VLOOKUP($L12,invullijst!$A$10:$M$177,2,FALSE)=\"\",\"\",VLOOKUP($L12,invullijst!$A$10:$M$177,2,FALSE))","v":0},null,{"$f":"IF(VLOOKUP($L12,invullijst!$A$10:$M$177,10,FALSE)=0,\"\",VLOOKUP($L12,invullijst!$A$10:$M$177,10,FALSE))","v":""}]
[2,{"$f":"IF($G$3=\"k\",IF(VLOOKUP($D13,invullijst!$A$10:$M$177,11,FALSE)=0,\" \",VLOOKUP($D13,invullijst!$A$10:$M$177,11,FALSE)),\"\")","v":""},{"$f":"IF(VLOOKUP(D13,invullijst!A$10:F$218,4,FALSE)=\"\",\"\",VLOOKUP(D13,invullijst!A$10:D$218,4,FALSE))","v":0},null,{"$f":"IF(VLOOKUP($D13,invullijst!$A$10:$M$177,2,FALSE)=\"\",\"\",VLOOKUP($D13,invullijst!$A$10:$M$177,2,FALSE))","v":0},null,{"$f":"IF(VLOOKUP($D13,invullijst!$A$10:$M$177,10,FALSE)=0,\"\",VLOOKUP($D13,invullijst!$A$10:$M$177,10,FALSE))","v":""},null,2,{"$f":"IF($O$3=\"k\",IF(VLOOKUP($L13,invullijst!$A$10:$M$177,11,FALSE)=0,\" \",VLOOKUP($L13,invullijst!$A$10:$M$177,11,FALSE)),\"\")","v":""},{"$f":"IF(VLOOKUP($L13,invullijst!$A$10:$M$218,4,FALSE)=\"\",\"\",VLOOKUP($L13,invullijst!$A$10:$M$218,4,FALSE))","v":0},null,{"$f":"IF(VLOOKUP($L13,invullijst!$A$10:$M$177,2,FALSE)=\"\",\"\",VLOOKUP($L13,invullijst!$A$10:$M$177,2,FALSE))","v":0},null,{"$f":"IF(VLOOKUP($L13,invullijst!$A$10:$M$177,10,FALSE)=0,\"\",VLOOKUP($L13,invullijst!$A$10:$M$177,10,FALSE))","v":""}]
[3,{"$f":"IF($G$3=\"k\",IF(VLOOKUP($D14,invullijst!$A$10:$M$177,11,FALSE)=0,\" \",VLOOKUP($D14,invullijst!$A$10:$M$177,11,FALSE)),\"\")","v":""},{"$f":"IF(VLOOKUP(D14,invullijst!A$10:F$218,4,FALSE)=\"\",\"\",VLOOKUP(D14,invullijst!A$10:D$218,4,FALSE))","v":0},null,{"$f":"IF(VLOOKUP($D14,invullijst!$A$10:$M$177,2,FALSE)=\"\",\"\",VLOOKUP($D14,invullijst!$A$10:$M$177,2,FALSE))","v":0},null,{"$f":"IF(VLOOKUP($D14,invullijst!$A$10:$M$177,10,FALSE)=0,\"\",VLOOKUP($D14,invullijst!$A$10:$M$177,10,FALSE))","v":""},null,3,{"$f":"IF($O$3=\"k\",IF(VLOOKUP($L14,invullijst!$A$10:$M$177,11,FALSE)=0,\" \",VLOOKUP($L14,invullijst!$A$10:$M$177,11,FALSE)),\"\")","v":""},{"$f":"IF(VLOOKUP($L14,invullijst!$A$10:$M$218,4,FALSE)=\"\",\"\",VLOOKUP($L14,invullijst!$A$10:$M$218,4,FALSE))","v":0},null,{"$f":"IF(VLOOKUP($L14,invullijst!$A$10:$M$177,2,FALSE)=\"\",\"\",VLOOKUP($L14,invullijst!$A$10:$M$177,2,FALSE))","v":0},null,{"$f":"IF(VLOOKUP($L14,invullijst!$A$10:$M$177,10,FALSE)=0,\"\",VLOOKUP($L14,invullijst!$A$10:$M$177,10,FALSE))","v":""}]
[4,{"$f":"IF($G$3=\"k\",IF(VLOOKUP($D15,invullijst!$A$10:$M$177,11,FALSE)=0,\" \",VLOOKUP($D15,invullijst!$A$10:$M$177,11,FALSE)),\"\")","v":""},{"$f":"IF(VLOOKUP(D15,invullijst!A$10:F$218,4,FALSE)=\"\",\"\",VLOOKUP(D15,invullijst!A$10:D$218,4,FALSE))","v":0},null,{"$f":"IF(VLOOKUP($D15,invullijst!$A$10:$M$177,2,FALSE)=\"\",\"\",VLOOKUP($D15,invullijst!$A$10:$M$177,2,FALSE))","v":0},null,{"$f":"IF(VLOOKUP($D15,invullijst!$A$10:$M$177,10,FALSE)=0,\"\",VLOOKUP($D15,invullijst!$A$10:$M$177,10,FALSE))","v":""},null,4,{"$f":"IF($O$3=\"k\",IF(VLOOKUP($L15,invullijst!$A$10:$M$177,11,FALSE)=0,\" \",VLOOKUP($L15,invullijst!$A$10:$M$177,11,FALSE)),\"\")","v":""},{"$f":"IF(VLOOKUP($L15,invullijst!$A$10:$M$218,4,FALSE)=\"\",\"\",VLOOKUP($L15,invullijst!$A$10:$M$218,4,FALSE))","v":0},null,{"$f":"IF(VLOOKUP($L15,invullijst!$A$10:$M$177,2,FALSE)=\"\",\"\",VLOOKUP($L15,invullijst!$A$10:$M$177,2,FALSE))","v":0},null,{"$f":"IF(VLOOKUP($L15,invullijst!$A$10:$M$177,10,FALSE)=0,\"\",VLOOKUP($L15,invullijst!$A$10:$M$177,10,FALSE))","v":""}]
["Totaal B1 korps",{"$nulls":5},{"$f":"SUM(G12:G15)","v":68},null,"Totaal B1 korps",{"$nulls":5},{"$f":"SUM(O12:O15)","v":0}]
[]
[1,{"$f":"IF($G$3=\"k\",IF(VLOOKUP($D18,invullijst!$A$10:$M$177,11,FALSE)=0,\" \",VLOOKUP($D18,invullijst!$A$10:$M$177,11,FALSE)),\"\")","v":""},{"$f":"IF(VLOOKUP(D18,invullijst!A$10:F$218,4,FALSE)=\"\",\"\",VLOOKUP(D18,invullijst!A$10:D$218,4,FALSE))","v":0},null,{"$f":"IF(VLOOKUP($D18,invullijst!$A$10:$M$177,2,FALSE)=\"\",\"\",VLOOKUP($D18,invullijst!$A$10:$M$177,2,FALSE))","v":0},null,{"$f":"IF(VLOOKUP($D18,invullijst!$A$10:$M$177,10,FALSE)=0,\"\",VLOOKUP($D18,invullijst!$A$10:$M$177,10,FALSE))","v":""},null,1,{"$f":"IF($O$3=\"k\",IF(VLOOKUP($L18,invullijst!$A$10:$M$177,11,FALSE)=0,\" \",VLOOKUP($L18,invullijst!$A$10:$M$177,11,FALSE)),\"\")","v":""},{"$f":"IF(VLOOKUP($L18,invullijst!$A$10:$M$218,4,FALSE)=\"\",\"\",VLOOKUP($L18,invullijst!$A$10:$M$218,4,FALSE))","v":0},null,{"$f":"IF(VLOOKUP($L18,invullijst!$A$10:$M$177,2,FALSE)=\"\",\"\",VLOOKUP($L18,invullijst!$A$10:$M$177,2,FALSE))","v":0},null,{"$f":"IF(VLOOKUP($L18,invullijst!$A$10:$M$177,10,FALSE)=0,\"\",VLOOKUP($L18,invullijst!$A$10:$M$177,10,FALSE))","v":""}]
[2,{"$f":"IF($G$3=\"k\",IF(VLOOKUP($D19,invullijst!$A$10:$M$177,11,FALSE)=0,\" \",VLOOKUP($D19,invullijst!$A$10:$M$177,11,FALSE)),\"\")","v":""},{"$f":"IF(VLOOKUP(D19,invullijst!A$10:F$218,4,FALSE)=\"\",\"\",VLOOKUP(D19,invullijst!A$10:D$218,4,FALSE))","v":0},null,{"$f":"IF(VLOOKUP($D19,invullijst!$A$10:$M$177,2,FALSE)=\"\",\"\",VLOOKUP($D19,invullijst!$A$10:$M$177,2,FALSE))","v":0},null,{"$f":"IF(VLOOKUP($D19,invullijst!$A$10:$M$177,10,FALSE)=0,\"\",VLOOKUP($D19,invullijst!$A$10:$M$177,10,FALSE))","v":""},null,2,{"$f":"IF($O$3=\"k\",IF(VLOOKUP($L19,invullijst!$A$10:$M$177,11,FALSE)=0,\" \",VLOOKUP($L19,invullijst!$A$10:$M$177,11,FALSE)),\"\")","v":""},{"$f":"IF(VLOOKUP($L19,invullijst!$A$10:$M$218,4,FALSE)=\"\",\"\",VLOOKUP($L19,invullijst!$A$10:$M$218,4,FALSE))","v":0},null,{"$f":"IF(VLOOKUP($L19,invullijst!$A$10:$M$177,2,FALSE)=\"\",\"\",VLOOKUP($L19,invullijst!$A$10:$M$177,2,FALSE))","v":0},null,{"$f":"IF(VLOOKUP($L19,invullijst!$A$10:$M$177,10,FALSE)=0,\"\",VLOOKUP($L19,invullijst!$A$10:$M$177,10,FALSE))","v":""}]
[3,{"$f":"IF($G$3=\"k\",IF(VLOOKUP($D20,invullijst!$A$10:$M$177,11,FALSE)=0,\" \",VLOOKUP($D20,invullijst!$A$10:$M$177,11,FALSE)),\"\")","v":""},{"$f":"IF(VLOOKUP(D20,invullijst!A$10:F$218,4,FALSE)=\"\",\"\",VLOOKUP(D20,invullijst!A$10:D$218,4,FALSE))","v":0},null,{"$f":"IF(VLOOKUP($D20,invullijst!$A$10:$M$177,2,FALSE)=\"\",\"\",VLOOKUP($D20,invullijst!$A$10:$M$177,2,FALSE))","v":0},null,{"$f":"IF(VLOOKUP($D20,invullijst!$A$10:$M$177,10,FALSE)=0,\"\",VLOOKUP($D20,invullijst!$A$10:$M$177,10,FALSE))","v":""},null,3,{"$f":"IF($O$3=\"k\",IF(VLOOKUP($L20,invullijst!$A$10:$M$177,11,FALSE)=0,\" \",VLOOKUP($L20,invullijst!$A$10:$M$177,11,FALSE)),\"\")","v":""},{"$f":"IF(VLOOKUP($L20,invullijst!$A$10:$M$218,4,FALSE)=\"\",\"\",VLOOKUP($L20,invullijst!$A$10:$M$218,4,FALSE))","v":0},null,{"$f":"IF(VLOOKUP($L20,invullijst!$A$10:$M$177,2,FALSE)=\"\",\"\",VLOOKUP($L20,invullijst!$A$10:$M$177,2,FALSE))","v":0},null,{"$f":"IF(VLOOKUP($L20,invullijst!$A$10:$M$177,10,FALSE)=0,\"\",VLOOKUP($L20,invullijst!$A$10:$M$177,10,FALSE))","v":""}]
[4,{"$f":"IF($G$3=\"k\",IF(VLOOKUP($D21,invullijst!$A$10:$M$177,11,FALSE)=0,\" \",VLOOKUP($D21,invullijst!$A$10:$M$177,11,FALSE)),\"\")","v":""},{"$f":"IF(VLOOKUP(D21,invullijst!A$10:F$218,4,FALSE)=\"\",\"\",VLOOKUP(D21,invullijst!A$10:D$218,4,FALSE))","v":0},null,{"$f":"IF(VLOOKUP($D21,invullijst!$A$10:$M$177,2,FALSE)=\"\",\"\",VLOOKUP($D21,invullijst!$A$10:$M$177,2,FALSE))","v":0},null,{"$f":"IF(VLOOKUP($D21,invullijst!$A$10:$M$177,10,FALSE)=0,\"\",VLOOKUP($D21,invullijst!$A$10:$M$177,10,FALSE))","v":""},null,4,{"$f":"IF($O$3=\"k\",IF(VLOOKUP($L21,invullijst!$A$10:$M$177,11,FALSE)=0,\" \",VLOOKUP($L21,invullijst!$A$10:$M$177,11,FALSE)),\"\")","v":""},{"$f":"IF(VLOOKUP($L21,invullijst!$A$10:$M$218,4,FALSE)=\"\",\"\",VLOOKUP($L21,invullijst!$A$10:$M$218,4,FALSE))","v":0},null,{"$f":"IF(VLOOKUP($L21,invullijst!$A$10:$M$177,2,FALSE)=\"\",\"\",VLOOKUP($L21,invullijst!$A$10:$M$177,2,FALSE))","v":0},null,{"$f":"IF(VLOOKUP($L21,invullijst!$A$10:$M$177,10,FALSE)=0,\"\",VLOOKUP($L21,invullijst!$A$10:$M$177,10,FALSE))","v":""}]
["DIVERSEN / INHAAL",{"$nulls":7},"DIVERSEN / INHAAL"]
[]
["OPGELEGD (Jeugd <16 en 65+)"]
[1,{"$f":"IF($G$3=\"k\",IF(VLOOKUP($D25,invullijst!$A$10:$M$177,11,FALSE)=0,\" \",VLOOKUP($D25,invullijst!$A$10:$M$177,11,FALSE)),\"\")","v":""},{"$f":"IF(VLOOKUP(D25,invullijst!A$10:F$218,4,FALSE)=\"\",\"\",VLOOKUP(D25,invullijst!A$10:D$218,4,FALSE))","v":"65+"},307,{"$f":"IF(VLOOKUP($D25,invullijst!$A$10:$M$177,2,FALSE)=\"\",\"\",VLOOKUP($D25,invullijst!$A$10:$M$177,2,FALSE))","v":"Bert van Engelen"},null,{"$f":"IF(VLOOKUP($D25,invullijst!$A$10:$M$177,10,FALSE)=0,\"\",VLOOKUP($D25,invullijst!$A$10:$M$177,10,FALSE))","v":96},null,1,{"$f":"IF($O$3=\"k\",IF(VLOOKUP($L25,invullijst!$A$10:$M$177,11,FALSE)=0,\" \",VLOOKUP($L25,invullijst!$A$10:$M$177,11,FALSE)),\"\")","v":""},{"$f":"IF(VLOOKUP($L25,invullijst!$A$10:$M$218,4,FALSE)=\"\",\"\",VLOOKUP($L25,invullijst!$A$10:$M$218,4,FALSE))","v":"J"},109,{"$f":"IF(VLOOKUP($L25,invullijst!$A$10:$M$177,2,FALSE)=\"\",\"\",VLOOKUP($L25,invullijst!$A$10:$M$177,2,FALSE))","v":"Gijs Pullens"},null,{"$f":"IF(VLOOKUP($L25,invullijst!$A$10:$M$177,10,FALSE)=0,\"\",VLOOKUP($L25,invullijst!$A$10:$M$177,10,FALSE))","v":78}]
[2,{"$f":"IF($G$3=\"k\",IF(VLOOKUP($D26,invullijst!$A$10:$M$177,11,FALSE)=0,\" \",VLOOKUP($D26,invullijst!$A$10:$M$177,11,FALSE)),\"\")","v":""},{"$f":"IF(VLOOKUP(D26,invullijst!A$10:F$218,4,FALSE)=\"\",\"\",VLOOKUP(D26,invullijst!A$10:D$218,4,FALSE))","v":"65+"},310,{"$f":"IF(VLOOKUP($D26,invullijst!$A$10:$M$177,2,FALSE)=\"\",\"\",VLOOKUP($D26,invullijst!$A$10:$M$177,2,FALSE))","v":"Tini Boom"},null,{"$f":"IF(VLOOKUP($D26,invullijst!$A$10:$M$177,10,FALSE)=0,\"\",VLOOKUP($D26,invullijst!$A$10:$M$177,10,FALSE))","v":93},null,2,{"$f":"IF($O$3=\"k\",IF(VLOOKUP($L26,invullijst!$A$10:$M$177,11,FALSE)=0,\" \",VLOOKUP($L26,invullijst!$A$10:$M$177,11,FALSE)),\"\")","v":""},{"$f":"IF(VLOOKUP($L26,invullijst!$A$10:$M$218,4,FALSE)=\"\",\"\",VLOOKUP($L26,invullijst!$A$10:$M$218,4,FALSE))","v":"65+"},113,{"$f":"IF(VLOOKUP($L26,invullijst!$A$10:$M$177,2,FALSE)=\"\",\"\",VLOOKUP($L26,invullijst!$A$10:$M$177,2,FALSE))","v":"Kees Coppens"},null,{"$f":"IF(VLOOKUP($L26,invullijst!$A$10:$M$177,10,FALSE)=0,\"\",VLOOKUP($L26,invullijst!$A$10:$M$177,10,FALSE))","v":85}]
[3,{"$f":"IF($G$3=\"k\",IF(VLOOKUP($D27,invullijst!$A$10:$M$177,11,FALSE)=0,\" \",VLOOKUP($D27,invullijst!$A$10:$M$177,11,FALSE)),\"\")","v":""},{"$f":"IF(VLOOKUP(D27,invullijst!A$10:F$218,4,FALSE)=\"\",\"\",VLOOKUP(D27,invullijst!A$10:D$218,4,FALSE))","v":"65+"},309,{"$f":"IF(VLOOKUP($D27,invullijst!$A$10:$M$177,2,FALSE)=\"\",\"\",VLOOKUP($D27,invullijst!$A$10:$M$177,2,FALSE))","v":"René de Jong"},null,{"$f":"IF(VLOOKUP($D27,invullijst!$A$10:$M$177,10,FALSE)=0,\"\",VLOOKUP($D27,invullijst!$A$10:$M$177,10,FALSE))","v":84},null,3,{"$f":"IF($O$3=\"k\",IF(VLOOKUP($L27,invullijst!$A$10:$M$177,11,FALSE)=0,\" \",VLOOKUP($L27,invullijst!$A$10:$M$177,11,FALSE)),\"\")","v":""},{"$f":"IF(VLOOKUP($L27,invullijst!$A$10:$M$218,4,FALSE)=\"\",\"\",VLOOKUP($L27,invullijst!$A$10:$M$218,4,FALSE))","v":"65+"},111,{"$f":"IF(VLOOKUP($L27,invullijst!$A$10:$M$177,2,FALSE)=\"\",\"\",VLOOKUP($L27,invullijst!$A$10:$M$177,2,FALSE))","v":"Frans van Buul"},null,{"$f":"IF(VLOOKUP($L27,invullijst!$A$10:$M$177,10,FALSE)=0,\"\",VLOOKUP($L27,invullijst!$A$10:$M$177,10,FALSE))","v":78}]
["Totaal korps opgelegd A1",{"$nulls":5},{"$f":"SUM(G25:G27)","v":273},null,"Totaal korps opgelegd A1",{"$nulls":5},{"$f":"SUM(O25:O27)","v":241}]
[]
[1,{"$f":"IF($G$3=\"k\",IF(VLOOKUP($D30,invullijst!$A$10:$M$177,11,FALSE)=0,\" \",VLOOKUP($D30,invullijst!$A$10:$M$177,11,FALSE)),\"\")","v":""},{"$f":"IF(VLOOKUP(D30,invullijst!A$10:F$218,4,FALSE)=\"\",\"\",VLOOKUP(D30,invullijst!A$10:D$218,4,FALSE))","v":"J"},312,{"$f":"IF(VLOOKUP($D30,invullijst!$A$10:$M$177,2,FALSE)=\"\",\"\",VLOOKUP($D30,invullijst!$A$10:$M$177,2,FALSE))","v":"Floor de Jong"},null,{"$f":"IF(VLOOKUP($D30,invullijst!$A$10:$M$177,10,FALSE)=0,\"\",VLOOKUP($D30,invullijst!$A$10:$M$177,10,FALSE))","v":92},null,1,{"$f":"IF($O$3=\"k\",IF(VLOOKUP($L30,invullijst!$A$10:$M$177,11,FALSE)=0,\" \",VLOOKUP($L30,invullijst!$A$10:$M$177,11,FALSE)),\"\")","v":""},{"$f":"IF(VLOOKUP($L30,invullijst!$A$10:$M$218,4,FALSE)=\"\",\"\",VLOOKUP($L30,invullijst!$A$10:$M$218,4,FALSE))","v":0},null,{"$f":"IF(VLOOKUP($L30,invullijst!$A$10:$M$177,2,FALSE)=\"\",\"\",VLOOKUP($L30,invullijst!$A$10:$M$177,2,FALSE))","v":0},null,{"$f":"IF(VLOOKUP($L30,invullijst!$A$10:$M$177,10,FALSE)=0,\"\",VLOOKUP($L30,invullijst!$A$10:$M$177,10,FALSE))","v":""}]
[2,{"$f":"IF($G$3=\"k\",IF(VLOOKUP($D31,invullijst!$A$10:$M$177,11,FALSE)=0,\" \",VLOOKUP($D31,invullijst!$A$10:$M$177,11,FALSE)),\"\")","v":""},{"$f":"IF(VLOOKUP(D31,invullijst!A$10:F$218,4,FALSE)=\"\",\"\",VLOOKUP(D31,invullijst!A$10:D$218,4,FALSE))","v":"65+"},301,{"$f":"IF(VLOOKUP($D31,invullijst!$A$10:$M$177,2,FALSE)=\"\",\"\",VLOOKUP($D31,invullijst!$A$10:$M$177,2,FALSE))","v":"Arjen van Assem disp"},null,{"$f":"IF(VLOOKUP($D31,invullijst!$A$10:$M$177,10,FALSE)=0,\"\",VLOOKUP($D31,invullijst!$A$10:$M$177,10,FALSE))","v":89},null,2,{"$f":"IF($O$3=\"k\",IF(VLOOKUP($L31,invullijst!$A$10:$M$177,11,FALSE)=0,\" \",VLOOKUP($L31,invullijst!$A$10:$M$177,11,FALSE)),\"\")","v":""},{"$f":"IF(VLOOKUP($L31,invullijst!$A$10:$M$218,4,FALSE)=\"\",\"\",VLOOKUP($L31,invullijst!$A$10:$M$218,4,FALSE))","v":0},null,{"$f":"IF(VLOOKUP($L31,invullijst!$A$10:$M$177,2,FALSE)=\"\",\"\",VLOOKUP($L31,invullijst!$A$10:$M$177,2,FALSE))","v":0},null,{"$f":"IF(VLOOKUP($L31,invullijst!$A$10:$M$177,10,FALSE)=0,\"\",VLOOKUP($L31,invullijst!$A$10:$M$177,10,FALSE))","v":""}]
[3,{"$f":"IF($G$3=\"k\",IF(VLOOKUP($D32,invullijst!$A$10:$M$177,11,FALSE)=0,\" \",VLOOKUP($D32,invullijst!$A$10:$M$177,11,FALSE)),\"\")","v":""},{"$f":"IF(VLOOKUP(D32,invullijst!A$10:F$218,4,FALSE)=\"\",\"\",VLOOKUP(D32,invullijst!A$10:D$218,4,FALSE))","v":0},null,{"$f":"IF(VLOOKUP($D32,invullijst!$A$10:$M$177,2,FALSE)=\"\",\"\",VLOOKUP($D32,invullijst!$A$10:$M$177,2,FALSE))","v":0},null,{"$f":"IF(VLOOKUP($D32,invullijst!$A$10:$M$177,10,FALSE)=0,\"\",VLOOKUP($D32,invullijst!$A$10:$M$177,10,FALSE))","v":""},null,3,{"$f":"IF($O$3=\"k\",IF(VLOOKUP($L32,invullijst!$A$10:$M$177,11,FALSE)=0,\" \",VLOOKUP($L32,invullijst!$A$10:$M$177,11,FALSE)),\"\")","v":""},{"$f":"IF(VLOOKUP($L32,invullijst!$A$10:$M$218,4,FALSE)=\"\",\"\",VLOOKUP($L32,invullijst!$A$10:$M$218,4,FALSE))","v":0},null,{"$f":"IF(VLOOKUP($L32,invullijst!$A$10:$M$177,2,FALSE)=\"\",\"\",VLOOKUP($L32,invullijst!$A$10:$M$177,2,FALSE))","v":0},null,{"$f":"IF(VLOOKUP($L32,invullijst!$A$10:$M$177,10,FALSE)=0,\"\",VLOOKUP($L32,invullijst!$A$10:$M$177,10,FALSE))","v":""}]
["Totaal korps opgelegd A2",{"$nulls":5},{"$f":"SUM(G30:G32)","v":181},null,"Totaal korps opgelegd A2",{"$nulls":5},{"$f":"SUM(O30:O32)","v":0}]
[]
[1,{"$f":"IF($G$3=\"k\",IF(VLOOKUP($D35,invullijst!$A$10:$M$177,11,FALSE)=0,\" \",VLOOKUP($D35,invullijst!$A$10:$M$177,11,FALSE)),\"\")","v":""},{"$f":"IF(VLOOKUP(D35,invullijst!A$10:F$218,4,FALSE)=\"\",\"\",VLOOKUP(D35,invullijst!A$10:D$218,4,FALSE))","v":0},null,{"$f":"IF(VLOOKUP($D35,invullijst!$A$10:$M$177,2,FALSE)=\"\",\"\",VLOOKUP($D35,invullijst!$A$10:$M$177,2,FALSE))","v":0},null,{"$f":"IF(VLOOKUP($D35,invullijst!$A$10:$M$177,10,FALSE)=0,\"\",VLOOKUP($D35,invullijst!$A$10:$M$177,10,FALSE))","v":""},null,1,{"$f":"IF($O$3=\"k\",IF(VLOOKUP($L35,invullijst!$A$10:$M$177,11,FALSE)=0,\" \",VLOOKUP($L35,invullijst!$A$10:$M$177,11,FALSE)),\"\")","v":""},{"$f":"IF(VLOOKUP($L35,invullijst!$A$10:$M$218,4,FALSE)=\"\",\"\",VLOOKUP($L35,invullijst!$A$10:$M$218,4,FALSE))","v":0},null,{"$f":"IF(VLOOKUP($L35,invullijst!$A$10:$M$177,2,FALSE)=\"\",\"\",VLOOKUP($L35,invullijst!$A$10:$M$177,2,FALSE))","v":0},null,{"$f":"IF(VLOOKUP($L35,invullijst!$A$10:$M$177,10,FALSE)=0,\"\",VLOOKUP($L35,invullijst!$A$10:$M$177,10,FALSE))","v":""}]
[2,{"$f":"IF($G$3=\"k\",IF(VLOOKUP($D36,invullijst!$A$10:$M$177,11,FALSE)=0,\" \",VLOOKUP($D36,invullijst!$A$10:$M$177,11,FALSE)),\"\")","v":""},{"$f":"IF(VLOOKUP(D36,invullijst!A$10:F$218,4,FALSE)=\"\",\"\",VLOOKUP(D36,invullijst!A$10:D$218,4,FALSE))","v":0},null,{"$f":"IF(VLOOKUP($D36,invullijst!$A$10:$M$177,2,FALSE)=\"\",\"\",VLOOKUP($D36,invullijst!$A$10:$M$177,2,FALSE))","v":0},null,{"$f":"IF(VLOOKUP($D36,invullijst!$A$10:$M$177,10,FALSE)=0,\"\",VLOOKUP($D36,invullijst!$A$10:$M$177,10,FALSE))","v":""},null,2,{"$f":"IF($O$3=\"k\",IF(VLOOKUP($L36,invullijst!$A$10:$M$177,11,FALSE)=0,\" \",VLOOKUP($L36,invullijst!$A$10:$M$177,11,FALSE)),\"\")","v":""},{"$f":"IF(VLOOKUP($L36,invullijst!$A$10:$M$218,4,FALSE)=\"\",\"\",VLOOKUP($L36,invullijst!$A$10:$M$218,4,FALSE))","v":0},null,{"$f":"IF(VLOOKUP($L36,invullijst!$A$10:$M$177,2,FALSE)=\"\",\"\",VLOOKUP($L36,invullijst!$A$10:$M$177,2,FALSE))","v":0},null,{"$f":"IF(VLOOKUP($L36,invullijst!$A$10:$M$177,10,FALSE)=0,\"\",VLOOKUP($L36,invullijst!$A$10:$M$177,10,FALSE))","v":""}]
[3,{"$f":"IF($G$3=\"k\",IF(VLOOKUP($D37,invullijst!$A$10:$M$177,11,FALSE)=0,\" \",VLOOKUP($D37,invullijst!$A$10:$M$177,11,FALSE)),\"\")","v":""},{"$f":"IF(VLOOKUP(D37,invullijst!A$10:F$218,4,FALSE)=\"\",\"\",VLOOKUP(D37,invullijst!A$10:D$218,4,FALSE))","v":0},null,{"$f":"IF(VLOOKUP($D37,invullijst!$A$10:$M$177,2,FALSE)=\"\",\"\",VLOOKUP($D37,invullijst!$A$10:$M$177,2,FALSE))","v":0},null,{"$f":"IF(VLOOKUP($D37,invullijst!$A$10:$M$177,10,FALSE)=0,\"\",VLOOKUP($D37,invullijst!$A$10:$M$177,10,FALSE))","v":""},null,3,{"$f":"IF($O$3=\"k\",IF(VLOOKUP($L37,invullijst!$A$10:$M$177,11,FALSE)=0,\" \",VLOOKUP($L37,invullijst!$A$10:$M$177,11,FALSE)),\"\")","v":""},{"$f":"IF(VLOOKUP($L37,invullijst!$A$10:$M$218,4,FALSE)=\"\",\"\",VLOOKUP($L37,invullijst!$A$10:$M$218,4,FALSE))","v":0},null,{"$f":"IF(VLOOKUP($L37,invullijst!$A$10:$M$177,2,FALSE)=\"\",\"\",VLOOKUP($L37,invullijst!$A$10:$M$177,2,FALSE))","v":0},null,{"$f":"IF(VLOOKUP($L37,invullijst!$A$10:$M$177,10,FALSE)=0,\"\",VLOOKUP($L37,invullijst!$A$10:$M$177,10,FALSE))","v":""}]
["Totaal korps opgelegd A3",{"$nulls":5},{"$f":"SUM(G35:G37)","v":0},null,"Totaal korps opgelegd A3",{"$nulls":5},{"$f":"SUM(O35:O37)","v":0}]

{"sheet":"wedstrijd 5B","index":14,"n_rows":38,"n_cols":15,"rows_kept":38,"merged":[[0,0,0,4],[0,5,0,7],[0,8,0,14],[1,0,1,11],[1,12,1,14],[2,1,2,5],[2,9,2,13],[4,0,4,14],[5,4,5,5],[5,12,5,13],[6,4,6,5],[6,12,6,13],[7,4,7,5],[7,12,7,13],[8,4,8,5],[8,12,8,13],[9,0,9,5],[9,8,9,13],[11,4,11,5],[11,12,11,13],[12,4,12,5],[12,12,12,13],[13,4,13,5],[13,12,13,13],[14,4,14,5],[14,12,14,13],[15,0,15,5],[15,8,15,13],[17,4,17,5],[17,12,17,13],[18,4,18,5],[18,12,18,13],[19,4,19,5],[19,12,19,13],[20,4,20,5],[20,12,20,13],[21,0,21,5],[21,8,21,13],[23,0,23,14],[24,4,24,5],[24,12,24,13],[25,4,25,5],[25,12,25,13],[26,4,26,5],[26,12,26,13],[27,0,27,5],[27,8,27,13],[29,4,29,5],[29,12,29,13],[30,4,30,5],[30,12,30,13],[31,4,31,5],[31,12,31,13],[32,0,32,5],[32,8,32,13],[34,4,34,5],[34,12,34,13],[35,4,35,5],[35,12,35,13],[36,4,36,5],[36,12,36,13],[37,0,37,5],[37,8,37,13]]}
[{"$f":"invullijst!F1","v":"Organisatie"},{"$nulls":4},{"$f":"invullijst!H2","v":"2023 - 2024"},null,null,{"$f":"invullijst!F3","v":"St. Crispinus & Crispinianus Besoijen"}]
["Datum: ",{"$nulls":11},"2024-03-17"]
[4,{"$f":"IF(VLOOKUP(A3,invullijst!A1:F5,2,FALSE)=\"\",\"\",VLOOKUP(A3,invullijst!A1:F5,2,FALSE))","v":"Sint Ambrosius Haarsteeg"},{"$nulls":6},5,{"$f":"IF(VLOOKUP(I3,invullijst!A1:C5,2,FALSE)=\"\",\"\",VLOOKUP(I3,invullijst!A1:C5,2,FALSE))","v":"Sint Jan Baptist Kaatsheuvel"}]
[]
["vrijehand"]
[1,{"$f":"IF($G$3=\"k\",IF(VLOOKUP($D6,invullijst!$A$10:$M$177,11,FALSE)=0,\" \",VLOOKUP($D6,invullijst!$A$10:$M$177,11,FALSE)),\"\")","v":""},{"$f":"IF(VLOOKUP(D6,invullijst!A$10:F$218,4,FALSE)=\"\",\"\",VLOOKUP(D6,invullijst!A$10:D$218,4,FALSE))","v":"vr"},405,{"$f":"IF(VLOOKUP($D6,invullijst!$A$10:$M$177,2,FALSE)=\"\",\"\",VLOOKUP($D6,invullijst!$A$10:$M$177,2,FALSE))","v":"Jan de Vaan"},null,{"$f":"IF(VLOOKUP($D6,invullijst!$A$10:$M$177,10,FALSE)=0,\"\",VLOOKUP($D6,invullijst!$A$10:$M$177,10,FALSE))","v":83},null,1,{"$f":"IF($O$3=\"k\",IF(VLOOKUP($L6,invullijst!$A$10:$M$177,11,FALSE)=0,\" \",VLOOKUP($L6,invullijst!$A$10:$M$177,11,FALSE)),\"\")","v":""},{"$f":"IF(VLOOKUP($L6,invullijst!$A$10:$M$218,4,FALSE)=\"\",\"\",VLOOKUP($L6,invullijst!$A$10:$M$218,4,FALSE))","v":"vr"},504,{"$f":"IF(VLOOKUP($L6,invullijst!$A$10:$M$177,2,FALSE)=\"\",\"\",VLOOKUP($L6,invullijst!$A$10:$M$177,2,FALSE))","v":"Koen v/d Ven"},null,{"$f":"IF(VLOOKUP($L6,invullijst!$A$10:$M$177,10,FALSE)=0,\"\",VLOOKUP($L6,invullijst!$A$10:$M$177,10,FALSE))","v":89}]
[2,{"$f":"IF($G$3=\"k\",IF(VLOOKUP($D7,invullijst!$A$10:$M$177,11,FALSE)=0,\" \",VLOOKUP($D7,invullijst!$A$10:$M$177,11,FALSE)),\"\")","v":""},{"$f":"IF(VLOOKUP(D7,invullijst!A$10:F$218,4,FALSE)=\"\",\"\",VLOOKUP(D7,invullijst!A$10:D$218,4,FALSE))","v":"vr"},410,{"$f":"IF(VLOOKUP($D7,invullijst!$A$10:$M$177,2,FALSE)=\"\",\"\",VLOOKUP($D7,invullijst!$A$10:$M$177,2,FALSE))","v":"Tonnie Koks"},null,{"$f":"IF(VLOOKUP($D7,invullijst!$A$10:$M$177,10,FALSE)=0,\"\",VLOOKUP($D7,invullijst!$A$10:$M$177,10,FALSE))","v":84},null,2,{"$f":"IF($O$3=\"k\",IF(VLOOKUP($L7,invullijst!$A$10:$M$177,11,FALSE)=0,\" \",VLOOKUP($L7,invullijst!$A$10:$M$177,11,FALSE)),\"\")","v":""},{"$f":"IF(VLOOKUP($L7,invullijst!$A$10:$M$218,4,FALSE)=\"\",\"\",VLOOKUP($L7,invullijst!$A$10:$M$218,4,FALSE))","v":"vr"},501,{"$f":"IF(VLOOKUP($L7,invullijst!$A$10:$M$177,2,FALSE)=\"\",\"\",VLOOKUP($L7,invullijst!$A$10:$M$177,2,FALSE))","v":"Annette Vos"},null,{"$f":"IF(VLOOKUP($L7,invullijst!$A$10:$M$177,10,FALSE)=0,\"\",VLOOKUP($L7,invullijst!$A$10:$M$177,10,FALSE))","v":83}]
[3,{"$f":"IF($G$3=\"k\",IF(VLOOKUP($D8,invullijst!$A$10:$M$177,11,FALSE)=0,\" \",VLOOKUP($D8,invullijst!$A$10:$M$177,11,FALSE)),\"\")","v":""},{"$f":"IF(VLOOKUP(D8,invullijst!A$10:F$218,4,FALSE)=\"\",\"\",VLOOKUP(D8,invullijst!A$10:D$218,4,FALSE))","v":"vr"},406,{"$f":"IF(VLOOKUP($D8,invullijst!$A$10:$M$177,2,FALSE)=\"\",\"\",VLOOKUP($D8,invullijst!$A$10:$M$177,2,FALSE))","v":"Jeroen van Oss"},null,{"$f":"IF(VLOOKUP($D8,invullijst!$A$10:$M$177,10,FALSE)=0,\"\",VLOOKUP($D8,invullijst!$A$10:$M$177,10,FALSE))","v":83},null,3,{"$f":"IF($O$3=\"k\",IF(VLOOKUP($L8,invullijst!$A$10:$M$177,11,FALSE)=0,\" \",VLOOKUP($L8,invullijst!$A$10:$M$177,11,FALSE)),\"\")","v":""},{"$f":"IF(VLOOKUP($L8,invullijst!$A$10:$M$218,4,FALSE)=\"\",\"\",VLOOKUP($L8,invullijst!$A$10:$M$218,4,FALSE))","v":"vr"},508,{"$f":"IF(VLOOKUP($L8,invullijst!$A$10:$M$177,2,FALSE)=\"\",\"\",VLOOKUP($L8,invullijst!$A$10:$M$177,2,FALSE))","v":"Rowan Dobbelsteen"},null,{"$f":"IF(VLOOKUP($L8,invullijst!$A$10:$M$177,10,FALSE)=0,\"\",VLOOKUP($L8,invullijst!$A$10:$M$177,10,FALSE))","v":80}]
[4,{"$f":"IF($G$3=\"k\",IF(VLOOKUP($D9,invullijst!$A$10:$M$177,11,FALSE)=0,\" \",VLOOKUP($D9,invullijst!$A$10:$M$177,11,FALSE)),\"\")","v":""},{"$f":"IF(VLOOKUP(D9,invullijst!A$10:F$218,4,FALSE)=\"\",\"\",VLOOKUP(D9,invullijst!A$10:D$218,4,FALSE))","v":"vr"},408,{"$f":"IF(VLOOKUP($D9,invullijst!$A$10:$M$177,2,FALSE)=\"\",\"\",VLOOKUP($D9,invullijst!$A$10:$M$177,2,FALSE))","v":"Rudy van Falier"},null,{"$f":"IF(VLOOKUP($D9,invullijst!$A$10:$M$177,10,FALSE)=0,\"\",VLOOKUP($D9,invullijst!$A$10:$M$177,10,FALSE))","v":85},null,4,{"$f":"IF($O$3=\"k\",IF(VLOOKUP($L9,invullijst!$A$10:$M$177,11,FALSE)=0,\" \",VLOOKUP($L9,invullijst!$A$10:$M$177,11,FALSE)),\"\")","v":""},{"$f":"IF(VLOOKUP($L9,invullijst!$A$10:$M$218,4,FALSE)=\"\",\"\",VLOOKUP($L9,invullijst!$A$10:$M$218,4,FALSE))","v":"vr"},507,{"$f":"IF(VLOOKUP($L9,invullijst!$A$10:$M$177,2,FALSE)=\"\",\"\",VLOOKUP($L9,invullijst!$A$10:$M$177,2,FALSE))","v":"Michael Blaauwbroek"},null,{"$f":"IF(VLOOKUP($L9,invullijst!$A$10:$M$177,10,FALSE)=0,\"\",VLOOKUP($L9,invullijst!$A$10:$M$177,10,FALSE))","v":70}]
["Totaal A korps",{"$nulls":5},{"$f":"SUM(G6:G9)","v":335},null,"Totaal A korps",{"$nulls":5},{"$f":"SUM(O6:O9)","v":322}]
[]
[1,{"$f":"IF($G$3=\"k\",IF(VLOOKUP($D12,invullijst!$A$10:$M$177,11,FALSE)=0,\" \",VLOOKUP($D12,invullijst!$A$10:$M$177,11,FALSE)),\"\")","v":""},{"$f":"IF(VLOOKUP(D12,invullijst!A$10:F$218,4,FALSE)=\"\",\"\",VLOOKUP(D12,invullijst!A$10:D$218,4,FALSE))","v":"vr"},407,{"$f":"IF(VLOOKUP($D12,invullijst!$A$10:$M$177,2,FALSE)=\"\",\"\",VLOOKUP($D12,invullijst!$A$10:$M$177,2,FALSE))","v":"Justin van Son"},null,{"$f":"IF(VLOOKUP($D12,invullijst!$A$10:$M$177,10,FALSE)=0,\"\",VLOOKUP($D12,invullijst!$A$10:$M$177,10,FALSE))","v":80},null,1,{"$f":"IF($O$3=\"k\",IF(VLOOKUP($L12,invullijst!$A$10:$M$177,11,FALSE)=0,\" \",VLOOKUP($L12,invullijst!$A$10:$M$177,11,FALSE)),\"\")","v":""},{"$f":"IF(VLOOKUP($L12,invullijst!$A$10:$M$218,4,FALSE)=\"\",\"\",VLOOKUP($L12,invullijst!$A$10:$M$218,4,FALSE))","v":"vr"},506,{"$f":"IF(VLOOKUP($L12,invullijst!$A$10:$M$177,2,FALSE)=\"\",\"\",VLOOKUP($L12,invullijst!$A$10:$M$177,2,FALSE))","v":"Maikel Monden"},null,{"$f":"IF(VLOOKUP($L12,invullijst!$A$10:$M$177,10,FALSE)=0,\"\",VLOOKUP($L12,invullijst!$A$10:$M$177,10,FALSE))","v":71}]
[2,{"$f":"IF($G$3=\"k\",IF(VLOOKUP($D13,invullijst!$A$10:$M$177,11,FALSE)=0,\" \",VLOOKUP($D13,invullijst!$A$10:$M$177,11,FALSE)),\"\")","v":""},{"$f":"IF(VLOOKUP(D13,invullijst!A$10:F$218,4,FALSE)=\"\",\"\",VLOOKUP(D13,invullijst!A$10:D$218,4,FALSE))","v":"vr"},402,{"$f":"IF(VLOOKUP($D13,invullijst!$A$10:$M$177,2,FALSE)=\"\",\"\",VLOOKUP($D13,invullijst!$A$10:$M$177,2,FALSE))","v":"Daniëlle v/d Lee"},null,{"$f":"IF(VLOOKUP($D13,invullijst!$A$10:$M$177,10,FALSE)=0,\"\",VLOOKUP($D13,invullijst!$A$10:$M$177,10,FALSE))","v":83},null,2,{"$f":"IF($O$3=\"k\",IF(VLOOKUP($L13,invullijst!$A$10:$M$177,11,FALSE)=0,\" \",VLOOKUP($L13,invullijst!$A$10:$M$177,11,FALSE)),\"\")","v":""},{"$f":"IF(VLOOKUP($L13,invullijst!$A$10:$M$218,4,FALSE)=\"\",\"\",VLOOKUP($L13,invullijst!$A$10:$M$218,4,FALSE))","v":"vr"},502,{"$f":"IF(VLOOKUP($L13,invullijst!$A$10:$M$177,2,FALSE)=\"\",\"\",VLOOKUP($L13,invullijst!$A$10:$M$177,2,FALSE))","v":"Diny Vos"},null,{"$f":"IF(VLOOKUP($L13,invullijst!$A$10:$M$177,10,FALSE)=0,\"\",VLOOKUP($L13,invullijst!$A$10:$M$177,10,FALSE))","v":71}]
[3,{"$f":"IF($G$3=\"k\",IF(VLOOKUP($D14,invullijst!$A$10:$M$177,11,FALSE)=0,\" \",VLOOKUP($D14,invullijst!$A$10:$M$177,11,FALSE)),\"\")","v":""},{"$f":"IF(VLOOKUP(D14,invullijst!A$10:F$218,4,FALSE)=\"\",\"\",VLOOKUP(D14,invullijst!A$10:D$218,4,FALSE))","v":0},null,{"$f":"IF(VLOOKUP($D14,invullijst!$A$10:$M$177,2,FALSE)=\"\",\"\",VLOOKUP($D14,invullijst!$A$10:$M$177,2,FALSE))","v":0},null,{"$f":"IF(VLOOKUP($D14,invullijst!$A$10:$M$177,10,FALSE)=0,\"\",VLOOKUP($D14,invullijst!$A$10:$M$177,10,FALSE))","v":""},null,3,{"$f":"IF($O$3=\"k\",IF(VLOOKUP($L14,invullijst!$A$10:$M$177,11,FALSE)=0,\" \",VLOOKUP($L14,invullijst!$A$10:$M$177,11,FALSE)),\"\")","v":""},{"$f":"IF(VLOOKUP($L14,invullijst!$A$10:$M$218,4,FALSE)=\"\",\"\",VLOOKUP($L14,invullijst!$A$10:$M$218,4,FALSE))","v":"vr"},512,{"$f":"IF(VLOOKUP($L14,invullijst!$A$10:$M$177,2,FALSE)=\"\",\"\",VLOOKUP($L14,invullijst!$A$10:$M$177,2,FALSE))","v":"Hans Bergakker"},null,{"$f":"IF(VLOOKUP($L14,invullijst!$A$10:$M$177,10,FALSE)=0,\"\",VLOOKUP($L14,invullijst!$A$10:$M$177,10,FALSE))","v":69}]
[4,{"$f":"IF($G$3=\"k\",IF(VLOOKUP($D15,invullijst!$A$10:$M$177,11,FALSE)=0,\" \",VLOOKUP($D15,invullijst!$A$10:$M$177,11,FALSE)),\"\")","v":""},{"$f":"IF(VLOOKUP(D15,invullijst!A$10:F$218,4,FALSE)=\"\",\"\",VLOOKUP(D15,invullijst!A$10:D$218,4,FALSE))","v":0},null,{"$f":"IF(VLOOKUP($D15,invullijst!$A$10:$M$177,2,FALSE)=\"\",\"\",VLOOKUP($D15,invullijst!$A$10:$M$177,2,FALSE))","v":0},null,{"$f":"IF(VLOOKUP($D15,invullijst!$A$10:$M$177,10,FALSE)=0,\"\",VLOOKUP($D15,invullijst!$A$10:$M$177,10,FALSE))","v":""},null,4,{"$f":"IF($O$3=\"k\",IF(VLOOKUP($L15,invullijst!$A$10:$M$177,11,FALSE)=0,\" \",VLOOKUP($L15,invullijst!$A$10:$M$177,11,FALSE)),\"\")","v":""},{"$f":"IF(VLOOKUP($L15,invullijst!$A$10:$M$218,4,FALSE)=\"\",\"\",VLOOKUP($L15,invullijst!$A$10:$M$218,4,FALSE))","v":0},null,{"$f":"IF(VLOOKUP($L15,invullijst!$A$10:$M$177,2,FALSE)=\"\",\"\",VLOOKUP($L15,invullijst!$A$10:$M$177,2,FALSE))","v":0},null,{"$f":"IF(VLOOKUP($L15,invullijst!$A$10:$M$177,10,FALSE)=0,\"\",VLOOKUP($L15,invullijst!$A$10:$M$177,10,FALSE))","v":""}]
["Totaal B1 korps",{"$nulls":5},{"$f":"SUM(G12:G15)","v":163},null,"Totaal B1 korps",{"$nulls":5},{"$f":"SUM(O12:O15)","v":211}]
[]
[1,{"$f":"IF($G$3=\"k\",IF(VLOOKUP($D18,invullijst!$A$10:$M$177,11,FALSE)=0,\" \",VLOOKUP($D18,invullijst!$A$10:$M$177,11,FALSE)),\"\")","v":""},{"$f":"IF(VLOOKUP(D18,invullijst!A$10:F$218,4,FALSE)=\"\",\"\",VLOOKUP(D18,invullijst!A$10:D$218,4,FALSE))","v":0},null,{"$f":"IF(VLOOKUP($D18,invullijst!$A$10:$M$177,2,FALSE)=\"\",\"\",VLOOKUP($D18,invullijst!$A$10:$M$177,2,FALSE))","v":0},null,{"$f":"IF(VLOOKUP($D18,invullijst!$A$10:$M$177,10,FALSE)=0,\"\",VLOOKUP($D18,invullijst!$A$10:$M$177,10,FALSE))","v":""},null,1,{"$f":"IF($O$3=\"k\",IF(VLOOKUP($L18,invullijst!$A$10:$M$177,11,FALSE)=0,\" \",VLOOKUP($L18,invullijst!$A$10:$M$177,11,FALSE)),\"\")","v":""},{"$f":"IF(VLOOKUP($L18,invullijst!$A$10:$M$218,4,FALSE)=\"\",\"\",VLOOKUP($L18,invullijst!$A$10:$M$218,4,FALSE))","v":0},null,{"$f":"IF(VLOOKUP($L18,invullijst!$A$10:$M$177,2,FALSE)=\"\",\"\",VLOOKUP($L18,invullijst!$A$10:$M$177,2,FALSE))","v":0},null,{"$f":"IF(VLOOKUP($L18,invullijst!$A$10:$M$177,10,FALSE)=0,\"\",VLOOKUP($L18,invullijst!$A$10:$M$177,10,FALSE))","v":""}]
[2,{"$f":"IF($G$3=\"k\",IF(VLOOKUP($D19,invullijst!$A$10:$M$177,11,FALSE)=0,\" \",VLOOKUP($D19,invullijst!$A$10:$M$177,11,FALSE)),\"\")","v":""},{"$f":"IF(VLOOKUP(D19,invullijst!A$10:F$218,4,FALSE)=\"\",\"\",VLOOKUP(D19,invullijst!A$10:D$218,4,FALSE))","v":0},null,{"$f":"IF(VLOOKUP($D19,invullijst!$A$10:$M$177,2,FALSE)=\"\",\"\",VLOOKUP($D19,invullijst!$A$10:$M$177,2,FALSE))","v":0},null,{"$f":"IF(VLOOKUP($D19,invullijst!$A$10:$M$177,10,FALSE)=0,\"\",VLOOKUP($D19,invullijst!$A$10:$M$177,10,FALSE))","v":""},null,2,{"$f":"IF($O$3=\"k\",IF(VLOOKUP($L19,invullijst!$A$10:$M$177,11,FALSE)=0,\" \",VLOOKUP($L19,invullijst!$A$10:$M$177,11,FALSE)),\"\")","v":""},{"$f":"IF(VLOOKUP($L19,invullijst!$A$10:$M$218,4,FALSE)=\"\",\"\",VLOOKUP($L19,invullijst!$A$10:$M$218,4,FALSE))","v":0},null,{"$f":"IF(VLOOKUP($L19,invullijst!$A$10:$M$177,2,FALSE)=\"\",\"\",VLOOKUP($L19,invullijst!$A$10:$M$177,2,FALSE))","v":0},null,{"$f":"IF(VLOOKUP($L19,invullijst!$A$10:$M$177,10,FALSE)=0,\"\",VLOOKUP($L19,invullijst!$A$10:$M$177,10,FALSE))","v":""}]
[3,{"$f":"IF($G$3=\"k\",IF(VLOOKUP($D20,invullijst!$A$10:$M$177,11,FALSE)=0,\" \",VLOOKUP($D20,invullijst!$A$10:$M$177,11,FALSE)),\"\")","v":""},{"$f":"IF(VLOOKUP(D20,invullijst!A$10:F$218,4,FALSE)=\"\",\"\",VLOOKUP(D20,invullijst!A$10:D$218,4,FALSE))","v":0},null,{"$f":"IF(VLOOKUP($D20,invullijst!$A$10:$M$177,2,FALSE)=\"\",\"\",VLOOKUP($D20,invullijst!$A$10:$M$177,2,FALSE))","v":0},null,{"$f":"IF(VLOOKUP($D20,invullijst!$A$10:$M$177,10,FALSE)=0,\"\",VLOOKUP($D20,invullijst!$A$10:$M$177,10,FALSE))","v":""},null,3,{"$f":"IF($O$3=\"k\",IF(VLOOKUP($L20,invullijst!$A$10:$M$177,11,FALSE)=0,\" \",VLOOKUP($L20,invullijst!$A$10:$M$177,11,FALSE)),\"\")","v":""},{"$f":"IF(VLOOKUP($L20,invullijst!$A$10:$M$218,4,FALSE)=\"\",\"\",VLOOKUP($L20,invullijst!$A$10:$M$218,4,FALSE))","v":0},null,{"$f":"IF(VLOOKUP($L20,invullijst!$A$10:$M$177,2,FALSE)=\"\",\"\",VLOOKUP($L20,invullijst!$A$10:$M$177,2,FALSE))","v":0},null,{"$f":"IF(VLOOKUP($L20,invullijst!$A$10:$M$177,10,FALSE)=0,\"\",VLOOKUP($L20,invullijst!$A$10:$M$177,10,FALSE))","v":""}]
[4,{"$f":"IF($G$3=\"k\",IF(VLOOKUP($D21,invullijst!$A$10:$M$177,11,FALSE)=0,\" \",VLOOKUP($D21,invullijst!$A$10:$M$177,11,FALSE)),\"\")","v":""},{"$f":"IF(VLOOKUP(D21,invullijst!A$10:F$218,4,FALSE)=\"\",\"\",VLOOKUP(D21,invullijst!A$10:D$218,4,FALSE))","v":0},null,{"$f":"IF(VLOOKUP($D21,invullijst!$A$10:$M$177,2,FALSE)=\"\",\"\",VLOOKUP($D21,invullijst!$A$10:$M$177,2,FALSE))","v":0},null,{"$f":"IF(VLOOKUP($D21,invullijst!$A$10:$M$177,10,FALSE)=0,\"\",VLOOKUP($D21,invullijst!$A$10:$M$177,10,FALSE))","v":""},null,4,{"$f":"IF($O$3=\"k\",IF(VLOOKUP($L21,invullijst!$A$10:$M$177,11,FALSE)=0,\" \",VLOOKUP($L21,invullijst!$A$10:$M$177,11,FALSE)),\"\")","v":""},{"$f":"IF(VLOOKUP($L21,invullijst!$A$10:$M$218,4,FALSE)=\"\",\"\",VLOOKUP($L21,invullijst!$A$10:$M$218,4,FALSE))","v":0},null,{"$f":"IF(VLOOKUP($L21,invullijst!$A$10:$M$177,2,FALSE)=\"\",\"\",VLOOKUP($L21,invullijst!$A$10:$M$177,2,FALSE))","v":0},null,{"$f":"IF(VLOOKUP($L21,invullijst!$A$10:$M$177,10,FALSE)=0,\"\",VLOOKUP($L21,invullijst!$A$10:$M$177,10,FALSE))","v":""}]
["DIVERSEN / INHAAL",{"$nulls":7},"DIVERSEN / INHAAL"]
[]
["OPGELEGD (Jeugd <16 en 65+)"]
[1,{"$f":"IF($G$3=\"k\",IF(VLOOKUP($D25,invullijst!$A$10:$M$177,11,FALSE)=0,\" \",VLOOKUP($D25,invullijst!$A$10:$M$177,11,FALSE)),\"\")","v":""},{"$f":"IF(VLOOKUP(D25,invullijst!A$10:F$218,4,FALSE)=\"\",\"\",VLOOKUP(D25,invullijst!A$10:D$218,4,FALSE))","v":"65+"},404,{"$f":"IF(VLOOKUP($D25,invullijst!$A$10:$M$177,2,FALSE)=\"\",\"\",VLOOKUP($D25,invullijst!$A$10:$M$177,2,FALSE))","v":"Gerard van Beurden"},null,{"$f":"IF(VLOOKUP($D25,invullijst!$A$10:$M$177,10,FALSE)=0,\"\",VLOOKUP($D25,invullijst!$A$10:$M$177,10,FALSE))","v":94},null,1,{"$f":"IF($O$3=\"k\",IF(VLOOKUP($L25,invullijst!$A$10:$M$177,11,FALSE)=0,\" \",VLOOKUP($L25,invullijst!$A$10:$M$177,11,FALSE)),\"\")","v":""},{"$f":"IF(VLOOKUP($L25,invullijst!$A$10:$M$218,4,FALSE)=\"\",\"\",VLOOKUP($L25,invullijst!$A$10:$M$218,4,FALSE))","v":"65+"},516,{"$f":"IF(VLOOKUP($L25,invullijst!$A$10:$M$177,2,FALSE)=\"\",\"\",VLOOKUP($L25,invullijst!$A$10:$M$177,2,FALSE))","v":"Henry Bergakker disp"},null,{"$f":"IF(VLOOKUP($L25,invullijst!$A$10:$M$177,10,FALSE)=0,\"\",VLOOKUP($L25,invullijst!$A$10:$M$177,10,FALSE))","v":93}]
[2,{"$f":"IF($G$3=\"k\",IF(VLOOKUP($D26,invullijst!$A$10:$M$177,11,FALSE)=0,\" \",VLOOKUP($D26,invullijst!$A$10:$M$177,11,FALSE)),\"\")","v":""},{"$f":"IF(VLOOKUP(D26,invullijst!A$10:F$218,4,FALSE)=\"\",\"\",VLOOKUP(D26,invullijst!A$10:D$218,4,FALSE))","v":"65+"},401,{"$f":"IF(VLOOKUP($D26,invullijst!$A$10:$M$177,2,FALSE)=\"\",\"\",VLOOKUP($D26,invullijst!$A$10:$M$177,2,FALSE))","v":"Frans van Beurden"},null,{"$f":"IF(VLOOKUP($D26,invullijst!$A$10:$M$177,10,FALSE)=0,\"\",VLOOKUP($D26,invullijst!$A$10:$M$177,10,FALSE))","v":94},null,2,{"$f":"IF($O$3=\"k\",IF(VLOOKUP($L26,invullijst!$A$10:$M$177,11,FALSE)=0,\" \",VLOOKUP($L26,invullijst!$A$10:$M$177,11,FALSE)),\"\")","v":""},{"$f":"IF(VLOOKUP($L26,invullijst!$A$10:$M$218,4,FALSE)=\"\",\"\",VLOOKUP($L26,invullijst!$A$10:$M$218,4,FALSE))","v":"65+"},509,{"$f":"IF(VLOOKUP($L26,invullijst!$A$10:$M$177,2,FALSE)=\"\",\"\",VLOOKUP($L26,invullijst!$A$10:$M$177,2,FALSE))","v":"Adwan de Pinth"},null,{"$f":"IF(VLOOKUP($L26,invullijst!$A$10:$M$177,10,FALSE)=0,\"\",VLOOKUP($L26,invullijst!$A$10:$M$177,10,FALSE))","v":92}]
[3,{"$f":"IF($G$3=\"k\",IF(VLOOKUP($D27,invullijst!$A$10:$M$177,11,FALSE)=0,\" \",VLOOKUP($D27,invullijst!$A$10:$M$177,11,FALSE)),\"\")","v":""},{"$f":"IF(VLOOKUP(D27,invullijst!A$10:F$218,4,FALSE)=\"\",\"\",VLOOKUP(D27,invullijst!A$10:D$218,4,FALSE))","v":"65+"},413,{"$f":"IF(VLOOKUP($D27,invullijst!$A$10:$M$177,2,FALSE)=\"\",\"\",VLOOKUP($D27,invullijst!$A$10:$M$177,2,FALSE))","v":"Frans Mommersteeg"},null,{"$f":"IF(VLOOKUP($D27,invullijst!$A$10:$M$177,10,FALSE)=0,\"\",VLOOKUP($D27,invullijst!$A$10:$M$177,10,FALSE))","v":94},null,3,{"$f":"IF($O$3=\"k\",IF(VLOOKUP($L27,invullijst!$A$10:$M$177,11,FALSE)=0,\" \",VLOOKUP($L27,invullijst!$A$10:$M$177,11,FALSE)),\"\")","v":""},{"$f":"IF(VLOOKUP($L27,invullijst!$A$10:$M$218,4,FALSE)=\"\",\"\",VLOOKUP($L27,invullijst!$A$10:$M$218,4,FALSE))","v":"65+"},511,{"$f":"IF(VLOOKUP($L27,invullijst!$A$10:$M$177,2,FALSE)=\"\",\"\",VLOOKUP($L27,invullijst!$A$10:$M$177,2,FALSE))","v":"Ton Stans"},null,{"$f":"IF(VLOOKUP($L27,invullijst!$A$10:$M$177,10,FALSE)=0,\"\",VLOOKUP($L27,invullijst!$A$10:$M$177,10,FALSE))","v":84}]
["Totaal korps opgelegd A1",{"$nulls":5},{"$f":"SUM(G25:G27)","v":282},null,"Totaal korps opgelegd A1",{"$nulls":5},{"$f":"SUM(O25:O27)","v":269}]
[]
[1,{"$f":"IF($G$3=\"k\",IF(VLOOKUP($D30,invullijst!$A$10:$M$177,11,FALSE)=0,\" \",VLOOKUP($D30,invullijst!$A$10:$M$177,11,FALSE)),\"\")","v":""},{"$f":"IF(VLOOKUP(D30,invullijst!A$10:F$218,4,FALSE)=\"\",\"\",VLOOKUP(D30,invullijst!A$10:D$218,4,FALSE))","v":"65+"},412,{"$f":"IF(VLOOKUP($D30,invullijst!$A$10:$M$177,2,FALSE)=\"\",\"\",VLOOKUP($D30,invullijst!$A$10:$M$177,2,FALSE))","v":"Francien v/d Wiel"},null,{"$f":"IF(VLOOKUP($D30,invullijst!$A$10:$M$177,10,FALSE)=0,\"\",VLOOKUP($D30,invullijst!$A$10:$M$177,10,FALSE))","v":89},null,1,{"$f":"IF($O$3=\"k\",IF(VLOOKUP($L30,invullijst!$A$10:$M$177,11,FALSE)=0,\" \",VLOOKUP($L30,invullijst!$A$10:$M$177,11,FALSE)),\"\")","v":""},{"$f":"IF(VLOOKUP($L30,invullijst!$A$10:$M$218,4,FALSE)=\"\",\"\",VLOOKUP($L30,invullijst!$A$10:$M$218,4,FALSE))","v":"65+"},505,{"$f":"IF(VLOOKUP($L30,invullijst!$A$10:$M$177,2,FALSE)=\"\",\"\",VLOOKUP($L30,invullijst!$A$10:$M$177,2,FALSE))","v":"Leo Wagemakers"},null,{"$f":"IF(VLOOKUP($L30,invullijst!$A$10:$M$177,10,FALSE)=0,\"\",VLOOKUP($L30,invullijst!$A$10:$M$177,10,FALSE))","v":10}]
[2,{"$f":"IF($G$3=\"k\",IF(VLOOKUP($D31,invullijst!$A$10:$M$177,11,FALSE)=0,\" \",VLOOKUP($D31,invullijst!$A$10:$M$177,11,FALSE)),\"\")","v":""},{"$f":"IF(VLOOKUP(D31,invullijst!A$10:F$218,4,FALSE)=\"\",\"\",VLOOKUP(D31,invullijst!A$10:D$218,4,FALSE))","v":"65+"},403,{"$f":"IF(VLOOKUP($D31,invullijst!$A$10:$M$177,2,FALSE)=\"\",\"\",VLOOKUP($D31,invullijst!$A$10:$M$177,2,FALSE))","v":"Dorien de Kort"},null,{"$f":"IF(VLOOKUP($D31,invullijst!$A$10:$M$177,10,FALSE)=0,\"\",VLOOKUP($D31,invullijst!$A$10:$M$177,10,FALSE))","v":87},null,2,{"$f":"IF($O$3=\"k\",IF(VLOOKUP($L31,invullijst!$A$10:$M$177,11,FALSE)=0,\" \",VLOOKUP($L31,invullijst!$A$10:$M$177,11,FALSE)),\"\")","v":""},{"$f":"IF(VLOOKUP($L31,invullijst!$A$10:$M$218,4,FALSE)=\"\",\"\",VLOOKUP($L31,invullijst!$A$10:$M$218,4,FALSE))","v":"65+"},514,{"$f":"IF(VLOOKUP($L31,invullijst!$A$10:$M$177,2,FALSE)=\"\",\"\",VLOOKUP($L31,invullijst!$A$10:$M$177,2,FALSE))","v":"Toon Ophorst"},null,{"$f":"IF(VLOOKUP($L31,invullijst!$A$10:$M$177,10,FALSE)=0,\"\",VLOOKUP($L31,invullijst!$A$10:$M$177,10,FALSE))","v":63}]
[3,{"$f":"IF($G$3=\"k\",IF(VLOOKUP($D32,invullijst!$A$10:$M$177,11,FALSE)=0,\" \",VLOOKUP($D32,invullijst!$A$10:$M$177,11,FALSE)),\"\")","v":""},{"$f":"IF(VLOOKUP(D32,invullijst!A$10:F$218,4,FALSE)=\"\",\"\",VLOOKUP(D32,invullijst!A$10:D$218,4,FALSE))","v":"65+"},415,{"$f":"IF(VLOOKUP($D32,invullijst!$A$10:$M$177,2,FALSE)=\"\",\"\",VLOOKUP($D32,invullijst!$A$10:$M$177,2,FALSE))","v":"Wim de Gouw"},null,{"$f":"IF(VLOOKUP($D32,invullijst!$A$10:$M$177,10,FALSE)=0,\"\",VLOOKUP($D32,invullijst!$A$10:$M$177,10,FALSE))","v":95},null,3,{"$f":"IF($O$3=\"k\",IF(VLOOKUP($L32,invullijst!$A$10:$M$177,11,FALSE)=0,\" \",VLOOKUP($L32,invullijst!$A$10:$M$177,11,FALSE)),\"\")","v":""},{"$f":"IF(VLOOKUP($L32,invullijst!$A$10:$M$218,4,FALSE)=\"\",\"\",VLOOKUP($L32,invullijst!$A$10:$M$218,4,FALSE))","v":0},null,{"$f":"IF(VLOOKUP($L32,invullijst!$A$10:$M$177,2,FALSE)=\"\",\"\",VLOOKUP($L32,invullijst!$A$10:$M$177,2,FALSE))","v":0},null,{"$f":"IF(VLOOKUP($L32,invullijst!$A$10:$M$177,10,FALSE)=0,\"\",VLOOKUP($L32,invullijst!$A$10:$M$177,10,FALSE))","v":""}]
["Totaal korps opgelegd A2",{"$nulls":5},{"$f":"SUM(G30:G32)","v":271},null,"Totaal korps opgelegd A2",{"$nulls":5},{"$f":"SUM(O30:O32)","v":73}]
[]
[1,{"$f":"IF($G$3=\"k\",IF(VLOOKUP($D35,invullijst!$A$10:$M$177,11,FALSE)=0,\" \",VLOOKUP($D35,invullijst!$A$10:$M$177,11,FALSE)),\"\")","v":""},{"$f":"IF(VLOOKUP(D35,invullijst!A$10:F$218,4,FALSE)=\"\",\"\",VLOOKUP(D35,invullijst!A$10:D$218,4,FALSE))","v":0},null,{"$f":"IF(VLOOKUP($D35,invullijst!$A$10:$M$177,2,FALSE)=\"\",\"\",VLOOKUP($D35,invullijst!$A$10:$M$177,2,FALSE))","v":0},null,{"$f":"IF(VLOOKUP($D35,invullijst!$A$10:$M$177,10,FALSE)=0,\"\",VLOOKUP($D35,invullijst!$A$10:$M$177,10,FALSE))","v":""},null,1,{"$f":"IF($O$3=\"k\",IF(VLOOKUP($L35,invullijst!$A$10:$M$177,11,FALSE)=0,\" \",VLOOKUP($L35,invullijst!$A$10:$M$177,11,FALSE)),\"\")","v":""},{"$f":"IF(VLOOKUP($L35,invullijst!$A$10:$M$218,4,FALSE)=\"\",\"\",VLOOKUP($L35,invullijst!$A$10:$M$218,4,FALSE))","v":0},null,{"$f":"IF(VLOOKUP($L35,invullijst!$A$10:$M$177,2,FALSE)=\"\",\"\",VLOOKUP($L35,invullijst!$A$10:$M$177,2,FALSE))","v":0},null,{"$f":"IF(VLOOKUP($L35,invullijst!$A$10:$M$177,10,FALSE)=0,\"\",VLOOKUP($L35,invullijst!$A$10:$M$177,10,FALSE))","v":""}]
[2,{"$f":"IF($G$3=\"k\",IF(VLOOKUP($D36,invullijst!$A$10:$M$177,11,FALSE)=0,\" \",VLOOKUP($D36,invullijst!$A$10:$M$177,11,FALSE)),\"\")","v":""},{"$f":"IF(VLOOKUP(D36,invullijst!A$10:F$218,4,FALSE)=\"\",\"\",VLOOKUP(D36,invullijst!A$10:D$218,4,FALSE))","v":0},null,{"$f":"IF(VLOOKUP($D36,invullijst!$A$10:$M$177,2,FALSE)=\"\",\"\",VLOOKUP($D36,invullijst!$A$10:$M$177,2,FALSE))","v":0},null,{"$f":"IF(VLOOKUP($D36,invullijst!$A$10:$M$177,10,FALSE)=0,\"\",VLOOKUP($D36,invullijst!$A$10:$M$177,10,FALSE))","v":""},null,2,{"$f":"IF($O$3=\"k\",IF(VLOOKUP($L36,invullijst!$A$10:$M$177,11,FALSE)=0,\" \",VLOOKUP($L36,invullijst!$A$10:$M$177,11,FALSE)),\"\")","v":""},{"$f":"IF(VLOOKUP($L36,invullijst!$A$10:$M$218,4,FALSE)=\"\",\"\",VLOOKUP($L36,invullijst!$A$10:$M$218,4,FALSE))","v":0},null,{"$f":"IF(VLOOKUP($L36,invullijst!$A$10:$M$177,2,FALSE)=\"\",\"\",VLOOKUP($L36,invullijst!$A$10:$M$177,2,FALSE))","v":0},null,{"$f":"IF(VLOOKUP($L36,invullijst!$A$10:$M$177,10,FALSE)=0,\"\",VLOOKUP($L36,invullijst!$A$10:$M$177,10,FALSE))","v":""}]
[3,{"$f":"IF($G$3=\"k\",IF(VLOOKUP($D37,invullijst!$A$10:$M$177,11,FALSE)=0,\" \",VLOOKUP($D37,invullijst!$A$10:$M$177,11,FALSE)),\"\")","v":""},{"$f":"IF(VLOOKUP(D37,invullijst!A$10:F$218,4,FALSE)=\"\",\"\",VLOOKUP(D37,invullijst!A$10:D$218,4,FALSE))","v":0},null,{"$f":"IF(VLOOKUP($D37,invullijst!$A$10:$M$177,2,FALSE)=\"\",\"\",VLOOKUP($D37,invullijst!$A$10:$M$177,2,FALSE))","v":0},null,{"$f":"IF(VLOOKUP($D37,invullijst!$A$10:$M$177,10,FALSE)=0,\"\",VLOOKUP($D37,invullijst!$A$10:$M$177,10,FALSE))","v":""},null,3,{"$f":"IF($O$3=\"k\",IF(VLOOKUP($L37,invullijst!$A$10:$M$177,11,FALSE)=0,\" \",VLOOKUP($L37,invullijst!$A$10:$M$177,11,FALSE)),\"\")","v":""},{"$f":"IF(VLOOKUP($L37,invullijst!$A$10:$M$218,4,FALSE)=\"\",\"\",VLOOKUP($L37,invullijst!$A$10:$M$218,4,FALSE))","v":0},null,{"$f":"IF(VLOOKUP($L37,invullijst!$A$10:$M$177,2,FALSE)=\"\",\"\",VLOOKUP($L37,invullijst!$A$10:$M$177,2,FALSE))","v":0},null,{"$f":"IF(VLOOKUP($L37,invullijst!$A$10:$M$177,10,FALSE)=0,\"\",VLOOKUP($L37,invullijst!$A$10:$M$177,10,FALSE))","v":""}]
["Totaal korps opgelegd A3",{"$nulls":5},{"$f":"SUM(G35:G37)","v":0},null,"Totaal korps opgelegd A3",{"$nulls":5},{"$f":"SUM(O35:O37)","v":0}]

{"sheet":"blanco formulier","index":15,"n_rows":38,"n_cols":9,"rows_kept":38,"merged":[[0,0,0,4],[0,5,0,7],[0,8,0,14],[1,0,1,11],[1,12,1,14],[2,1,2,6],[2,9,2,14],[4,0,4,14],[5,4,5,5],[5,12,5,13],[6,4,6,5],[6,12,6,13],[7,4,7,5],[7,12,7,13],[8,4,8,5],[8,12,8,13],[9,0,9,5],[9,8,9,13],[11,4,11,5],[11,12,11,13],[12,4,12,5],[12,12,12,13],[13,4,13,5],[13,12,13,13],[14,4,14,5],[14,12,14,13],[15,0,15,5],[15,8,15,13],[17,4,17,5],[17,12,17,13],[18,4,18,5],[18,12,18,13],[19,4,19,5],[19,12,19,13],[20,4,20,5],[20,12,20,13],[21,0,21,5],[21,8,21,13],[23,0,23,14],[24,4,24,5],[24,12,24,13],[25,4,25,5],[25,12,25,13],[26,4,26,5],[26,12,26,13],[27,0,27,5],[27,8,27,13],[29,4,29,5],[29,12,29,13],[30,4,30,5],[30,12,30,13],[31,4,31,5],[31,12,31,13],[32,0,32,5],[32,8,32,13],[34,4,34,5],[34,12,34,13],[35,4,35,5],[35,12,35,13],[36,4,36,5],[36,12,36,13],[37,0,37,5],[37,8,37,13]]}
[{"$f":"invullijst!F1","v":"Organisatie"},{"$nulls":4},{"$f":"invullijst!H2","v":"2023 - 2024"},null,null,{"$f":"invullijst!F3","v":"St. Crispinus & Crispinianus Besoijen"}]
["Datum: "]
[]
[]
["vrijehand"]
[1,{"$nulls":7},1]
[2,{"$nulls":7},2]
[3,{"$nulls":7},3]
[4,{"$nulls":7},4]
["Totaal A korps",{"$nulls":7},"Totaal A korps"]
[]
[1,{"$nulls":7},1]
[2,{"$nulls":7},2]
[3,{"$nulls":7},3]
[4,{"$nulls":7},4]
["Totaal B1 korps",{"$nulls":7},"Totaal B1 korps"]
[]
[1,{"$nulls":7},1]
[2,{"$nulls":7},2]
[3,{"$nulls":7},3]
[4,{"$nulls":7},4]
["Totaal B2 korps",{"$nulls":7},"Totaal B2 korps"]
[]
["OPGELEGD (Jeugd <16 en 65+)"]
[1,{"$nulls":7},1]
[2,{"$nulls":7},2]
[3,{"$nulls":7},3]
["Totaal korps opgelegd A1",{"$nulls":7},"Totaal korps opgelegd A1"]
[]
[1,{"$nulls":7},1]
[2,{"$nulls":7},2]
[3,{"$nulls":7},3]
["Totaal korps opgelegd A2",{"$nulls":7},"Totaal korps opgelegd A2"]
[]
[1,{"$nulls":7},1]
[2,{"$nulls":7},2]
[3,{"$nulls":7},3]
["Totaal korps opgelegd A3",{"$nulls":7},"Totaal korps opgelegd A3"]