{"text_format":"3","workbook":"xlsx","n_sheets":18,"sheets":["invullijst","Personeel","Jeugd","65+","Korps","wedstrijd 1A","wedstrijd 1B","wedstrijd 2A","wedstrijd 2B","wedstrijd 3A","wedstrijd 3B","wedstrijd 4A","wedstrijd 4B","wedstrijd 5A","wedstrijd 5B","blanco wedstrijd","Blad1","schema"],"not_rendered":{"macros":1,"defined_names":4},"read":"whole","date_system":"1900"}

{"sheet":"invullijst","index":0,"n_rows":78,"n_cols":11,"rows_kept":78,"merged":[[0,3,0,4],[0,5,0,6],[0,7,0,9],[1,3,1,4],[1,5,1,6],[1,7,1,9],[2,3,2,4],[2,5,2,10],[3,3,3,4],[3,9,4,10],[4,3,4,4],[86,1,86,9],[87,1,87,2],[87,3,87,4],[88,1,88,2],[88,3,88,4],[89,1,89,2],[89,3,89,4],[90,1,90,2],[90,3,90,4],[91,1,91,2],[91,3,91,4],[92,1,92,2],[92,3,92,4]]}
[1,"Sint Ambrosius Baardwijk","Baardwijk",null,null,"Organistatie",null,"jaar",null,null,"nr"]
[2,"St. Crispinus & Crispinianus Besoijen","Besoijen",{"$nulls":4},"2024 - 2025",null,null,3]
[3,"O.L.V. Schuts Elshout","Elshout",null,null,{"$f":"IF(VLOOKUP($K2,invullijst!$A$1:$C$6,2,FALSE)=\"\",\"\",VLOOKUP($K2,invullijst!$A$1:$C$6,2,FALSE))","v":"O.L.V. Schuts Elshout"}]
[4,"Sint Ambrosius Haarsteeg","Haarsteeg",{"$nulls":6},"versie 2020-1"]
[5,"Sint Jan Baptist Kaatsheuvel","Kaatsheuvel"]
[]
[]
["NR","NAAM","PLAATS","dis.","€","W 1","W 2","W 3","W 4","W 5","kampk"]
[]
[0,0,0,0,0,0,0,0,0,0,0]
[0,0,0,0,{"v":0,"d":"0.00"},0,0,0,0,0,0]
[101,"Antwan van Buul","Baardwijk","vr",null,"x",68,67,60,61,36]
[102,"John de Jong","Baardwijk","vr",null,"x",73,63,60,62,22]
[103,"Norbert van Buul","Baardwijk","vr",null,"x",55,65,63,59,28]
[104,"Peter Brekelmans","Baardwijk","65+",null,"x",79,73,84,"x",37]
[105,"René Klijn","Baardwijk","vr",null,"x",85,80,80,88,42]
[106,"René Pullens","Baardwijk","vr",null,"x",76,82,77,77,41]
[107,"Cees Coppens","Baardwijk","65+",null,"x",86,80,82,75,37]
[108,"Bram Pullens","Baardwijk","vr",null,"x",77,78,84,80,35]
[109,"Gijs Pullens","Baardwijk","vr",null,"x",83,83,75,70,35]
[112,"Toon van Buul","Baardwijk","65+",null,"x",58,"x",67,64,20]
[202,"Arco van Kuijk","Besoijen","vr",null,73,81,81,"x",76,31]
[203,"Frank van den Houdt","Besoijen","vr",null,86,84,79,"x",75,37]
[204,"Harry de Louw","Besoijen","vr",null,80,85,80,"x",74,39]
[205,"Jos v/d Snepscheut","Besoijen","vr",null,75,80,73,"x",74,42]
[206,"Kees van Hulten","Besoijen","vr",null,73,83,78,"x","x",41]
[207,"Max de Louw","Besoijen","vr",null,89,88,92,"x",89,42]
[208,"Erin van Hulten","Besoijen","vr",null,77,82,87,"x",78,41]
[209,"René van Kuijk","Besoijen","vr",null,81,82,83,"x",81,39]
[210,"Sander Oome","Besoijen","vr",null,91,87,90,"x",90,40]
[211,"Ad van den houdt","Besoijen","65+",null,92,91,89,"x","x",46]
[212,"René Duquesnoy","Besoijen","65+",null,87,80,89,"x",86,45]
[213,"Roland van Delft","Besoijen","vr",null,74,71,69,"x",71,35]
[214,"Andre de Vaan","Besoijen","65+",null,87,86,89,"x",90,44]
[216,"Pieter Laghuwitz","Besoijen","vr",null,87,87,86,"x",90,45]
[217,"Hans Laghuwitz","Besoijen","vr",null,76,81,79,"x",72,35]
[218,"Jacob van de Werken","Besoijen","65+",null,97,97,94,"x",91,46]
[219,"Frans de Bont","Besoijen","65+",null,95,93,94,"x",96,46]
[220,"Kees Vos","Besoijen","65+",null,90,93,91,"x",90,46]
[221,"Mees Huijben","Besoijen","J",null,63,79,74,"x",75,36]
[222,"Nick de Vaan","Besoijen","vr",null,72,75,70,"x",82]
[223,"Jänis Jakobsons","Besoijen","vr",null,77,81,84,"x",73,27]
[301,"Arjen van Assem disp","Elshout","65+",null,89,90,89,92,"x",45]
[302,"Freek de Jong","Elshout","vr",null,88,90,80,88,"x",40]
[304,"Henk Bruurmijn ","Elshout","vr",null,80,62,78,82,"x",43]
[305,"Johan Klerx","Elshout","vr",null,84,85,86,84,"x",42]
[306,"Ron Groot","Elshout","vr",null,76,81,89,82,"x",39]
[307,"Bert van Engelen","Elshout","65+",null,95,95,93,94,"x",44]
[309,"René de Jong","Elshout","65+",null,87,81,88,88,"x",39]
[310,"Tiny Boom","Elshout","65+",null,92,92,91,94,"x",45]
[311,"Ton Kolmans","Elshout","vr",null,77,"x","x","x","x"]
[312,"Floor de Jong","Elshout","J",null,95,91,92,null,"x",44]
[401,"Frans van Beurden","Haarsteeg","65+",null,95,"x",98,98,93,48]
[402,"Daniëlle v/d Lee","Haarsteeg","vr",null,84,"x",80,84,"x",43]
[403,"Dorien de Kort","Haarsteeg","65+",null,88,"x",95,96,90,49]
[404,"Gerard van Beurden","Haarsteeg","65+",null,94,"x",98,96,97,49]
[405,"Jan de Vaan","Haarsteeg","65+",null,98,"x",97,96,97,48]
[406,"Jeroen van Oss","Haarsteeg","vr",null,82,"x",86,78,80,40]
[408,"Rudy van Falier","Haarsteeg","vr",null,81,"x",84,82,"x",38]
[410,"Tonnie Koks","Haarsteeg","vr",null,88,"x",88,83,86,40]
[411,"Wilma v/d Lee","Haarsteeg","vr",null,61,"x",53,76,75,32]
[412,"Francien v/d Wiel","Haarsteeg","65+",null,93,"x",96,96,94,48]
[413,"Frans Mommersteeg","Haarsteeg","65+",null,95,"x",96,94,94,47]
[415,"Wim de Gouw","Haarsteeg","65+",null,96,"x",95,96,94,46]
[416,"Thijs Koks","Haarsteeg","vr",null,"x","x","x","x",92]
[501,"Annette Vos","Kaatsheuvel","vr",null,85,78,"x",76,81,41]
[503,"Kees Vos","Kaatsheuvel","65+",null,81,"x","x","x","x"]
[506,"Maikel Monden","Kaatsheuvel","vr",null,83,81,"x",75,82,42]
[507,"Michael Blaauwbroek","Kaatsheuvel","vr",null,76,74,"x",83,70,31]
[508,"Rowan Dobbelsteen","Kaatsheuvel","vr",null,78,75,"x",77,84,34]
[509,"Adwan de Pinth","Kaatsheuvel","65+",null,90,94,"x",96,91,40]
[512,"Hans Bergakker","Kaatsheuvel","vr",null,72,78,"x",73,73,35]
[513,"Mark van Delft","Kaatsheuvel","vr",null,78,77,"x",80,74,31]
[515,"Ilona Bergakker disp","Kaatsheuvel","65+",null,89,87,"x",85,89,44]
[516,"Henry Bergakker disp","Kaatsheuvel","65+",null,90,92,"x",90,92,47]
[517,"Diny Vos","Kaatsheuvel","vr",null,68,75,"x",59,64,20]
[518,"Ton Stanz","Kaatsheuvel","65+",null,83,84,"x","x",77]
[519,"Frank Derissen","Kaatsheuvel","vr",null,"x","x","x",75,76]

{"sheet":"Personeel","index":1,"n_rows":55,"n_cols":13,"rows_kept":55,"merged":[[0,0,1,5],[0,6,0,9],[0,10,0,12],[1,6,1,12],[2,0,2,5],[2,6,2,10]]}
["PERSONEEL",{"$nulls":5},{"$f":"invullijst!F1","v":"Organistatie"},{"$nulls":3},{"$f":"invullijst!H2","v":"2024 - 2025"}]
[{"$nulls":6},{"$f":"invullijst!F3","v":"O.L.V. Schuts Elshout"}]
["alleen in de gele kolom nummer schutter invullen",{"$nulls":5},"wedstrijd",{"$nulls":5},"KAMP-"]
["KL.",null,"schutter",null,"NAAM","PLAATS",1,2,3,4,5,"TOTAAL","KAART"]
["A",1,207,{"$f":"IF(VLOOKUP($C5,invullijst!$A$11:$M$185,4,FALSE)=\"\",\"\",VLOOKUP($C5,invullijst!$A$11:$M$185,4,FALSE))","v":"vr"},{"$f":"IF(VLOOKUP($C5,invullijst!$A$11:$M$185,2,FALSE)=\"\",\"\",VLOOKUP($C5,invullijst!$A$11:$M$185,2,FALSE))","v":"Max de Louw"},{"$f":"IF(VLOOKUP($C5,invullijst!$A$11:$M$185,3,FALSE)=\"\",\"\",VLOOKUP($C5,invullijst!$A$11:$M$185,3,FALSE))","v":"Besoijen"},{"$f":"IF(VLOOKUP(C5,invullijst!$A$11:$M$185,6,FALSE)=\"\",\"\",VLOOKUP(C5,invullijst!$A$11:$M$185,6,FALSE))","v":89},{"$f":"IF(VLOOKUP($C5,invullijst!$A$11:$M$185,7,FALSE)=\"\",\"\",VLOOKUP($C5,invullijst!$A$11:$M$185,7,FALSE))","v":88},{"$f":"IF(VLOOKUP($C5,invullijst!$A$11:$M$185,8,FALSE)=\"\",\"\",VLOOKUP($C5,invullijst!$A$11:$M$185,8,FALSE))","v":92},{"$f":"IF(VLOOKUP($C5,invullijst!$A$11:$M$185,9,FALSE)=\"\",\"\",VLOOKUP($C5,invullijst!$A$11:$M$185,9,FALSE))","v":"x"},{"$f":"IF(VLOOKUP($C5,invullijst!$A$11:$M$185,10,FALSE)=\"\",\"\",VLOOKUP($C5,invullijst!$A$11:$M$185,10,FALSE))","v":89},{"$f":"SUM(G5:K5)","v":358},{"$f":"IF(VLOOKUP($C5,invullijst!$A$11:$M$185,11,FALSE)=\"\",\"\",VLOOKUP($C5,invullijst!$A$11:$M$185,11,FALSE))","v":42}]
[null,2,210,{"$f":"IF(VLOOKUP($C6,invullijst!$A$11:$M$185,4,FALSE)=\"\",\"\",VLOOKUP($C6,invullijst!$A$11:$M$185,4,FALSE))","v":"vr"},{"$f":"IF(VLOOKUP($C6,invullijst!$A$11:$M$185,2,FALSE)=\"\",\"\",VLOOKUP($C6,invullijst!$A$11:$M$185,2,FALSE))","v":"Sander Oome"},{"$f":"IF(VLOOKUP($C6,invullijst!$A$11:$M$185,3,FALSE)=\"\",\"\",VLOOKUP($C6,invullijst!$A$11:$M$185,3,FALSE))","v":"Besoijen"},{"$f":"IF(VLOOKUP(C6,invullijst!$A$11:$M$185,6,FALSE)=\"\",\"\",VLOOKUP(C6,invullijst!$A$11:$M$185,6,FALSE))","v":91},{"$f":"IF(VLOOKUP($C6,invullijst!$A$11:$M$185,7,FALSE)=\"\",\"\",VLOOKUP($C6,invullijst!$A$11:$M$185,7,FALSE))","v":87},{"$f":"IF(VLOOKUP($C6,invullijst!$A$11:$M$185,8,FALSE)=\"\",\"\",VLOOKUP($C6,invullijst!$A$11:$M$185,8,FALSE))","v":90},{"$f":"IF(VLOOKUP($C6,invullijst!$A$11:$M$185,9,FALSE)=\"\",\"\",VLOOKUP($C6,invullijst!$A$11:$M$185,9,FALSE))","v":"x"},{"$f":"IF(VLOOKUP($C6,invullijst!$A$11:$M$185,10,FALSE)=\"\",\"\",VLOOKUP($C6,invullijst!$A$11:$M$185,10,FALSE))","v":90},358,{"$f":"IF(VLOOKUP($C6,invullijst!$A$11:$M$185,11,FALSE)=\"\",\"\",VLOOKUP($C6,invullijst!$A$11:$M$185,11,FALSE))","v":40}]
[null,3,216,{"$f":"IF(VLOOKUP($C7,invullijst!$A$11:$M$185,4,FALSE)=\"\",\"\",VLOOKUP($C7,invullijst!$A$11:$M$185,4,FALSE))","v":"vr"},{"$f":"IF(VLOOKUP($C7,invullijst!$A$11:$M$185,2,FALSE)=\"\",\"\",VLOOKUP($C7,invullijst!$A$11:$M$185,2,FALSE))","v":"Pieter Laghuwitz"},{"$f":"IF(VLOOKUP($C7,invullijst!$A$11:$M$185,3,FALSE)=\"\",\"\",VLOOKUP($C7,invullijst!$A$11:$M$185,3,FALSE))","v":"Besoijen"},{"$f":"IF(VLOOKUP(C7,invullijst!$A$11:$M$185,6,FALSE)=\"\",\"\",VLOOKUP(C7,invullijst!$A$11:$M$185,6,FALSE))","v":87},{"$f":"IF(VLOOKUP($C7,invullijst!$A$11:$M$185,7,FALSE)=\"\",\"\",VLOOKUP($C7,invullijst!$A$11:$M$185,7,FALSE))","v":87},{"$f":"IF(VLOOKUP($C7,invullijst!$A$11:$M$185,8,FALSE)=\"\",\"\",VLOOKUP($C7,invullijst!$A$11:$M$185,8,FALSE))","v":86},{"$f":"IF(VLOOKUP($C7,invullijst!$A$11:$M$185,9,FALSE)=\"\",\"\",VLOOKUP($C7,invullijst!$A$11:$M$185,9,FALSE))","v":"x"},{"$f":"IF(VLOOKUP($C7,invullijst!$A$11:$M$185,10,FALSE)=\"\",\"\",VLOOKUP($C7,invullijst!$A$11:$M$185,10,FALSE))","v":90},350,{"$f":"IF(VLOOKUP($C7,invullijst!$A$11:$M$185,11,FALSE)=\"\",\"\",VLOOKUP($C7,invullijst!$A$11:$M$185,11,FALSE))","v":45}]
[null,4,302,{"$f":"IF(VLOOKUP($C8,invullijst!$A$11:$M$185,4,FALSE)=\"\",\"\",VLOOKUP($C8,invullijst!$A$11:$M$185,4,FALSE))","v":"vr"},{"$f":"IF(VLOOKUP($C8,invullijst!$A$11:$M$185,2,FALSE)=\"\",\"\",VLOOKUP($C8,invullijst!$A$11:$M$185,2,FALSE))","v":"Freek de Jong"},{"$f":"IF(VLOOKUP($C8,invullijst!$A$11:$M$185,3,FALSE)=\"\",\"\",VLOOKUP($C8,invullijst!$A$11:$M$185,3,FALSE))","v":"Elshout"},{"$f":"IF(VLOOKUP(C8,invullijst!$A$11:$M$185,6,FALSE)=\"\",\"\",VLOOKUP(C8,invullijst!$A$11:$M$185,6,FALSE))","v":88},{"$f":"IF(VLOOKUP($C8,invullijst!$A$11:$M$185,7,FALSE)=\"\",\"\",VLOOKUP($C8,invullijst!$A$11:$M$185,7,FALSE))","v":90},{"$f":"IF(VLOOKUP($C8,invullijst!$A$11:$M$185,8,FALSE)=\"\",\"\",VLOOKUP($C8,invullijst!$A$11:$M$185,8,FALSE))","v":80},{"$f":"IF(VLOOKUP($C8,invullijst!$A$11:$M$185,9,FALSE)=\"\",\"\",VLOOKUP($C8,invullijst!$A$11:$M$185,9,FALSE))","v":88},{"$f":"IF(VLOOKUP($C8,invullijst!$A$11:$M$185,10,FALSE)=\"\",\"\",VLOOKUP($C8,invullijst!$A$11:$M$185,10,FALSE))","v":"x"},346,{"$f":"IF(VLOOKUP($C8,invullijst!$A$11:$M$185,11,FALSE)=\"\",\"\",VLOOKUP($C8,invullijst!$A$11:$M$185,11,FALSE))","v":40}]
[null,5,410,{"$f":"IF(VLOOKUP($C9,invullijst!$A$11:$M$185,4,FALSE)=\"\",\"\",VLOOKUP($C9,invullijst!$A$11:$M$185,4,FALSE))","v":"vr"},{"$f":"IF(VLOOKUP($C9,invullijst!$A$11:$M$185,2,FALSE)=\"\",\"\",VLOOKUP($C9,invullijst!$A$11:$M$185,2,FALSE))","v":"Tonnie Koks"},{"$f":"IF(VLOOKUP($C9,invullijst!$A$11:$M$185,3,FALSE)=\"\",\"\",VLOOKUP($C9,invullijst!$A$11:$M$185,3,FALSE))","v":"Haarsteeg"},{"$f":"IF(VLOOKUP(C9,invullijst!$A$11:$M$185,6,FALSE)=\"\",\"\",VLOOKUP(C9,invullijst!$A$11:$M$185,6,FALSE))","v":88},{"$f":"IF(VLOOKUP($C9,invullijst!$A$11:$M$185,7,FALSE)=\"\",\"\",VLOOKUP($C9,invullijst!$A$11:$M$185,7,FALSE))","v":"x"},{"$f":"IF(VLOOKUP($C9,invullijst!$A$11:$M$185,8,FALSE)=\"\",\"\",VLOOKUP($C9,invullijst!$A$11:$M$185,8,FALSE))","v":88},{"$f":"IF(VLOOKUP($C9,invullijst!$A$11:$M$185,9,FALSE)=\"\",\"\",VLOOKUP($C9,invullijst!$A$11:$M$185,9,FALSE))","v":83},{"$f":"IF(VLOOKUP($C9,invullijst!$A$11:$M$185,10,FALSE)=\"\",\"\",VLOOKUP($C9,invullijst!$A$11:$M$185,10,FALSE))","v":86},345,{"$f":"IF(VLOOKUP($C9,invullijst!$A$11:$M$185,11,FALSE)=\"\",\"\",VLOOKUP($C9,invullijst!$A$11:$M$185,11,FALSE))","v":40}]
[null,6,105,{"$f":"IF(VLOOKUP($C10,invullijst!$A$11:$M$185,4,FALSE)=\"\",\"\",VLOOKUP($C10,invullijst!$A$11:$M$185,4,FALSE))","v":"vr"},{"$f":"IF(VLOOKUP($C10,invullijst!$A$11:$M$185,2,FALSE)=\"\",\"\",VLOOKUP($C10,invullijst!$A$11:$M$185,2,FALSE))","v":"René Klijn"},{"$f":"IF(VLOOKUP($C10,invullijst!$A$11:$M$185,3,FALSE)=\"\",\"\",VLOOKUP($C10,invullijst!$A$11:$M$185,3,FALSE))","v":"Baardwijk"},{"$f":"IF(VLOOKUP(C10,invullijst!$A$11:$M$185,6,FALSE)=\"\",\"\",VLOOKUP(C10,invullijst!$A$11:$M$185,6,FALSE))","v":"x"},{"$f":"IF(VLOOKUP($C10,invullijst!$A$11:$M$185,7,FALSE)=\"\",\"\",VLOOKUP($C10,invullijst!$A$11:$M$185,7,FALSE))","v":85},{"$f":"IF(VLOOKUP($C10,invullijst!$A$11:$M$185,8,FALSE)=\"\",\"\",VLOOKUP($C10,invullijst!$A$11:$M$185,8,FALSE))","v":80},{"$f":"IF(VLOOKUP($C10,invullijst!$A$11:$M$185,9,FALSE)=\"\",\"\",VLOOKUP($C10,invullijst!$A$11:$M$185,9,FALSE))","v":80},{"$f":"IF(VLOOKUP($C10,invullijst!$A$11:$M$185,10,FALSE)=\"\",\"\",VLOOKUP($C10,invullijst!$A$11:$M$185,10,FALSE))","v":88},333,{"$f":"IF(VLOOKUP($C10,invullijst!$A$11:$M$185,11,FALSE)=\"\",\"\",VLOOKUP($C10,invullijst!$A$11:$M$185,11,FALSE))","v":42}]
[null,7,306,{"$f":"IF(VLOOKUP($C11,invullijst!$A$11:$M$185,4,FALSE)=\"\",\"\",VLOOKUP($C11,invullijst!$A$11:$M$185,4,FALSE))","v":"vr"},{"$f":"IF(VLOOKUP($C11,invullijst!$A$11:$M$185,2,FALSE)=\"\",\"\",VLOOKUP($C11,invullijst!$A$11:$M$185,2,FALSE))","v":"Ron Groot"},{"$f":"IF(VLOOKUP($C11,invullijst!$A$11:$M$185,3,FALSE)=\"\",\"\",VLOOKUP($C11,invullijst!$A$11:$M$185,3,FALSE))","v":"Elshout"},{"$f":"IF(VLOOKUP(C11,invullijst!$A$11:$M$185,6,FALSE)=\"\",\"\",VLOOKUP(C11,invullijst!$A$11:$M$185,6,FALSE))","v":76},{"$f":"IF(VLOOKUP($C11,invullijst!$A$11:$M$185,7,FALSE)=\"\",\"\",VLOOKUP($C11,invullijst!$A$11:$M$185,7,FALSE))","v":81},{"$f":"IF(VLOOKUP($C11,invullijst!$A$11:$M$185,8,FALSE)=\"\",\"\",VLOOKUP($C11,invullijst!$A$11:$M$185,8,FALSE))","v":89},{"$f":"IF(VLOOKUP($C11,invullijst!$A$11:$M$185,9,FALSE)=\"\",\"\",VLOOKUP($C11,invullijst!$A$11:$M$185,9,FALSE))","v":82},{"$f":"IF(VLOOKUP($C11,invullijst!$A$11:$M$185,10,FALSE)=\"\",\"\",VLOOKUP($C11,invullijst!$A$11:$M$185,10,FALSE))","v":"x"},328,{"$f":"IF(VLOOKUP($C11,invullijst!$A$11:$M$185,11,FALSE)=\"\",\"\",VLOOKUP($C11,invullijst!$A$11:$M$185,11,FALSE))","v":39}]
[null,8,209,{"$f":"IF(VLOOKUP($C12,invullijst!$A$11:$M$185,4,FALSE)=\"\",\"\",VLOOKUP($C12,invullijst!$A$11:$M$185,4,FALSE))","v":"vr"},{"$f":"IF(VLOOKUP($C12,invullijst!$A$11:$M$185,2,FALSE)=\"\",\"\",VLOOKUP($C12,invullijst!$A$11:$M$185,2,FALSE))","v":"René van Kuijk"},{"$f":"IF(VLOOKUP($C12,invullijst!$A$11:$M$185,3,FALSE)=\"\",\"\",VLOOKUP($C12,invullijst!$A$11:$M$185,3,FALSE))","v":"Besoijen"},{"$f":"IF(VLOOKUP(C12,invullijst!$A$11:$M$185,6,FALSE)=\"\",\"\",VLOOKUP(C12,invullijst!$A$11:$M$185,6,FALSE))","v":81},{"$f":"IF(VLOOKUP($C12,invullijst!$A$11:$M$185,7,FALSE)=\"\",\"\",VLOOKUP($C12,invullijst!$A$11:$M$185,7,FALSE))","v":82},{"$f":"IF(VLOOKUP($C12,invullijst!$A$11:$M$185,8,FALSE)=\"\",\"\",VLOOKUP($C12,invullijst!$A$11:$M$185,8,FALSE))","v":83},{"$f":"IF(VLOOKUP($C12,invullijst!$A$11:$M$185,9,FALSE)=\"\",\"\",VLOOKUP($C12,invullijst!$A$11:$M$185,9,FALSE))","v":"x"},{"$f":"IF(VLOOKUP($C12,invullijst!$A$11:$M$185,10,FALSE)=\"\",\"\",VLOOKUP($C12,invullijst!$A$11:$M$185,10,FALSE))","v":81},327,{"$f":"IF(VLOOKUP($C12,invullijst!$A$11:$M$185,11,FALSE)=\"\",\"\",VLOOKUP($C12,invullijst!$A$11:$M$185,11,FALSE))","v":39}]
[null,9,406,{"$f":"IF(VLOOKUP($C13,invullijst!$A$11:$M$185,4,FALSE)=\"\",\"\",VLOOKUP($C13,invullijst!$A$11:$M$185,4,FALSE))","v":"vr"},{"$f":"IF(VLOOKUP($C13,invullijst!$A$11:$M$185,2,FALSE)=\"\",\"\",VLOOKUP($C13,invullijst!$A$11:$M$185,2,FALSE))","v":"Jeroen van Oss"},{"$f":"IF(VLOOKUP($C13,invullijst!$A$11:$M$185,3,FALSE)=\"\",\"\",VLOOKUP($C13,invullijst!$A$11:$M$185,3,FALSE))","v":"Haarsteeg"},{"$f":"IF(VLOOKUP(C13,invullijst!$A$11:$M$185,6,FALSE)=\"\",\"\",VLOOKUP(C13,invullijst!$A$11:$M$185,6,FALSE))","v":82},{"$f":"IF(VLOOKUP($C13,invullijst!$A$11:$M$185,7,FALSE)=\"\",\"\",VLOOKUP($C13,invullijst!$A$11:$M$185,7,FALSE))","v":"x"},{"$f":"IF(VLOOKUP($C13,invullijst!$A$11:$M$185,8,FALSE)=\"\",\"\",VLOOKUP($C13,invullijst!$A$11:$M$185,8,FALSE))","v":86},{"$f":"IF(VLOOKUP($C13,invullijst!$A$11:$M$185,9,FALSE)=\"\",\"\",VLOOKUP($C13,invullijst!$A$11:$M$185,9,FALSE))","v":78},{"$f":"IF(VLOOKUP($C13,invullijst!$A$11:$M$185,10,FALSE)=\"\",\"\",VLOOKUP($C13,invullijst!$A$11:$M$185,10,FALSE))","v":80},326,{"$f":"IF(VLOOKUP($C13,invullijst!$A$11:$M$185,11,FALSE)=\"\",\"\",VLOOKUP($C13,invullijst!$A$11:$M$185,11,FALSE))","v":40}]
[null,10,208,{"$f":"IF(VLOOKUP($C14,invullijst!$A$11:$M$185,4,FALSE)=\"\",\"\",VLOOKUP($C14,invullijst!$A$11:$M$185,4,FALSE))","v":"vr"},{"$f":"IF(VLOOKUP($C14,invullijst!$A$11:$M$185,2,FALSE)=\"\",\"\",VLOOKUP($C14,invullijst!$A$11:$M$185,2,FALSE))","v":"Erin van Hulten"},{"$f":"IF(VLOOKUP($C14,invullijst!$A$11:$M$185,3,FALSE)=\"\",\"\",VLOOKUP($C14,invullijst!$A$11:$M$185,3,FALSE))","v":"Besoijen"},{"$f":"IF(VLOOKUP(C14,invullijst!$A$11:$M$185,6,FALSE)=\"\",\"\",VLOOKUP(C14,invullijst!$A$11:$M$185,6,FALSE))","v":77},{"$f":"IF(VLOOKUP($C14,invullijst!$A$11:$M$185,7,FALSE)=\"\",\"\",VLOOKUP($C14,invullijst!$A$11:$M$185,7,FALSE))","v":82},{"$f":"IF(VLOOKUP($C14,invullijst!$A$11:$M$185,8,FALSE)=\"\",\"\",VLOOKUP($C14,invullijst!$A$11:$M$185,8,FALSE))","v":87},{"$f":"IF(VLOOKUP($C14,invullijst!$A$11:$M$185,9,FALSE)=\"\",\"\",VLOOKUP($C14,invullijst!$A$11:$M$185,9,FALSE))","v":"x"},{"$f":"IF(VLOOKUP($C14,invullijst!$A$11:$M$185,10,FALSE)=\"\",\"\",VLOOKUP($C14,invullijst!$A$11:$M$185,10,FALSE))","v":78},324,{"$f":"IF(VLOOKUP($C14,invullijst!$A$11:$M$185,11,FALSE)=\"\",\"\",VLOOKUP($C14,invullijst!$A$11:$M$185,11,FALSE))","v":41}]
[null,11,203,{"$f":"IF(VLOOKUP($C15,invullijst!$A$11:$M$185,4,FALSE)=\"\",\"\",VLOOKUP($C15,invullijst!$A$11:$M$185,4,FALSE))","v":"vr"},{"$f":"IF(VLOOKUP($C15,invullijst!$A$11:$M$185,2,FALSE)=\"\",\"\",VLOOKUP($C15,invullijst!$A$11:$M$185,2,FALSE))","v":"Frank van den Houdt"},{"$f":"IF(VLOOKUP($C15,invullijst!$A$11:$M$185,3,FALSE)=\"\",\"\",VLOOKUP($C15,invullijst!$A$11:$M$185,3,FALSE))","v":"Besoijen"},{"$f":"IF(VLOOKUP(C15,invullijst!$A$11:$M$185,6,FALSE)=\"\",\"\",VLOOKUP(C15,invullijst!$A$11:$M$185,6,FALSE))","v":86},{"$f":"IF(VLOOKUP($C15,invullijst!$A$11:$M$185,7,FALSE)=\"\",\"\",VLOOKUP($C15,invullijst!$A$11:$M$185,7,FALSE))","v":84},{"$f":"IF(VLOOKUP($C15,invullijst!$A$11:$M$185,8,FALSE)=\"\",\"\",VLOOKUP($C15,invullijst!$A$11:$M$185,8,FALSE))","v":79},{"$f":"IF(VLOOKUP($C15,invullijst!$A$11:$M$185,9,FALSE)=\"\",\"\",VLOOKUP($C15,invullijst!$A$11:$M$185,9,FALSE))","v":"x"},{"$f":"IF(VLOOKUP($C15,invullijst!$A$11:$M$185,10,FALSE)=\"\",\"\",VLOOKUP($C15,invullijst!$A$11:$M$185,10,FALSE))","v":75},324,{"$f":"IF(VLOOKUP($C15,invullijst!$A$11:$M$185,11,FALSE)=\"\",\"\",VLOOKUP($C15,invullijst!$A$11:$M$185,11,FALSE))","v":37}]
[null,12,506,{"$f":"IF(VLOOKUP($C16,invullijst!$A$11:$M$185,4,FALSE)=\"\",\"\",VLOOKUP($C16,invullijst!$A$11:$M$185,4,FALSE))","v":"vr"},{"$f":"IF(VLOOKUP($C16,invullijst!$A$11:$M$185,2,FALSE)=\"\",\"\",VLOOKUP($C16,invullijst!$A$11:$M$185,2,FALSE))","v":"Maikel Monden"},{"$f":"IF(VLOOKUP($C16,invullijst!$A$11:$M$185,3,FALSE)=\"\",\"\",VLOOKUP($C16,invullijst!$A$11:$M$185,3,FALSE))","v":"Kaatsheuvel"},{"$f":"IF(VLOOKUP(C16,invullijst!$A$11:$M$185,6,FALSE)=\"\",\"\",VLOOKUP(C16,invullijst!$A$11:$M$185,6,FALSE))","v":83},{"$f":"IF(VLOOKUP($C16,invullijst!$A$11:$M$185,7,FALSE)=\"\",\"\",VLOOKUP($C16,invullijst!$A$11:$M$185,7,FALSE))","v":81},{"$f":"IF(VLOOKUP($C16,invullijst!$A$11:$M$185,8,FALSE)=\"\",\"\",VLOOKUP($C16,invullijst!$A$11:$M$185,8,FALSE))","v":"x"},{"$f":"IF(VLOOKUP($C16,invullijst!$A$11:$M$185,9,FALSE)=\"\",\"\",VLOOKUP($C16,invullijst!$A$11:$M$185,9,FALSE))","v":75},{"$f":"IF(VLOOKUP($C16,invullijst!$A$11:$M$185,10,FALSE)=\"\",\"\",VLOOKUP($C16,invullijst!$A$11:$M$185,10,FALSE))","v":82},321,{"$f":"IF(VLOOKUP($C16,invullijst!$A$11:$M$185,11,FALSE)=\"\",\"\",VLOOKUP($C16,invullijst!$A$11:$M$185,11,FALSE))","v":42}]
[null,13,501,{"$f":"IF(VLOOKUP($C17,invullijst!$A$11:$M$185,4,FALSE)=\"\",\"\",VLOOKUP($C17,invullijst!$A$11:$M$185,4,FALSE))","v":"vr"},{"$f":"IF(VLOOKUP($C17,invullijst!$A$11:$M$185,2,FALSE)=\"\",\"\",VLOOKUP($C17,invullijst!$A$11:$M$185,2,FALSE))","v":"Annette Vos"},{"$f":"IF(VLOOKUP($C17,invullijst!$A$11:$M$185,3,FALSE)=\"\",\"\",VLOOKUP($C17,invullijst!$A$11:$M$185,3,FALSE))","v":"Kaatsheuvel"},{"$f":"IF(VLOOKUP(C17,invullijst!$A$11:$M$185,6,FALSE)=\"\",\"\",VLOOKUP(C17,invullijst!$A$11:$M$185,6,FALSE))","v":85},{"$f":"IF(VLOOKUP($C17,invullijst!$A$11:$M$185,7,FALSE)=\"\",\"\",VLOOKUP($C17,invullijst!$A$11:$M$185,7,FALSE))","v":78},{"$f":"IF(VLOOKUP($C17,invullijst!$A$11:$M$185,8,FALSE)=\"\",\"\",VLOOKUP($C17,invullijst!$A$11:$M$185,8,FALSE))","v":"x"},{"$f":"IF(VLOOKUP($C17,invullijst!$A$11:$M$185,9,FALSE)=\"\",\"\",VLOOKUP($C17,invullijst!$A$11:$M$185,9,FALSE))","v":76},{"$f":"IF(VLOOKUP($C17,invullijst!$A$11:$M$185,10,FALSE)=\"\",\"\",VLOOKUP($C17,invullijst!$A$11:$M$185,10,FALSE))","v":81},320,{"$f":"IF(VLOOKUP($C17,invullijst!$A$11:$M$185,11,FALSE)=\"\",\"\",VLOOKUP($C17,invullijst!$A$11:$M$185,11,FALSE))","v":41}]
[null,14,204,{"$f":"IF(VLOOKUP($C18,invullijst!$A$11:$M$185,4,FALSE)=\"\",\"\",VLOOKUP($C18,invullijst!$A$11:$M$185,4,FALSE))","v":"vr"},{"$f":"IF(VLOOKUP($C18,invullijst!$A$11:$M$185,2,FALSE)=\"\",\"\",VLOOKUP($C18,invullijst!$A$11:$M$185,2,FALSE))","v":"Harry de Louw"},{"$f":"IF(VLOOKUP($C18,invullijst!$A$11:$M$185,3,FALSE)=\"\",\"\",VLOOKUP($C18,invullijst!$A$11:$M$185,3,FALSE))","v":"Besoijen"},{"$f":"IF(VLOOKUP(C18,invullijst!$A$11:$M$185,6,FALSE)=\"\",\"\",VLOOKUP(C18,invullijst!$A$11:$M$185,6,FALSE))","v":80},{"$f":"IF(VLOOKUP($C18,invullijst!$A$11:$M$185,7,FALSE)=\"\",\"\",VLOOKUP($C18,invullijst!$A$11:$M$185,7,FALSE))","v":85},{"$f":"IF(VLOOKUP($C18,invullijst!$A$11:$M$185,8,FALSE)=\"\",\"\",VLOOKUP($C18,invullijst!$A$11:$M$185,8,FALSE))","v":80},{"$f":"IF(VLOOKUP($C18,invullijst!$A$11:$M$185,9,FALSE)=\"\",\"\",VLOOKUP($C18,invullijst!$A$11:$M$185,9,FALSE))","v":"x"},{"$f":"IF(VLOOKUP($C18,invullijst!$A$11:$M$185,10,FALSE)=\"\",\"\",VLOOKUP($C18,invullijst!$A$11:$M$185,10,FALSE))","v":74},319,{"$f":"IF(VLOOKUP($C18,invullijst!$A$11:$M$185,11,FALSE)=\"\",\"\",VLOOKUP($C18,invullijst!$A$11:$M$185,11,FALSE))","v":39}]
[null,15,108,{"$f":"IF(VLOOKUP($C19,invullijst!$A$11:$M$185,4,FALSE)=\"\",\"\",VLOOKUP($C19,invullijst!$A$11:$M$185,4,FALSE))","v":"vr"},{"$f":"IF(VLOOKUP($C19,invullijst!$A$11:$M$185,2,FALSE)=\"\",\"\",VLOOKUP($C19,invullijst!$A$11:$M$185,2,FALSE))","v":"Bram Pullens"},{"$f":"IF(VLOOKUP($C19,invullijst!$A$11:$M$185,3,FALSE)=\"\",\"\",VLOOKUP($C19,invullijst!$A$11:$M$185,3,FALSE))","v":"Baardwijk"},{"$f":"IF(VLOOKUP(C19,invullijst!$A$11:$M$185,6,FALSE)=\"\",\"\",VLOOKUP(C19,invullijst!$A$11:$M$185,6,FALSE))","v":"x"},{"$f":"IF(VLOOKUP($C19,invullijst!$A$11:$M$185,7,FALSE)=\"\",\"\",VLOOKUP($C19,invullijst!$A$11:$M$185,7,FALSE))","v":77},{"$f":"IF(VLOOKUP($C19,invullijst!$A$11:$M$185,8,FALSE)=\"\",\"\",VLOOKUP($C19,invullijst!$A$11:$M$185,8,FALSE))","v":78},{"$f":"IF(VLOOKUP($C19,invullijst!$A$11:$M$185,9,FALSE)=\"\",\"\",VLOOKUP($C19,invullijst!$A$11:$M$185,9,FALSE))","v":84},{"$f":"IF(VLOOKUP($C19,invullijst!$A$11:$M$185,10,FALSE)=\"\",\"\",VLOOKUP($C19,invullijst!$A$11:$M$185,10,FALSE))","v":80},319,{"$f":"IF(VLOOKUP($C19,invullijst!$A$11:$M$185,11,FALSE)=\"\",\"\",VLOOKUP($C19,invullijst!$A$11:$M$185,11,FALSE))","v":35}]
[null,16,223,{"$f":"IF(VLOOKUP($C20,invullijst!$A$11:$M$185,4,FALSE)=\"\",\"\",VLOOKUP($C20,invullijst!$A$11:$M$185,4,FALSE))","v":"vr"},{"$f":"IF(VLOOKUP($C20,invullijst!$A$11:$M$185,2,FALSE)=\"\",\"\",VLOOKUP($C20,invullijst!$A$11:$M$185,2,FALSE))","v":"Jänis Jakobsons"},{"$f":"IF(VLOOKUP($C20,invullijst!$A$11:$M$185,3,FALSE)=\"\",\"\",VLOOKUP($C20,invullijst!$A$11:$M$185,3,FALSE))","v":"Besoijen"},{"$f":"IF(VLOOKUP(C20,invullijst!$A$11:$M$185,6,FALSE)=\"\",\"\",VLOOKUP(C20,invullijst!$A$11:$M$185,6,FALSE))","v":77},{"$f":"IF(VLOOKUP($C20,invullijst!$A$11:$M$185,7,FALSE)=\"\",\"\",VLOOKUP($C20,invullijst!$A$11:$M$185,7,FALSE))","v":81},{"$f":"IF(VLOOKUP($C20,invullijst!$A$11:$M$185,8,FALSE)=\"\",\"\",VLOOKUP($C20,invullijst!$A$11:$M$185,8,FALSE))","v":84},{"$f":"IF(VLOOKUP($C20,invullijst!$A$11:$M$185,9,FALSE)=\"\",\"\",VLOOKUP($C20,invullijst!$A$11:$M$185,9,FALSE))","v":"x"},{"$f":"IF(VLOOKUP($C20,invullijst!$A$11:$M$185,10,FALSE)=\"\",\"\",VLOOKUP($C20,invullijst!$A$11:$M$185,10,FALSE))","v":73},315,{"$f":"IF(VLOOKUP($C20,invullijst!$A$11:$M$185,11,FALSE)=\"\",\"\",VLOOKUP($C20,invullijst!$A$11:$M$185,11,FALSE))","v":27}]
[null,17,508,{"$f":"IF(VLOOKUP($C21,invullijst!$A$11:$M$185,4,FALSE)=\"\",\"\",VLOOKUP($C21,invullijst!$A$11:$M$185,4,FALSE))","v":"vr"},{"$f":"IF(VLOOKUP($C21,invullijst!$A$11:$M$185,2,FALSE)=\"\",\"\",VLOOKUP($C21,invullijst!$A$11:$M$185,2,FALSE))","v":"Rowan Dobbelsteen"},{"$f":"IF(VLOOKUP($C21,invullijst!$A$11:$M$185,3,FALSE)=\"\",\"\",VLOOKUP($C21,invullijst!$A$11:$M$185,3,FALSE))","v":"Kaatsheuvel"},{"$f":"IF(VLOOKUP(C21,invullijst!$A$11:$M$185,6,FALSE)=\"\",\"\",VLOOKUP(C21,invullijst!$A$11:$M$185,6,FALSE))","v":78},{"$f":"IF(VLOOKUP($C21,invullijst!$A$11:$M$185,7,FALSE)=\"\",\"\",VLOOKUP($C21,invullijst!$A$11:$M$185,7,FALSE))","v":75},{"$f":"IF(VLOOKUP($C21,invullijst!$A$11:$M$185,8,FALSE)=\"\",\"\",VLOOKUP($C21,invullijst!$A$11:$M$185,8,FALSE))","v":"x"},{"$f":"IF(VLOOKUP($C21,invullijst!$A$11:$M$185,9,FALSE)=\"\",\"\",VLOOKUP($C21,invullijst!$A$11:$M$185,9,FALSE))","v":77},{"$f":"IF(VLOOKUP($C21,invullijst!$A$11:$M$185,10,FALSE)=\"\",\"\",VLOOKUP($C21,invullijst!$A$11:$M$185,10,FALSE))","v":84},314,{"$f":"IF(VLOOKUP($C21,invullijst!$A$11:$M$185,11,FALSE)=\"\",\"\",VLOOKUP($C21,invullijst!$A$11:$M$185,11,FALSE))","v":34}]
[null,18,106,{"$f":"IF(VLOOKUP($C22,invullijst!$A$11:$M$185,4,FALSE)=\"\",\"\",VLOOKUP($C22,invullijst!$A$11:$M$185,4,FALSE))","v":"vr"},{"$f":"IF(VLOOKUP($C22,invullijst!$A$11:$M$185,2,FALSE)=\"\",\"\",VLOOKUP($C22,invullijst!$A$11:$M$185,2,FALSE))","v":"René Pullens"},{"$f":"IF(VLOOKUP($C22,invullijst!$A$11:$M$185,3,FALSE)=\"\",\"\",VLOOKUP($C22,invullijst!$A$11:$M$185,3,FALSE))","v":"Baardwijk"},{"$f":"IF(VLOOKUP(C22,invullijst!$A$11:$M$185,6,FALSE)=\"\",\"\",VLOOKUP(C22,invullijst!$A$11:$M$185,6,FALSE))","v":"x"},{"$f":"IF(VLOOKUP($C22,invullijst!$A$11:$M$185,7,FALSE)=\"\",\"\",VLOOKUP($C22,invullijst!$A$11:$M$185,7,FALSE))","v":76},{"$f":"IF(VLOOKUP($C22,invullijst!$A$11:$M$185,8,FALSE)=\"\",\"\",VLOOKUP($C22,invullijst!$A$11:$M$185,8,FALSE))","v":82},{"$f":"IF(VLOOKUP($C22,invullijst!$A$11:$M$185,9,FALSE)=\"\",\"\",VLOOKUP($C22,invullijst!$A$11:$M$185,9,FALSE))","v":77},{"$f":"IF(VLOOKUP($C22,invullijst!$A$11:$M$185,10,FALSE)=\"\",\"\",VLOOKUP($C22,invullijst!$A$11:$M$185,10,FALSE))","v":77},312,{"$f":"IF(VLOOKUP($C22,invullijst!$A$11:$M$185,11,FALSE)=\"\",\"\",VLOOKUP($C22,invullijst!$A$11:$M$185,11,FALSE))","v":41}]
[null,19,109,{"$f":"IF(VLOOKUP($C23,invullijst!$A$11:$M$185,4,FALSE)=\"\",\"\",VLOOKUP($C23,invullijst!$A$11:$M$185,4,FALSE))","v":"vr"},{"$f":"IF(VLOOKUP($C23,invullijst!$A$11:$M$185,2,FALSE)=\"\",\"\",VLOOKUP($C23,invullijst!$A$11:$M$185,2,FALSE))","v":"Gijs Pullens"},{"$f":"IF(VLOOKUP($C23,invullijst!$A$11:$M$185,3,FALSE)=\"\",\"\",VLOOKUP($C23,invullijst!$A$11:$M$185,3,FALSE))","v":"Baardwijk"},{"$f":"IF(VLOOKUP(C23,invullijst!$A$11:$M$185,6,FALSE)=\"\",\"\",VLOOKUP(C23,invullijst!$A$11:$M$185,6,FALSE))","v":"x"},{"$f":"IF(VLOOKUP($C23,invullijst!$A$11:$M$185,7,FALSE)=\"\",\"\",VLOOKUP($C23,invullijst!$A$11:$M$185,7,FALSE))","v":83},{"$f":"IF(VLOOKUP($C23,invullijst!$A$11:$M$185,8,FALSE)=\"\",\"\",VLOOKUP($C23,invullijst!$A$11:$M$185,8,FALSE))","v":83},{"$f":"IF(VLOOKUP($C23,invullijst!$A$11:$M$185,9,FALSE)=\"\",\"\",VLOOKUP($C23,invullijst!$A$11:$M$185,9,FALSE))","v":75},{"$f":"IF(VLOOKUP($C23,invullijst!$A$11:$M$185,10,FALSE)=\"\",\"\",VLOOKUP($C23,invullijst!$A$11:$M$185,10,FALSE))","v":70},311,{"$f":"IF(VLOOKUP($C23,invullijst!$A$11:$M$185,11,FALSE)=\"\",\"\",VLOOKUP($C23,invullijst!$A$11:$M$185,11,FALSE))","v":35}]
["B",1,202,{"$f":"IF(VLOOKUP($C24,invullijst!$A$11:$M$185,4,FALSE)=\"\",\"\",VLOOKUP($C24,invullijst!$A$11:$M$185,4,FALSE))","v":"vr"},{"$f":"IF(VLOOKUP($C24,invullijst!$A$11:$M$185,2,FALSE)=\"\",\"\",VLOOKUP($C24,invullijst!$A$11:$M$185,2,FALSE))","v":"Arco van Kuijk"},{"$f":"IF(VLOOKUP($C24,invullijst!$A$11:$M$185,3,FALSE)=\"\",\"\",VLOOKUP($C24,invullijst!$A$11:$M$185,3,FALSE))","v":"Besoijen"},{"$f":"IF(VLOOKUP(C24,invullijst!$A$11:$M$185,6,FALSE)=\"\",\"\",VLOOKUP(C24,invullijst!$A$11:$M$185,6,FALSE))","v":73},{"$f":"IF(VLOOKUP($C24,invullijst!$A$11:$M$185,7,FALSE)=\"\",\"\",VLOOKUP($C24,invullijst!$A$11:$M$185,7,FALSE))","v":81},{"$f":"IF(VLOOKUP($C24,invullijst!$A$11:$M$185,8,FALSE)=\"\",\"\",VLOOKUP($C24,invullijst!$A$11:$M$185,8,FALSE))","v":81},{"$f":"IF(VLOOKUP($C24,invullijst!$A$11:$M$185,9,FALSE)=\"\",\"\",VLOOKUP($C24,invullijst!$A$11:$M$185,9,FALSE))","v":"x"},{"$f":"IF(VLOOKUP($C24,invullijst!$A$11:$M$185,10,FALSE)=\"\",\"\",VLOOKUP($C24,invullijst!$A$11:$M$185,10,FALSE))","v":76},311,{"$f":"IF(VLOOKUP($C24,invullijst!$A$11:$M$185,11,FALSE)=\"\",\"\",VLOOKUP($C24,invullijst!$A$11:$M$185,11,FALSE))","v":31}]
[null,2,513,{"$f":"IF(VLOOKUP($C25,invullijst!$A$11:$M$185,4,FALSE)=\"\",\"\",VLOOKUP($C25,invullijst!$A$11:$M$185,4,FALSE))","v":"vr"},{"$f":"IF(VLOOKUP($C25,invullijst!$A$11:$M$185,2,FALSE)=\"\",\"\",VLOOKUP($C25,invullijst!$A$11:$M$185,2,FALSE))","v":"Mark van Delft"},{"$f":"IF(VLOOKUP($C25,invullijst!$A$11:$M$185,3,FALSE)=\"\",\"\",VLOOKUP($C25,invullijst!$A$11:$M$185,3,FALSE))","v":"Kaatsheuvel"},{"$f":"IF(VLOOKUP(C25,invullijst!$A$11:$M$185,6,FALSE)=\"\",\"\",VLOOKUP(C25,invullijst!$A$11:$M$185,6,FALSE))","v":78},{"$f":"IF(VLOOKUP($C25,invullijst!$A$11:$M$185,7,FALSE)=\"\",\"\",VLOOKUP($C25,invullijst!$A$11:$M$185,7,FALSE))","v":77},{"$f":"IF(VLOOKUP($C25,invullijst!$A$11:$M$185,8,FALSE)=\"\",\"\",VLOOKUP($C25,invullijst!$A$11:$M$185,8,FALSE))","v":"x"},{"$f":"IF(VLOOKUP($C25,invullijst!$A$11:$M$185,9,FALSE)=\"\",\"\",VLOOKUP($C25,invullijst!$A$11:$M$185,9,FALSE))","v":80},{"$f":"IF(VLOOKUP($C25,invullijst!$A$11:$M$185,10,FALSE)=\"\",\"\",VLOOKUP($C25,invullijst!$A$11:$M$185,10,FALSE))","v":74},309,{"$f":"IF(VLOOKUP($C25,invullijst!$A$11:$M$185,11,FALSE)=\"\",\"\",VLOOKUP($C25,invullijst!$A$11:$M$185,11,FALSE))","v":31}]
[null,3,217,{"$f":"IF(VLOOKUP($C26,invullijst!$A$11:$M$185,4,FALSE)=\"\",\"\",VLOOKUP($C26,invullijst!$A$11:$M$185,4,FALSE))","v":"vr"},{"$f":"IF(VLOOKUP($C26,invullijst!$A$11:$M$185,2,FALSE)=\"\",\"\",VLOOKUP($C26,invullijst!$A$11:$M$185,2,FALSE))","v":"Hans Laghuwitz"},{"$f":"IF(VLOOKUP($C26,invullijst!$A$11:$M$185,3,FALSE)=\"\",\"\",VLOOKUP($C26,invullijst!$A$11:$M$185,3,FALSE))","v":"Besoijen"},{"$f":"IF(VLOOKUP(C26,invullijst!$A$11:$M$185,6,FALSE)=\"\",\"\",VLOOKUP(C26,invullijst!$A$11:$M$185,6,FALSE))","v":76},{"$f":"IF(VLOOKUP($C26,invullijst!$A$11:$M$185,7,FALSE)=\"\",\"\",VLOOKUP($C26,invullijst!$A$11:$M$185,7,FALSE))","v":81},{"$f":"IF(VLOOKUP($C26,invullijst!$A$11:$M$185,8,FALSE)=\"\",\"\",VLOOKUP($C26,invullijst!$A$11:$M$185,8,FALSE))","v":79},{"$f":"IF(VLOOKUP($C26,invullijst!$A$11:$M$185,9,FALSE)=\"\",\"\",VLOOKUP($C26,invullijst!$A$11:$M$185,9,FALSE))","v":"x"},{"$f":"IF(VLOOKUP($C26,invullijst!$A$11:$M$185,10,FALSE)=\"\",\"\",VLOOKUP($C26,invullijst!$A$11:$M$185,10,FALSE))","v":72},308,{"$f":"IF(VLOOKUP($C26,invullijst!$A$11:$M$185,11,FALSE)=\"\",\"\",VLOOKUP($C26,invullijst!$A$11:$M$185,11,FALSE))","v":35}]
[null,4,507,{"$f":"IF(VLOOKUP($C27,invullijst!$A$11:$M$185,4,FALSE)=\"\",\"\",VLOOKUP($C27,invullijst!$A$11:$M$185,4,FALSE))","v":"vr"},{"$f":"IF(VLOOKUP($C27,invullijst!$A$11:$M$185,2,FALSE)=\"\",\"\",VLOOKUP($C27,invullijst!$A$11:$M$185,2,FALSE))","v":"Michael Blaauwbroek"},{"$f":"IF(VLOOKUP($C27,invullijst!$A$11:$M$185,3,FALSE)=\"\",\"\",VLOOKUP($C27,invullijst!$A$11:$M$185,3,FALSE))","v":"Kaatsheuvel"},{"$f":"IF(VLOOKUP(C27,invullijst!$A$11:$M$185,6,FALSE)=\"\",\"\",VLOOKUP(C27,invullijst!$A$11:$M$185,6,FALSE))","v":76},{"$f":"IF(VLOOKUP($C27,invullijst!$A$11:$M$185,7,FALSE)=\"\",\"\",VLOOKUP($C27,invullijst!$A$11:$M$185,7,FALSE))","v":74},{"$f":"IF(VLOOKUP($C27,invullijst!$A$11:$M$185,8,FALSE)=\"\",\"\",VLOOKUP($C27,invullijst!$A$11:$M$185,8,FALSE))","v":"x"},{"$f":"IF(VLOOKUP($C27,invullijst!$A$11:$M$185,9,FALSE)=\"\",\"\",VLOOKUP($C27,invullijst!$A$11:$M$185,9,FALSE))","v":83},{"$f":"IF(VLOOKUP($C27,invullijst!$A$11:$M$185,10,FALSE)=\"\",\"\",VLOOKUP($C27,invullijst!$A$11:$M$185,10,FALSE))","v":70},303,{"$f":"IF(VLOOKUP($C27,invullijst!$A$11:$M$185,11,FALSE)=\"\",\"\",VLOOKUP($C27,invullijst!$A$11:$M$185,11,FALSE))","v":31}]
[null,5,205,{"$f":"IF(VLOOKUP($C28,invullijst!$A$11:$M$185,4,FALSE)=\"\",\"\",VLOOKUP($C28,invullijst!$A$11:$M$185,4,FALSE))","v":"vr"},{"$f":"IF(VLOOKUP($C28,invullijst!$A$11:$M$185,2,FALSE)=\"\",\"\",VLOOKUP($C28,invullijst!$A$11:$M$185,2,FALSE))","v":"Jos v/d Snepscheut"},{"$f":"IF(VLOOKUP($C28,invullijst!$A$11:$M$185,3,FALSE)=\"\",\"\",VLOOKUP($C28,invullijst!$A$11:$M$185,3,FALSE))","v":"Besoijen"},{"$f":"IF(VLOOKUP(C28,invullijst!$A$11:$M$185,6,FALSE)=\"\",\"\",VLOOKUP(C28,invullijst!$A$11:$M$185,6,FALSE))","v":75},{"$f":"IF(VLOOKUP($C28,invullijst!$A$11:$M$185,7,FALSE)=\"\",\"\",VLOOKUP($C28,invullijst!$A$11:$M$185,7,FALSE))","v":80},{"$f":"IF(VLOOKUP($C28,invullijst!$A$11:$M$185,8,FALSE)=\"\",\"\",VLOOKUP($C28,invullijst!$A$11:$M$185,8,FALSE))","v":73},{"$f":"IF(VLOOKUP($C28,invullijst!$A$11:$M$185,9,FALSE)=\"\",\"\",VLOOKUP($C28,invullijst!$A$11:$M$185,9,FALSE))","v":"x"},{"$f":"IF(VLOOKUP($C28,invullijst!$A$11:$M$185,10,FALSE)=\"\",\"\",VLOOKUP($C28,invullijst!$A$11:$M$185,10,FALSE))","v":74},302,{"$f":"IF(VLOOKUP($C28,invullijst!$A$11:$M$185,11,FALSE)=\"\",\"\",VLOOKUP($C28,invullijst!$A$11:$M$185,11,FALSE))","v":42}]
[null,6,222,{"$f":"IF(VLOOKUP($C29,invullijst!$A$11:$M$185,4,FALSE)=\"\",\"\",VLOOKUP($C29,invullijst!$A$11:$M$185,4,FALSE))","v":"vr"},{"$f":"IF(VLOOKUP($C29,invullijst!$A$11:$M$185,2,FALSE)=\"\",\"\",VLOOKUP($C29,invullijst!$A$11:$M$185,2,FALSE))","v":"Nick de Vaan"},{"$f":"IF(VLOOKUP($C29,invullijst!$A$11:$M$185,3,FALSE)=\"\",\"\",VLOOKUP($C29,invullijst!$A$11:$M$185,3,FALSE))","v":"Besoijen"},{"$f":"IF(VLOOKUP(C29,invullijst!$A$11:$M$185,6,FALSE)=\"\",\"\",VLOOKUP(C29,invullijst!$A$11:$M$185,6,FALSE))","v":72},{"$f":"IF(VLOOKUP($C29,invullijst!$A$11:$M$185,7,FALSE)=\"\",\"\",VLOOKUP($C29,invullijst!$A$11:$M$185,7,FALSE))","v":75},{"$f":"IF(VLOOKUP($C29,invullijst!$A$11:$M$185,8,FALSE)=\"\",\"\",VLOOKUP($C29,invullijst!$A$11:$M$185,8,FALSE))","v":70},{"$f":"IF(VLOOKUP($C29,invullijst!$A$11:$M$185,9,FALSE)=\"\",\"\",VLOOKUP($C29,invullijst!$A$11:$M$185,9,FALSE))","v":"x"},{"$f":"IF(VLOOKUP($C29,invullijst!$A$11:$M$185,10,FALSE)=\"\",\"\",VLOOKUP($C29,invullijst!$A$11:$M$185,10,FALSE))","v":82},299,{"$f":"IF(VLOOKUP($C29,invullijst!$A$11:$M$185,11,FALSE)=\"\",\"\",VLOOKUP($C29,invullijst!$A$11:$M$185,11,FALSE))","v":""}]
[null,7,512,{"$f":"IF(VLOOKUP($C30,invullijst!$A$11:$M$185,4,FALSE)=\"\",\"\",VLOOKUP($C30,invullijst!$A$11:$M$185,4,FALSE))","v":"vr"},{"$f":"IF(VLOOKUP($C30,invullijst!$A$11:$M$185,2,FALSE)=\"\",\"\",VLOOKUP($C30,invullijst!$A$11:$M$185,2,FALSE))","v":"Hans Bergakker"},{"$f":"IF(VLOOKUP($C30,invullijst!$A$11:$M$185,3,FALSE)=\"\",\"\",VLOOKUP($C30,invullijst!$A$11:$M$185,3,FALSE))","v":"Kaatsheuvel"},{"$f":"IF(VLOOKUP(C30,invullijst!$A$11:$M$185,6,FALSE)=\"\",\"\",VLOOKUP(C30,invullijst!$A$11:$M$185,6,FALSE))","v":72},{"$f":"IF(VLOOKUP($C30,invullijst!$A$11:$M$185,7,FALSE)=\"\",\"\",VLOOKUP($C30,invullijst!$A$11:$M$185,7,FALSE))","v":78},{"$f":"IF(VLOOKUP($C30,invullijst!$A$11:$M$185,8,FALSE)=\"\",\"\",VLOOKUP($C30,invullijst!$A$11:$M$185,8,FALSE))","v":"x"},{"$f":"IF(VLOOKUP($C30,invullijst!$A$11:$M$185,9,FALSE)=\"\",\"\",VLOOKUP($C30,invullijst!$A$11:$M$185,9,FALSE))","v":73},{"$f":"IF(VLOOKUP($C30,invullijst!$A$11:$M$185,10,FALSE)=\"\",\"\",VLOOKUP($C30,invullijst!$A$11:$M$185,10,FALSE))","v":73},296,{"$f":"IF(VLOOKUP($C30,invullijst!$A$11:$M$185,11,FALSE)=\"\",\"\",VLOOKUP($C30,invullijst!$A$11:$M$185,11,FALSE))","v":35}]
[null,8,213,{"$f":"IF(VLOOKUP($C31,invullijst!$A$11:$M$185,4,FALSE)=\"\",\"\",VLOOKUP($C31,invullijst!$A$11:$M$185,4,FALSE))","v":"vr"},{"$f":"IF(VLOOKUP($C31,invullijst!$A$11:$M$185,2,FALSE)=\"\",\"\",VLOOKUP($C31,invullijst!$A$11:$M$185,2,FALSE))","v":"Roland van Delft"},{"$f":"IF(VLOOKUP($C31,invullijst!$A$11:$M$185,3,FALSE)=\"\",\"\",VLOOKUP($C31,invullijst!$A$11:$M$185,3,FALSE))","v":"Besoijen"},{"$f":"IF(VLOOKUP(C31,invullijst!$A$11:$M$185,6,FALSE)=\"\",\"\",VLOOKUP(C31,invullijst!$A$11:$M$185,6,FALSE))","v":74},{"$f":"IF(VLOOKUP($C31,invullijst!$A$11:$M$185,7,FALSE)=\"\",\"\",VLOOKUP($C31,invullijst!$A$11:$M$185,7,FALSE))","v":71},{"$f":"IF(VLOOKUP($C31,invullijst!$A$11:$M$185,8,FALSE)=\"\",\"\",VLOOKUP($C31,invullijst!$A$11:$M$185,8,FALSE))","v":69},{"$f":"IF(VLOOKUP($C31,invullijst!$A$11:$M$185,9,FALSE)=\"\",\"\",VLOOKUP($C31,invullijst!$A$11:$M$185,9,FALSE))","v":"x"},{"$f":"IF(VLOOKUP($C31,invullijst!$A$11:$M$185,10,FALSE)=\"\",\"\",VLOOKUP($C31,invullijst!$A$11:$M$185,10,FALSE))","v":71},285,{"$f":"IF(VLOOKUP($C31,invullijst!$A$11:$M$185,11,FALSE)=\"\",\"\",VLOOKUP($C31,invullijst!$A$11:$M$185,11,FALSE))","v":35}]
[null,9,517,{"$f":"IF(VLOOKUP($C32,invullijst!$A$11:$M$185,4,FALSE)=\"\",\"\",VLOOKUP($C32,invullijst!$A$11:$M$185,4,FALSE))","v":"vr"},{"$f":"IF(VLOOKUP($C32,invullijst!$A$11:$M$185,2,FALSE)=\"\",\"\",VLOOKUP($C32,invullijst!$A$11:$M$185,2,FALSE))","v":"Diny Vos"},{"$f":"IF(VLOOKUP($C32,invullijst!$A$11:$M$185,3,FALSE)=\"\",\"\",VLOOKUP($C32,invullijst!$A$11:$M$185,3,FALSE))","v":"Kaatsheuvel"},{"$f":"IF(VLOOKUP(C32,invullijst!$A$11:$M$185,6,FALSE)=\"\",\"\",VLOOKUP(C32,invullijst!$A$11:$M$185,6,FALSE))","v":68},{"$f":"IF(VLOOKUP($C32,invullijst!$A$11:$M$185,7,FALSE)=\"\",\"\",VLOOKUP($C32,invullijst!$A$11:$M$185,7,FALSE))","v":75},{"$f":"IF(VLOOKUP($C32,invullijst!$A$11:$M$185,8,FALSE)=\"\",\"\",VLOOKUP($C32,invullijst!$A$11:$M$185,8,FALSE))","v":"x"},{"$f":"IF(VLOOKUP($C32,invullijst!$A$11:$M$185,9,FALSE)=\"\",\"\",VLOOKUP($C32,invullijst!$A$11:$M$185,9,FALSE))","v":59},{"$f":"IF(VLOOKUP($C32,invullijst!$A$11:$M$185,10,FALSE)=\"\",\"\",VLOOKUP($C32,invullijst!$A$11:$M$185,10,FALSE))","v":64},266,{"$f":"IF(VLOOKUP($C32,invullijst!$A$11:$M$185,11,FALSE)=\"\",\"\",VLOOKUP($C32,invullijst!$A$11:$M$185,11,FALSE))","v":20}]
[null,10,411,{"$f":"IF(VLOOKUP($C33,invullijst!$A$11:$M$185,4,FALSE)=\"\",\"\",VLOOKUP($C33,invullijst!$A$11:$M$185,4,FALSE))","v":"vr"},{"$f":"IF(VLOOKUP($C33,invullijst!$A$11:$M$185,2,FALSE)=\"\",\"\",VLOOKUP($C33,invullijst!$A$11:$M$185,2,FALSE))","v":"Wilma v/d Lee"},{"$f":"IF(VLOOKUP($C33,invullijst!$A$11:$M$185,3,FALSE)=\"\",\"\",VLOOKUP($C33,invullijst!$A$11:$M$185,3,FALSE))","v":"Haarsteeg"},{"$f":"IF(VLOOKUP(C33,invullijst!$A$11:$M$185,6,FALSE)=\"\",\"\",VLOOKUP(C33,invullijst!$A$11:$M$185,6,FALSE))","v":61},{"$f":"IF(VLOOKUP($C33,invullijst!$A$11:$M$185,7,FALSE)=\"\",\"\",VLOOKUP($C33,invullijst!$A$11:$M$185,7,FALSE))","v":"x"},{"$f":"IF(VLOOKUP($C33,invullijst!$A$11:$M$185,8,FALSE)=\"\",\"\",VLOOKUP($C33,invullijst!$A$11:$M$185,8,FALSE))","v":53},{"$f":"IF(VLOOKUP($C33,invullijst!$A$11:$M$185,9,FALSE)=\"\",\"\",VLOOKUP($C33,invullijst!$A$11:$M$185,9,FALSE))","v":76},{"$f":"IF(VLOOKUP($C33,invullijst!$A$11:$M$185,10,FALSE)=\"\",\"\",VLOOKUP($C33,invullijst!$A$11:$M$185,10,FALSE))","v":75},265,{"$f":"IF(VLOOKUP($C33,invullijst!$A$11:$M$185,11,FALSE)=\"\",\"\",VLOOKUP($C33,invullijst!$A$11:$M$185,11,FALSE))","v":32}]
[null,11,102,{"$f":"IF(VLOOKUP($C34,invullijst!$A$11:$M$185,4,FALSE)=\"\",\"\",VLOOKUP($C34,invullijst!$A$11:$M$185,4,FALSE))","v":"vr"},{"$f":"IF(VLOOKUP($C34,invullijst!$A$11:$M$185,2,FALSE)=\"\",\"\",VLOOKUP($C34,invullijst!$A$11:$M$185,2,FALSE))","v":"John de Jong"},{"$f":"IF(VLOOKUP($C34,invullijst!$A$11:$M$185,3,FALSE)=\"\",\"\",VLOOKUP($C34,invullijst!$A$11:$M$185,3,FALSE))","v":"Baardwijk"},{"$f":"IF(VLOOKUP(C34,invullijst!$A$11:$M$185,6,FALSE)=\"\",\"\",VLOOKUP(C34,invullijst!$A$11:$M$185,6,FALSE))","v":"x"},{"$f":"IF(VLOOKUP($C34,invullijst!$A$11:$M$185,7,FALSE)=\"\",\"\",VLOOKUP($C34,invullijst!$A$11:$M$185,7,FALSE))","v":73},{"$f":"IF(VLOOKUP($C34,invullijst!$A$11:$M$185,8,FALSE)=\"\",\"\",VLOOKUP($C34,invullijst!$A$11:$M$185,8,FALSE))","v":63},{"$f":"IF(VLOOKUP($C34,invullijst!$A$11:$M$185,9,FALSE)=\"\",\"\",VLOOKUP($C34,invullijst!$A$11:$M$185,9,FALSE))","v":60},{"$f":"IF(VLOOKUP($C34,invullijst!$A$11:$M$185,10,FALSE)=\"\",\"\",VLOOKUP($C34,invullijst!$A$11:$M$185,10,FALSE))","v":62},258,{"$f":"IF(VLOOKUP($C34,invullijst!$A$11:$M$185,11,FALSE)=\"\",\"\",VLOOKUP($C34,invullijst!$A$11:$M$185,11,FALSE))","v":22}]
[null,12,101,{"$f":"IF(VLOOKUP($C35,invullijst!$A$11:$M$185,4,FALSE)=\"\",\"\",VLOOKUP($C35,invullijst!$A$11:$M$185,4,FALSE))","v":"vr"},{"$f":"IF(VLOOKUP($C35,invullijst!$A$11:$M$185,2,FALSE)=\"\",\"\",VLOOKUP($C35,invullijst!$A$11:$M$185,2,FALSE))","v":"Antwan van Buul"},{"$f":"IF(VLOOKUP($C35,invullijst!$A$11:$M$185,3,FALSE)=\"\",\"\",VLOOKUP($C35,invullijst!$A$11:$M$185,3,FALSE))","v":"Baardwijk"},{"$f":"IF(VLOOKUP(C35,invullijst!$A$11:$M$185,6,FALSE)=\"\",\"\",VLOOKUP(C35,invullijst!$A$11:$M$185,6,FALSE))","v":"x"},{"$f":"IF(VLOOKUP($C35,invullijst!$A$11:$M$185,7,FALSE)=\"\",\"\",VLOOKUP($C35,invullijst!$A$11:$M$185,7,FALSE))","v":68},{"$f":"IF(VLOOKUP($C35,invullijst!$A$11:$M$185,8,FALSE)=\"\",\"\",VLOOKUP($C35,invullijst!$A$11:$M$185,8,FALSE))","v":67},{"$f":"IF(VLOOKUP($C35,invullijst!$A$11:$M$185,9,FALSE)=\"\",\"\",VLOOKUP($C35,invullijst!$A$11:$M$185,9,FALSE))","v":60},{"$f":"IF(VLOOKUP($C35,invullijst!$A$11:$M$185,10,FALSE)=\"\",\"\",VLOOKUP($C35,invullijst!$A$11:$M$185,10,FALSE))","v":61},256,{"$f":"IF(VLOOKUP($C35,invullijst!$A$11:$M$185,11,FALSE)=\"\",\"\",VLOOKUP($C35,invullijst!$A$11:$M$185,11,FALSE))","v":36}]
[null,13,305,{"$f":"IF(VLOOKUP($C36,invullijst!$A$11:$M$185,4,FALSE)=\"\",\"\",VLOOKUP($C36,invullijst!$A$11:$M$185,4,FALSE))","v":"vr"},{"$f":"IF(VLOOKUP($C36,invullijst!$A$11:$M$185,2,FALSE)=\"\",\"\",VLOOKUP($C36,invullijst!$A$11:$M$185,2,FALSE))","v":"Johan Klerx"},{"$f":"IF(VLOOKUP($C36,invullijst!$A$11:$M$185,3,FALSE)=\"\",\"\",VLOOKUP($C36,invullijst!$A$11:$M$185,3,FALSE))","v":"Elshout"},{"$f":"IF(VLOOKUP(C36,invullijst!$A$11:$M$185,6,FALSE)=\"\",\"\",VLOOKUP(C36,invullijst!$A$11:$M$185,6,FALSE))","v":84},{"$f":"IF(VLOOKUP($C36,invullijst!$A$11:$M$185,7,FALSE)=\"\",\"\",VLOOKUP($C36,invullijst!$A$11:$M$185,7,FALSE))","v":85},null,{"$f":"IF(VLOOKUP($C36,invullijst!$A$11:$M$185,9,FALSE)=\"\",\"\",VLOOKUP($C36,invullijst!$A$11:$M$185,9,FALSE))","v":84},{"$f":"IF(VLOOKUP($C36,invullijst!$A$11:$M$185,10,FALSE)=\"\",\"\",VLOOKUP($C36,invullijst!$A$11:$M$185,10,FALSE))","v":"x"},253,{"$f":"IF(VLOOKUP($C36,invullijst!$A$11:$M$185,11,FALSE)=\"\",\"\",VLOOKUP($C36,invullijst!$A$11:$M$185,11,FALSE))","v":42}]
[null,14,402,{"$f":"IF(VLOOKUP($C37,invullijst!$A$11:$M$185,4,FALSE)=\"\",\"\",VLOOKUP($C37,invullijst!$A$11:$M$185,4,FALSE))","v":"vr"},{"$f":"IF(VLOOKUP($C37,invullijst!$A$11:$M$185,2,FALSE)=\"\",\"\",VLOOKUP($C37,invullijst!$A$11:$M$185,2,FALSE))","v":"Daniëlle v/d Lee"},{"$f":"IF(VLOOKUP($C37,invullijst!$A$11:$M$185,3,FALSE)=\"\",\"\",VLOOKUP($C37,invullijst!$A$11:$M$185,3,FALSE))","v":"Haarsteeg"},{"$f":"IF(VLOOKUP(C37,invullijst!$A$11:$M$185,6,FALSE)=\"\",\"\",VLOOKUP(C37,invullijst!$A$11:$M$185,6,FALSE))","v":84},{"$f":"IF(VLOOKUP($C37,invullijst!$A$11:$M$185,7,FALSE)=\"\",\"\",VLOOKUP($C37,invullijst!$A$11:$M$185,7,FALSE))","v":"x"},{"$f":"IF(VLOOKUP($C37,invullijst!$A$11:$M$185,8,FALSE)=\"\",\"\",VLOOKUP($C37,invullijst!$A$11:$M$185,8,FALSE))","v":80},{"$f":"IF(VLOOKUP($C37,invullijst!$A$11:$M$185,9,FALSE)=\"\",\"\",VLOOKUP($C37,invullijst!$A$11:$M$185,9,FALSE))","v":84},{"$f":"IF(VLOOKUP($C37,invullijst!$A$11:$M$185,10,FALSE)=\"\",\"\",VLOOKUP($C37,invullijst!$A$11:$M$185,10,FALSE))","v":"x"},248,{"$f":"IF(VLOOKUP($C37,invullijst!$A$11:$M$185,11,FALSE)=\"\",\"\",VLOOKUP($C37,invullijst!$A$11:$M$185,11,FALSE))","v":43}]
[null,15,408,{"$f":"IF(VLOOKUP($C38,invullijst!$A$11:$M$185,4,FALSE)=\"\",\"\",VLOOKUP($C38,invullijst!$A$11:$M$185,4,FALSE))","v":"vr"},{"$f":"IF(VLOOKUP($C38,invullijst!$A$11:$M$185,2,FALSE)=\"\",\"\",VLOOKUP($C38,invullijst!$A$11:$M$185,2,FALSE))","v":"Rudy van Falier"},{"$f":"IF(VLOOKUP($C38,invullijst!$A$11:$M$185,3,FALSE)=\"\",\"\",VLOOKUP($C38,invullijst!$A$11:$M$185,3,FALSE))","v":"Haarsteeg"},{"$f":"IF(VLOOKUP(C38,invullijst!$A$11:$M$185,6,FALSE)=\"\",\"\",VLOOKUP(C38,invullijst!$A$11:$M$185,6,FALSE))","v":81},{"$f":"IF(VLOOKUP($C38,invullijst!$A$11:$M$185,7,FALSE)=\"\",\"\",VLOOKUP($C38,invullijst!$A$11:$M$185,7,FALSE))","v":"x"},{"$f":"IF(VLOOKUP($C38,invullijst!$A$11:$M$185,8,FALSE)=\"\",\"\",VLOOKUP($C38,invullijst!$A$11:$M$185,8,FALSE))","v":84},{"$f":"IF(VLOOKUP($C38,invullijst!$A$11:$M$185,9,FALSE)=\"\",\"\",VLOOKUP($C38,invullijst!$A$11:$M$185,9,FALSE))","v":82},{"$f":"IF(VLOOKUP($C38,invullijst!$A$11:$M$185,10,FALSE)=\"\",\"\",VLOOKUP($C38,invullijst!$A$11:$M$185,10,FALSE))","v":"x"},247,{"$f":"IF(VLOOKUP($C38,invullijst!$A$11:$M$185,11,FALSE)=\"\",\"\",VLOOKUP($C38,invullijst!$A$11:$M$185,11,FALSE))","v":38}]
[null,16,103,{"$f":"IF(VLOOKUP($C39,invullijst!$A$11:$M$185,4,FALSE)=\"\",\"\",VLOOKUP($C39,invullijst!$A$11:$M$185,4,FALSE))","v":"vr"},{"$f":"IF(VLOOKUP($C39,invullijst!$A$11:$M$185,2,FALSE)=\"\",\"\",VLOOKUP($C39,invullijst!$A$11:$M$185,2,FALSE))","v":"Norbert van Buul"},{"$f":"IF(VLOOKUP($C39,invullijst!$A$11:$M$185,3,FALSE)=\"\",\"\",VLOOKUP($C39,invullijst!$A$11:$M$185,3,FALSE))","v":"Baardwijk"},{"$f":"IF(VLOOKUP(C39,invullijst!$A$11:$M$185,6,FALSE)=\"\",\"\",VLOOKUP(C39,invullijst!$A$11:$M$185,6,FALSE))","v":"x"},{"$f":"IF(VLOOKUP($C39,invullijst!$A$11:$M$185,7,FALSE)=\"\",\"\",VLOOKUP($C39,invullijst!$A$11:$M$185,7,FALSE))","v":55},{"$f":"IF(VLOOKUP($C39,invullijst!$A$11:$M$185,8,FALSE)=\"\",\"\",VLOOKUP($C39,invullijst!$A$11:$M$185,8,FALSE))","v":65},{"$f":"IF(VLOOKUP($C39,invullijst!$A$11:$M$185,9,FALSE)=\"\",\"\",VLOOKUP($C39,invullijst!$A$11:$M$185,9,FALSE))","v":63},{"$f":"IF(VLOOKUP($C39,invullijst!$A$11:$M$185,10,FALSE)=\"\",\"\",VLOOKUP($C39,invullijst!$A$11:$M$185,10,FALSE))","v":59},242,{"$f":"IF(VLOOKUP($C39,invullijst!$A$11:$M$185,11,FALSE)=\"\",\"\",VLOOKUP($C39,invullijst!$A$11:$M$185,11,FALSE))","v":28}]
[null,17,206,{"$f":"IF(VLOOKUP($C40,invullijst!$A$11:$M$185,4,FALSE)=\"\",\"\",VLOOKUP($C40,invullijst!$A$11:$M$185,4,FALSE))","v":"vr"},{"$f":"IF(VLOOKUP($C40,invullijst!$A$11:$M$185,2,FALSE)=\"\",\"\",VLOOKUP($C40,invullijst!$A$11:$M$185,2,FALSE))","v":"Kees van Hulten"},{"$f":"IF(VLOOKUP($C40,invullijst!$A$11:$M$185,3,FALSE)=\"\",\"\",VLOOKUP($C40,invullijst!$A$11:$M$185,3,FALSE))","v":"Besoijen"},{"$f":"IF(VLOOKUP($C40,invullijst!$A$11:$M$185,6,FALSE)=\"\",\"\",VLOOKUP($C40,invullijst!$A$11:$M$185,6,FALSE))","v":73},{"$f":"IF(VLOOKUP($C40,invullijst!$A$11:$M$185,7,FALSE)=\"\",\"\",VLOOKUP($C40,invullijst!$A$11:$M$185,7,FALSE))","v":83},{"$f":"IF(VLOOKUP($C40,invullijst!$A$11:$M$185,8,FALSE)=\"\",\"\",VLOOKUP($C40,invullijst!$A$11:$M$185,8,FALSE))","v":78},{"$f":"IF(VLOOKUP($C40,invullijst!$A$11:$M$185,9,FALSE)=\"\",\"\",VLOOKUP($C40,invullijst!$A$11:$M$185,9,FALSE))","v":"x"},{"$f":"IF(VLOOKUP($C40,invullijst!$A$11:$M$185,10,FALSE)=\"\",\"\",VLOOKUP($C40,invullijst!$A$11:$M$185,10,FALSE))","v":"x"},234,{"$f":"IF(VLOOKUP($C40,invullijst!$A$11:$M$185,11,FALSE)=\"\",\"\",VLOOKUP($C40,invullijst!$A$11:$M$185,11,FALSE))","v":41}]
[null,18,304,{"$f":"IF(VLOOKUP($C41,invullijst!$A$11:$M$185,4,FALSE)=\"\",\"\",VLOOKUP($C41,invullijst!$A$11:$M$185,4,FALSE))","v":"vr"},{"$f":"IF(VLOOKUP($C41,invullijst!$A$11:$M$185,2,FALSE)=\"\",\"\",VLOOKUP($C41,invullijst!$A$11:$M$185,2,FALSE))","v":"Henk Bruurmijn "},{"$f":"IF(VLOOKUP($C41,invullijst!$A$11:$M$185,3,FALSE)=\"\",\"\",VLOOKUP($C41,invullijst!$A$11:$M$185,3,FALSE))","v":"Elshout"},{"$f":"IF(VLOOKUP(C41,invullijst!$A$11:$M$185,6,FALSE)=\"\",\"\",VLOOKUP(C41,invullijst!$A$11:$M$185,6,FALSE))","v":80},{"$f":"IF(VLOOKUP($C41,invullijst!$A$11:$M$185,7,FALSE)=\"\",\"\",VLOOKUP($C41,invullijst!$A$11:$M$185,7,FALSE))","v":62},null,{"$f":"IF(VLOOKUP($C41,invullijst!$A$11:$M$185,9,FALSE)=\"\",\"\",VLOOKUP($C41,invullijst!$A$11:$M$185,9,FALSE))","v":82},{"$f":"IF(VLOOKUP($C41,invullijst!$A$11:$M$185,10,FALSE)=\"\",\"\",VLOOKUP($C41,invullijst!$A$11:$M$185,10,FALSE))","v":"x"},224,{"$f":"IF(VLOOKUP($C41,invullijst!$A$11:$M$185,11,FALSE)=\"\",\"\",VLOOKUP($C41,invullijst!$A$11:$M$185,11,FALSE))","v":43}]
[null,19,519,{"$f":"IF(VLOOKUP($C42,invullijst!$A$11:$M$185,4,FALSE)=\"\",\"\",VLOOKUP($C42,invullijst!$A$11:$M$185,4,FALSE))","v":"vr"},{"$f":"IF(VLOOKUP($C42,invullijst!$A$11:$M$185,2,FALSE)=\"\",\"\",VLOOKUP($C42,invullijst!$A$11:$M$185,2,FALSE))","v":"Frank Derissen"},{"$f":"IF(VLOOKUP($C42,invullijst!$A$11:$M$185,3,FALSE)=\"\",\"\",VLOOKUP($C42,invullijst!$A$11:$M$185,3,FALSE))","v":"Kaatsheuvel"},{"$f":"IF(VLOOKUP(C42,invullijst!$A$11:$M$185,6,FALSE)=\"\",\"\",VLOOKUP(C42,invullijst!$A$11:$M$185,6,FALSE))","v":"x"},{"$f":"IF(VLOOKUP($C42,invullijst!$A$11:$M$185,7,FALSE)=\"\",\"\",VLOOKUP($C42,invullijst!$A$11:$M$185,7,FALSE))","v":"x"},{"$f":"IF(VLOOKUP($C42,invullijst!$A$11:$M$185,8,FALSE)=\"\",\"\",VLOOKUP($C42,invullijst!$A$11:$M$185,8,FALSE))","v":"x"},{"$f":"IF(VLOOKUP($C42,invullijst!$A$11:$M$185,9,FALSE)=\"\",\"\",VLOOKUP($C42,invullijst!$A$11:$M$185,9,FALSE))","v":75},{"$f":"IF(VLOOKUP($C42,invullijst!$A$11:$M$185,10,FALSE)=\"\",\"\",VLOOKUP($C42,invullijst!$A$11:$M$185,10,FALSE))","v":76},151,{"$f":"IF(VLOOKUP($C42,invullijst!$A$11:$M$185,11,FALSE)=\"\",\"\",VLOOKUP($C42,invullijst!$A$11:$M$185,11,FALSE))","v":""}]
[null,20,416,{"$f":"IF(VLOOKUP($C43,invullijst!$A$11:$M$185,4,FALSE)=\"\",\"\",VLOOKUP($C43,invullijst!$A$11:$M$185,4,FALSE))","v":"vr"},{"$f":"IF(VLOOKUP($C43,invullijst!$A$11:$M$185,2,FALSE)=\"\",\"\",VLOOKUP($C43,invullijst!$A$11:$M$185,2,FALSE))","v":"Thijs Koks"},{"$f":"IF(VLOOKUP($C43,invullijst!$A$11:$M$185,3,FALSE)=\"\",\"\",VLOOKUP($C43,invullijst!$A$11:$M$185,3,FALSE))","v":"Haarsteeg"},{"$f":"IF(VLOOKUP(C43,invullijst!$A$11:$M$185,6,FALSE)=\"\",\"\",VLOOKUP(C43,invullijst!$A$11:$M$185,6,FALSE))","v":"x"},{"$f":"IF(VLOOKUP($C43,invullijst!$A$11:$M$185,7,FALSE)=\"\",\"\",VLOOKUP($C43,invullijst!$A$11:$M$185,7,FALSE))","v":"x"},{"$f":"IF(VLOOKUP($C43,invullijst!$A$11:$M$185,8,FALSE)=\"\",\"\",VLOOKUP($C43,invullijst!$A$11:$M$185,8,FALSE))","v":"x"},{"$f":"IF(VLOOKUP($C43,invullijst!$A$11:$M$185,9,FALSE)=\"\",\"\",VLOOKUP($C43,invullijst!$A$11:$M$185,9,FALSE))","v":"x"},{"$f":"IF(VLOOKUP($C43,invullijst!$A$11:$M$185,10,FALSE)=\"\",\"\",VLOOKUP($C43,invullijst!$A$11:$M$185,10,FALSE))","v":92},92,{"$f":"IF(VLOOKUP($C43,invullijst!$A$11:$M$185,11,FALSE)=\"\",\"\",VLOOKUP($C43,invullijst!$A$11:$M$185,11,FALSE))","v":""}]
[null,21,311,{"$f":"IF(VLOOKUP($C44,invullijst!$A$11:$M$185,4,FALSE)=\"\",\"\",VLOOKUP($C44,invullijst!$A$11:$M$185,4,FALSE))","v":"vr"},{"$f":"IF(VLOOKUP($C44,invullijst!$A$11:$M$185,2,FALSE)=\"\",\"\",VLOOKUP($C44,invullijst!$A$11:$M$185,2,FALSE))","v":"Ton Kolmans"},{"$f":"IF(VLOOKUP($C44,invullijst!$A$11:$M$185,3,FALSE)=\"\",\"\",VLOOKUP($C44,invullijst!$A$11:$M$185,3,FALSE))","v":"Elshout"},{"$f":"IF(VLOOKUP(C44,invullijst!$A$11:$M$185,6,FALSE)=\"\",\"\",VLOOKUP(C44,invullijst!$A$11:$M$185,6,FALSE))","v":77},{"$f":"IF(VLOOKUP($C44,invullijst!$A$11:$M$185,7,FALSE)=\"\",\"\",VLOOKUP($C44,invullijst!$A$11:$M$185,7,FALSE))","v":"x"},null,{"$f":"IF(VLOOKUP($C44,invullijst!$A$11:$M$185,9,FALSE)=\"\",\"\",VLOOKUP($C44,invullijst!$A$11:$M$185,9,FALSE))","v":"x"},{"$f":"IF(VLOOKUP($C44,invullijst!$A$11:$M$185,10,FALSE)=\"\",\"\",VLOOKUP($C44,invullijst!$A$11:$M$185,10,FALSE))","v":"x"},77,{"$f":"IF(VLOOKUP($C44,invullijst!$A$11:$M$185,11,FALSE)=\"\",\"\",VLOOKUP($C44,invullijst!$A$11:$M$185,11,FALSE))","v":""}]
[{"$nulls":3},{"$f":"IF(VLOOKUP($C45,invullijst!$A$11:$M$185,4,FALSE)=\"\",\"\",VLOOKUP($C45,invullijst!$A$11:$M$185,4,FALSE))","v":0},{"$f":"IF(VLOOKUP($C45,invullijst!$A$11:$M$185,2,FALSE)=\"\",\"\",VLOOKUP($C45,invullijst!$A$11:$M$185,2,FALSE))","v":0},{"$f":"IF(VLOOKUP($C45,invullijst!$A$11:$M$185,3,FALSE)=\"\",\"\",VLOOKUP($C45,invullijst!$A$11:$M$185,3,FALSE))","v":0},{"$f":"IF(VLOOKUP(C45,invullijst!$A$11:$M$185,6,FALSE)=\"\",\"\",VLOOKUP(C45,invullijst!$A$11:$M$185,6,FALSE))","v":0},{"$f":"IF(VLOOKUP($C45,invullijst!$A$11:$M$185,7,FALSE)=\"\",\"\",VLOOKUP($C45,invullijst!$A$11:$M$185,7,FALSE))","v":0},{"$f":"IF(VLOOKUP($C45,invullijst!$A$11:$M$185,8,FALSE)=\"\",\"\",VLOOKUP($C45,invullijst!$A$11:$M$185,8,FALSE))","v":0},{"$f":"IF(VLOOKUP($C45,invullijst!$A$11:$M$185,9,FALSE)=\"\",\"\",VLOOKUP($C45,invullijst!$A$11:$M$185,9,FALSE))","v":0},{"$f":"IF(VLOOKUP($C45,invullijst!$A$11:$M$185,10,FALSE)=\"\",\"\",VLOOKUP($C45,invullijst!$A$11:$M$185,10,FALSE))","v":0},0,{"$f":"IF(VLOOKUP($C45,invullijst!$A$11:$M$185,11,FALSE)=\"\",\"\",VLOOKUP($C45,invullijst!$A$11:$M$185,11,FALSE))","v":0}]
[{"$nulls":3},{"$f":"IF(VLOOKUP($C46,invullijst!$A$11:$M$185,4,FALSE)=\"\",\"\",VLOOKUP($C46,invullijst!$A$11:$M$185,4,FALSE))","v":0},{"$f":"IF(VLOOKUP($C46,invullijst!$A$11:$M$185,2,FALSE)=\"\",\"\",VLOOKUP($C46,invullijst!$A$11:$M$185,2,FALSE))","v":0},{"$f":"IF(VLOOKUP($C46,invullijst!$A$11:$M$185,3,FALSE)=\"\",\"\",VLOOKUP($C46,invullijst!$A$11:$M$185,3,FALSE))","v":0},{"$f":"IF(VLOOKUP(C46,invullijst!$A$11:$M$185,6,FALSE)=\"\",\"\",VLOOKUP(C46,invullijst!$A$11:$M$185,6,FALSE))","v":0},{"$f":"IF(VLOOKUP($C46,invullijst!$A$11:$M$185,7,FALSE)=\"\",\"\",VLOOKUP($C46,invullijst!$A$11:$M$185,7,FALSE))","v":0},{"$f":"IF(VLOOKUP($C46,invullijst!$A$11:$M$185,8,FALSE)=\"\",\"\",VLOOKUP($C46,invullijst!$A$11:$M$185,8,FALSE))","v":0},{"$f":"IF(VLOOKUP($C46,invullijst!$A$11:$M$185,9,FALSE)=\"\",\"\",VLOOKUP($C46,invullijst!$A$11:$M$185,9,FALSE))","v":0},{"$f":"IF(VLOOKUP($C46,invullijst!$A$11:$M$185,10,FALSE)=\"\",\"\",VLOOKUP($C46,invullijst!$A$11:$M$185,10,FALSE))","v":0},0,{"$f":"IF(VLOOKUP($C46,invullijst!$A$11:$M$185,11,FALSE)=\"\",\"\",VLOOKUP($C46,invullijst!$A$11:$M$185,11,FALSE))","v":0}]
[{"$nulls":3},{"$f":"IF(VLOOKUP($C47,invullijst!$A$11:$M$185,4,FALSE)=\"\",\"\",VLOOKUP($C47,invullijst!$A$11:$M$185,4,FALSE))","v":0},{"$f":"IF(VLOOKUP($C47,invullijst!$A$11:$M$185,2,FALSE)=\"\",\"\",VLOOKUP($C47,invullijst!$A$11:$M$185,2,FALSE))","v":0},{"$f":"IF(VLOOKUP($C47,invullijst!$A$11:$M$185,3,FALSE)=\"\",\"\",VLOOKUP($C47,invullijst!$A$11:$M$185,3,FALSE))","v":0},{"$f":"IF(VLOOKUP(C47,invullijst!$A$11:$M$185,6,FALSE)=\"\",\"\",VLOOKUP(C47,invullijst!$A$11:$M$185,6,FALSE))","v":0},{"$f":"IF(VLOOKUP($C47,invullijst!$A$11:$M$185,7,FALSE)=\"\",\"\",VLOOKUP($C47,invullijst!$A$11:$M$185,7,FALSE))","v":0},{"$f":"IF(VLOOKUP($C47,invullijst!$A$11:$M$185,8,FALSE)=\"\",\"\",VLOOKUP($C47,invullijst!$A$11:$M$185,8,FALSE))","v":0},{"$f":"IF(VLOOKUP($C47,invullijst!$A$11:$M$185,9,FALSE)=\"\",\"\",VLOOKUP($C47,invullijst!$A$11:$M$185,9,FALSE))","v":0},{"$f":"IF(VLOOKUP($C47,invullijst!$A$11:$M$185,10,FALSE)=\"\",\"\",VLOOKUP($C47,invullijst!$A$11:$M$185,10,FALSE))","v":0},0,{"$f":"IF(VLOOKUP($C47,invullijst!$A$11:$M$185,11,FALSE)=\"\",\"\",VLOOKUP($C47,invullijst!$A$11:$M$185,11,FALSE))","v":0}]
[{"$nulls":3},{"$f":"IF(VLOOKUP($C48,invullijst!$A$11:$M$185,4,FALSE)=\"\",\"\",VLOOKUP($C48,invullijst!$A$11:$M$185,4,FALSE))","v":0},{"$f":"IF(VLOOKUP($C48,invullijst!$A$11:$M$185,2,FALSE)=\"\",\"\",VLOOKUP($C48,invullijst!$A$11:$M$185,2,FALSE))","v":0},{"$f":"IF(VLOOKUP($C48,invullijst!$A$11:$M$185,3,FALSE)=\"\",\"\",VLOOKUP($C48,invullijst!$A$11:$M$185,3,FALSE))","v":0},{"$f":"IF(VLOOKUP(C48,invullijst!$A$11:$M$185,6,FALSE)=\"\",\"\",VLOOKUP(C48,invullijst!$A$11:$M$185,6,FALSE))","v":0},{"$f":"IF(VLOOKUP($C48,invullijst!$A$11:$M$185,7,FALSE)=\"\",\"\",VLOOKUP($C48,invullijst!$A$11:$M$185,7,FALSE))","v":0},{"$f":"IF(VLOOKUP($C48,invullijst!$A$11:$M$185,8,FALSE)=\"\",\"\",VLOOKUP($C48,invullijst!$A$11:$M$185,8,FALSE))","v":0},{"$f":"IF(VLOOKUP($C48,invullijst!$A$11:$M$185,9,FALSE)=\"\",\"\",VLOOKUP($C48,invullijst!$A$11:$M$185,9,FALSE))","v":0},{"$f":"IF(VLOOKUP($C48,invullijst!$A$11:$M$185,10,FALSE)=\"\",\"\",VLOOKUP($C48,invullijst!$A$11:$M$185,10,FALSE))","v":0},0,{"$f":"IF(VLOOKUP($C48,invullijst!$A$11:$M$185,11,FALSE)=\"\",\"\",VLOOKUP($C48,invullijst!$A$11:$M$185,11,FALSE))","v":0}]
[{"$nulls":3},{"$f":"IF(VLOOKUP($C49,invullijst!$A$11:$M$185,4,FALSE)=\"\",\"\",VLOOKUP($C49,invullijst!$A$11:$M$185,4,FALSE))","v":0},{"$f":"IF(VLOOKUP($C49,invullijst!$A$11:$M$185,2,FALSE)=\"\",\"\",VLOOKUP($C49,invullijst!$A$11:$M$185,2,FALSE))","v":0},{"$f":"IF(VLOOKUP($C49,invullijst!$A$11:$M$185,3,FALSE)=\"\",\"\",VLOOKUP($C49,invullijst!$A$11:$M$185,3,FALSE))","v":0},{"$f":"IF(VLOOKUP(C49,invullijst!$A$11:$M$185,6,FALSE)=\"\",\"\",VLOOKUP(C49,invullijst!$A$11:$M$185,6,FALSE))","v":0},{"$f":"IF(VLOOKUP($C49,invullijst!$A$11:$M$185,7,FALSE)=\"\",\"\",VLOOKUP($C49,invullijst!$A$11:$M$185,7,FALSE))","v":0},{"$f":"IF(VLOOKUP($C49,invullijst!$A$11:$M$185,8,FALSE)=\"\",\"\",VLOOKUP($C49,invullijst!$A$11:$M$185,8,FALSE))","v":0},{"$f":"IF(VLOOKUP($C49,invullijst!$A$11:$M$185,9,FALSE)=\"\",\"\",VLOOKUP($C49,invullijst!$A$11:$M$185,9,FALSE))","v":0},{"$f":"IF(VLOOKUP($C49,invullijst!$A$11:$M$185,10,FALSE)=\"\",\"\",VLOOKUP($C49,invullijst!$A$11:$M$185,10,FALSE))","v":0},0,{"$f":"IF(VLOOKUP($C49,invullijst!$A$11:$M$185,11,FALSE)=\"\",\"\",VLOOKUP($C49,invullijst!$A$11:$M$185,11,FALSE))","v":0}]
[{"$nulls":3},{"$f":"IF(VLOOKUP($C50,invullijst!$A$11:$M$185,4,FALSE)=\"\",\"\",VLOOKUP($C50,invullijst!$A$11:$M$185,4,FALSE))","v":0},{"$f":"IF(VLOOKUP($C50,invullijst!$A$11:$M$185,2,FALSE)=\"\",\"\",VLOOKUP($C50,invullijst!$A$11:$M$185,2,FALSE))","v":0},{"$f":"IF(VLOOKUP($C50,invullijst!$A$11:$M$185,3,FALSE)=\"\",\"\",VLOOKUP($C50,invullijst!$A$11:$M$185,3,FALSE))","v":0},{"$f":"IF(VLOOKUP(C50,invullijst!$A$11:$M$185,6,FALSE)=\"\",\"\",VLOOKUP(C50,invullijst!$A$11:$M$185,6,FALSE))","v":0},{"$f":"IF(VLOOKUP($C50,invullijst!$A$11:$M$185,7,FALSE)=\"\",\"\",VLOOKUP($C50,invullijst!$A$11:$M$185,7,FALSE))","v":0},{"$f":"IF(VLOOKUP($C50,invullijst!$A$11:$M$185,8,FALSE)=\"\",\"\",VLOOKUP($C50,invullijst!$A$11:$M$185,8,FALSE))","v":0},{"$f":"IF(VLOOKUP($C50,invullijst!$A$11:$M$185,9,FALSE)=\"\",\"\",VLOOKUP($C50,invullijst!$A$11:$M$185,9,FALSE))","v":0},{"$f":"IF(VLOOKUP($C50,invullijst!$A$11:$M$185,10,FALSE)=\"\",\"\",VLOOKUP($C50,invullijst!$A$11:$M$185,10,FALSE))","v":0},0,{"$f":"IF(VLOOKUP($C50,invullijst!$A$11:$M$185,11,FALSE)=\"\",\"\",VLOOKUP($C50,invullijst!$A$11:$M$185,11,FALSE))","v":0}]
[{"$nulls":3},{"$f":"IF(VLOOKUP($C51,invullijst!$A$11:$M$185,4,FALSE)=\"\",\"\",VLOOKUP($C51,invullijst!$A$11:$M$185,4,FALSE))","v":0}]
[{"$nulls":3},{"$f":"IF(VLOOKUP($C52,invullijst!$A$11:$M$185,4,FALSE)=\"\",\"\",VLOOKUP($C52,invullijst!$A$11:$M$185,4,FALSE))","v":0}]
[{"$nulls":3},{"$f":"IF(VLOOKUP($C53,invullijst!$A$11:$M$185,4,FALSE)=\"\",\"\",VLOOKUP($C53,invullijst!$A$11:$M$185,4,FALSE))","v":0}]
[{"$nulls":3},{"$f":"IF(VLOOKUP($C54,invullijst!$A$11:$M$185,4,FALSE)=\"\",\"\",VLOOKUP($C54,invullijst!$A$11:$M$185,4,FALSE))","v":0}]
[{"$nulls":3},{"$f":"IF(VLOOKUP($C55,invullijst!$A$11:$M$185,4,FALSE)=\"\",\"\",VLOOKUP($C55,invullijst!$A$11:$M$185,4,FALSE))","v":0}]

{"sheet":"Jeugd","index":2,"n_rows":14,"n_cols":13,"rows_kept":14,"merged":[[0,0,1,5],[0,6,0,9],[0,10,0,12],[1,6,1,12],[2,0,2,5],[2,6,2,10]]}
["JEUGD",{"$nulls":5},{"$f":"invullijst!F1","v":"Organistatie"},{"$nulls":3},{"$f":"invullijst!H2","v":"2024 - 2025"}]
[{"$nulls":6},{"$f":"invullijst!F3","v":"O.L.V. Schuts Elshout"}]
["alleen in de gele kolom nummer schutter invullen",{"$nulls":5},"wedstrijd",{"$nulls":5},"KAMP-"]
["KL",null,"schutter",null,"NAAM","PLAATS",1,2,3,4,5,"TOTAAL","KAART"]
["A",1,221,{"$f":"IF(VLOOKUP($C5,invullijst!$A$11:$M$185,4,FALSE)=\"\",\"\",VLOOKUP($C5,invullijst!$A$11:$M$185,4,FALSE))","v":"J"},{"$f":"IF(VLOOKUP($C5,invullijst!$A$11:$M$185,2,FALSE)=\"\",\"\",VLOOKUP($C5,invullijst!$A$11:$M$185,2,FALSE))","v":"Mees Huijben"},{"$f":"IF(VLOOKUP($C5,invullijst!$A$11:$M$185,3,FALSE)=\"\",\"\",VLOOKUP($C5,invullijst!$A$11:$M$185,3,FALSE))","v":"Besoijen"},{"$f":"IF(VLOOKUP($C5,invullijst!$A$11:$M$185,6,FALSE)=\"\",\"\",VLOOKUP($C5,invullijst!$A$11:$M$185,6,FALSE))","v":63},{"$f":"IF(VLOOKUP($C5,invullijst!$A$11:$M$185,7,FALSE)=\"\",\"\",VLOOKUP($C5,invullijst!$A$11:$M$185,7,FALSE))","v":79},{"$f":"IF(VLOOKUP($C5,invullijst!$A$11:$M$185,8,FALSE)=\"\",\"\",VLOOKUP($C5,invullijst!$A$11:$M$185,8,FALSE))","v":74},{"$f":"IF(VLOOKUP($C5,invullijst!$A$11:$M$185,9,FALSE)=\"\",\"\",VLOOKUP($C5,invullijst!$A$11:$M$185,9,FALSE))","v":"x"},{"$f":"IF(VLOOKUP($C5,invullijst!$A$11:$M$185,10,FALSE)=\"\",\"\",VLOOKUP($C5,invullijst!$A$11:$M$185,10,FALSE))","v":75},{"$f":"SUM(G5:K5)","v":291},{"$f":"IF(VLOOKUP($C5,invullijst!$A$11:$M$185,11,FALSE)=\"\",\"\",VLOOKUP($C5,invullijst!$A$11:$M$185,11,FALSE))","v":36}]
[null,2,312,{"$f":"IF(VLOOKUP($C6,invullijst!$A$11:$M$185,4,FALSE)=\"\",\"\",VLOOKUP($C6,invullijst!$A$11:$M$185,4,FALSE))","v":"J"},{"$f":"IF(VLOOKUP($C6,invullijst!$A$11:$M$185,2,FALSE)=\"\",\"\",VLOOKUP($C6,invullijst!$A$11:$M$185,2,FALSE))","v":"Floor de Jong"},{"$f":"IF(VLOOKUP($C6,invullijst!$A$11:$M$185,3,FALSE)=\"\",\"\",VLOOKUP($C6,invullijst!$A$11:$M$185,3,FALSE))","v":"Elshout"},{"$f":"IF(VLOOKUP($C6,invullijst!$A$11:$M$185,6,FALSE)=\"\",\"\",VLOOKUP($C6,invullijst!$A$11:$M$185,6,FALSE))","v":95},{"$f":"IF(VLOOKUP($C6,invullijst!$A$11:$M$185,7,FALSE)=\"\",\"\",VLOOKUP($C6,invullijst!$A$11:$M$185,7,FALSE))","v":91},{"$f":"IF(VLOOKUP($C6,invullijst!$A$11:$M$185,8,FALSE)=\"\",\"\",VLOOKUP($C6,invullijst!$A$11:$M$185,8,FALSE))","v":92},{"$f":"IF(VLOOKUP($C6,invullijst!$A$11:$M$185,9,FALSE)=\"\",\"\",VLOOKUP($C6,invullijst!$A$11:$M$185,9,FALSE))","v":""},{"$f":"IF(VLOOKUP($C6,invullijst!$A$11:$M$185,10,FALSE)=\"\",\"\",VLOOKUP($C6,invullijst!$A$11:$M$185,10,FALSE))","v":"x"},{"$f":"SUM(G6:K6)","v":278},{"$f":"IF(VLOOKUP($C6,invullijst!$A$11:$M$185,11,FALSE)=\"\",\"\",VLOOKUP($C6,invullijst!$A$11:$M$185,11,FALSE))","v":44}]
[null,3,null,{"$f":"IF(VLOOKUP($C7,invullijst!$A$11:$M$185,4,FALSE)=\"\",\"\",VLOOKUP($C7,invullijst!$A$11:$M$185,4,FALSE))","v":0},{"$f":"IF(VLOOKUP($C7,invullijst!$A$11:$M$185,2,FALSE)=\"\",\"\",VLOOKUP($C7,invullijst!$A$11:$M$185,2,FALSE))","v":0},{"$f":"IF(VLOOKUP($C7,invullijst!$A$11:$M$185,3,FALSE)=\"\",\"\",VLOOKUP($C7,invullijst!$A$11:$M$185,3,FALSE))","v":0},{"$f":"IF(VLOOKUP($C7,invullijst!$A$11:$M$185,6,FALSE)=\"\",\"\",VLOOKUP($C7,invullijst!$A$11:$M$185,6,FALSE))","v":0},{"$f":"IF(VLOOKUP($C7,invullijst!$A$11:$M$185,7,FALSE)=\"\",\"\",VLOOKUP($C7,invullijst!$A$11:$M$185,7,FALSE))","v":0},{"$f":"IF(VLOOKUP($C7,invullijst!$A$11:$M$185,8,FALSE)=\"\",\"\",VLOOKUP($C7,invullijst!$A$11:$M$185,8,FALSE))","v":0},{"$f":"IF(VLOOKUP($C7,invullijst!$A$11:$M$185,9,FALSE)=\"\",\"\",VLOOKUP($C7,invullijst!$A$11:$M$185,9,FALSE))","v":0},{"$f":"IF(VLOOKUP($C7,invullijst!$A$11:$M$185,10,FALSE)=\"\",\"\",VLOOKUP($C7,invullijst!$A$11:$M$185,10,FALSE))","v":0},{"$f":"SUM(G7:K7)","v":0},{"$f":"IF(VLOOKUP($C7,invullijst!$A$11:$M$185,11,FALSE)=\"\",\"\",VLOOKUP($C7,invullijst!$A$11:$M$185,11,FALSE))","v":0}]
[null,4,null,{"$f":"IF(VLOOKUP($C8,invullijst!$A$11:$M$185,4,FALSE)=\"\",\"\",VLOOKUP($C8,invullijst!$A$11:$M$185,4,FALSE))","v":0},{"$f":"IF(VLOOKUP($C8,invullijst!$A$11:$M$185,2,FALSE)=\"\",\"\",VLOOKUP($C8,invullijst!$A$11:$M$185,2,FALSE))","v":0},{"$f":"IF(VLOOKUP($C8,invullijst!$A$11:$M$185,3,FALSE)=\"\",\"\",VLOOKUP($C8,invullijst!$A$11:$M$185,3,FALSE))","v":0},{"$f":"IF(VLOOKUP($C8,invullijst!$A$11:$M$185,6,FALSE)=\"\",\"\",VLOOKUP($C8,invullijst!$A$11:$M$185,6,FALSE))","v":0},{"$f":"IF(VLOOKUP($C8,invullijst!$A$11:$M$185,7,FALSE)=\"\",\"\",VLOOKUP($C8,invullijst!$A$11:$M$185,7,FALSE))","v":0},{"$f":"IF(VLOOKUP($C8,invullijst!$A$11:$M$185,8,FALSE)=\"\",\"\",VLOOKUP($C8,invullijst!$A$11:$M$185,8,FALSE))","v":0},{"$f":"IF(VLOOKUP($C8,invullijst!$A$11:$M$185,9,FALSE)=\"\",\"\",VLOOKUP($C8,invullijst!$A$11:$M$185,9,FALSE))","v":0},{"$f":"IF(VLOOKUP($C8,invullijst!$A$11:$M$185,10,FALSE)=\"\",\"\",VLOOKUP($C8,invullijst!$A$11:$M$185,10,FALSE))","v":0},{"$f":"SUM(G8:K8)","v":0},{"$f":"IF(VLOOKUP($C8,invullijst!$A$11:$M$185,11,FALSE)=\"\",\"\",VLOOKUP($C8,invullijst!$A$11:$M$185,11,FALSE))","v":0}]
[{"$nulls":3},{"$f":"IF(VLOOKUP($C9,invullijst!$A$11:$M$185,4,FALSE)=\"\",\"\",VLOOKUP($C9,invullijst!$A$11:$M$185,4,FALSE))","v":0}]
[{"$nulls":3},{"$f":"IF(VLOOKUP($C10,invullijst!$A$11:$M$185,4,FALSE)=\"\",\"\",VLOOKUP($C10,invullijst!$A$11:$M$185,4,FALSE))","v":0}]
[{"$nulls":3},{"$f":"IF(VLOOKUP($C11,invullijst!$A$11:$M$185,4,FALSE)=\"\",\"\",VLOOKUP($C11,invullijst!$A$11:$M$185,4,FALSE))","v":0}]
[{"$nulls":3},{"$f":"IF(VLOOKUP($C12,invullijst!$A$11:$M$185,4,FALSE)=\"\",\"\",VLOOKUP($C12,invullijst!$A$11:$M$185,4,FALSE))","v":0}]
[{"$nulls":3},{"$f":"IF(VLOOKUP($C13,invullijst!$A$11:$M$185,4,FALSE)=\"\",\"\",VLOOKUP($C13,invullijst!$A$11:$M$185,4,FALSE))","v":0}]
[{"$nulls":3},{"$f":"IF(VLOOKUP($C14,invullijst!$A$11:$M$185,4,FALSE)=\"\",\"\",VLOOKUP($C14,invullijst!$A$11:$M$185,4,FALSE))","v":0}]

{"sheet":"65+","index":3,"n_rows":34,"n_cols":13,"rows_kept":34,"merged":[[0,0,1,5],[0,6,0,9],[0,10,0,12],[1,6,1,12],[2,0,2,5],[2,6,2,10]]}
["65+",{"$nulls":5},{"$f":"invullijst!F1","v":"Organistatie"},{"$nulls":3},{"$f":"invullijst!H2","v":"2024 - 2025"}]
[{"$nulls":6},{"$f":"invullijst!F3","v":"O.L.V. Schuts Elshout"}]
["alleen in de gele kolom nummer schutter invullen",{"$nulls":5},"wedstrijd",{"$nulls":5},"KAMP-"]
["KL.",null,"schutter",null,"NAAM","PLAATS",1,2,3,4,5,"TOTAAL","KAART"]
["A",1,405,{"$f":"IF(VLOOKUP($C5,invullijst!$A$11:$M189,4,FALSE)=\"\",\"\",VLOOKUP($C5,invullijst!$A$11:$M189,4,FALSE))","v":"65+"},{"$f":"IF(VLOOKUP($C5,invullijst!$A$11:$M189,2,FALSE)=\"\",\"\",VLOOKUP($C5,invullijst!$A$11:$M189,2,FALSE))","v":"Jan de Vaan"},{"$f":"IF(VLOOKUP($C5,invullijst!$A$11:$M$185,3,FALSE)=\"\",\"\",VLOOKUP($C5,invullijst!$A$11:$M$185,3,FALSE))","v":"Haarsteeg"},{"$f":"IF(VLOOKUP($C5,invullijst!$A$11:$M$185,6,FALSE)=\"\",\"\",VLOOKUP($C5,invullijst!$A$11:$M$185,6,FALSE))","v":98},{"$f":"IF(VLOOKUP($C5,invullijst!$A$11:$M$185,7,FALSE)=\"\",\"\",VLOOKUP($C5,invullijst!$A$11:$M$185,7,FALSE))","v":"x"},{"$f":"IF(VLOOKUP($C5,invullijst!$A$11:$M$185,8,FALSE)=\"\",\"\",VLOOKUP($C5,invullijst!$A$11:$M$185,8,FALSE))","v":97},{"$f":"IF(VLOOKUP($C5,invullijst!$A$11:$M$185,9,FALSE)=\"\",\"\",VLOOKUP($C5,invullijst!$A$11:$M$185,9,FALSE))","v":96},{"$f":"IF(VLOOKUP($C5,invullijst!$A$11:$M$185,10,FALSE)=\"\",\"\",VLOOKUP($C5,invullijst!$A$11:$M$185,10,FALSE))","v":97},{"$f":"SUM(G5:K5)","v":388},{"$f":"IF(VLOOKUP($C5,invullijst!$A$11:$M$185,11,FALSE)=\"\",\"\",VLOOKUP($C5,invullijst!$A$11:$M$185,11,FALSE))","v":48}]
[null,2,404,{"$f":"IF(VLOOKUP($C6,invullijst!$A$11:$M200,4,FALSE)=\"\",\"\",VLOOKUP($C6,invullijst!$A$11:$M200,4,FALSE))","v":"65+"},{"$f":"IF(VLOOKUP($C6,invullijst!$A$11:$M200,2,FALSE)=\"\",\"\",VLOOKUP($C6,invullijst!$A$11:$M200,2,FALSE))","v":"Gerard van Beurden"},{"$f":"IF(VLOOKUP($C6,invullijst!$A$11:$M$185,3,FALSE)=\"\",\"\",VLOOKUP($C6,invullijst!$A$11:$M$185,3,FALSE))","v":"Haarsteeg"},{"$f":"IF(VLOOKUP($C6,invullijst!$A$11:$M$185,6,FALSE)=\"\",\"\",VLOOKUP($C6,invullijst!$A$11:$M$185,6,FALSE))","v":94},{"$f":"IF(VLOOKUP($C6,invullijst!$A$11:$M$185,7,FALSE)=\"\",\"\",VLOOKUP($C6,invullijst!$A$11:$M$185,7,FALSE))","v":"x"},{"$f":"IF(VLOOKUP($C6,invullijst!$A$11:$M$185,8,FALSE)=\"\",\"\",VLOOKUP($C6,invullijst!$A$11:$M$185,8,FALSE))","v":98},{"$f":"IF(VLOOKUP($C6,invullijst!$A$11:$M$185,9,FALSE)=\"\",\"\",VLOOKUP($C6,invullijst!$A$11:$M$185,9,FALSE))","v":96},{"$f":"IF(VLOOKUP($C6,invullijst!$A$11:$M$185,10,FALSE)=\"\",\"\",VLOOKUP($C6,invullijst!$A$11:$M$185,10,FALSE))","v":97},385,{"$f":"IF(VLOOKUP($C6,invullijst!$A$11:$M$185,11,FALSE)=\"\",\"\",VLOOKUP($C6,invullijst!$A$11:$M$185,11,FALSE))","v":49}]
[null,3,401,{"$f":"IF(VLOOKUP($C7,invullijst!$A$11:$M192,4,FALSE)=\"\",\"\",VLOOKUP($C7,invullijst!$A$11:$M192,4,FALSE))","v":"65+"},{"$f":"IF(VLOOKUP($C7,invullijst!$A$11:$M193,2,FALSE)=\"\",\"\",VLOOKUP($C7,invullijst!$A$11:$M193,2,FALSE))","v":"Frans van Beurden"},{"$f":"IF(VLOOKUP($C7,invullijst!$A$11:$M$185,3,FALSE)=\"\",\"\",VLOOKUP($C7,invullijst!$A$11:$M$185,3,FALSE))","v":"Haarsteeg"},{"$f":"IF(VLOOKUP($C7,invullijst!$A$11:$M$185,6,FALSE)=\"\",\"\",VLOOKUP($C7,invullijst!$A$11:$M$185,6,FALSE))","v":95},{"$f":"IF(VLOOKUP($C7,invullijst!$A$11:$M$185,7,FALSE)=\"\",\"\",VLOOKUP($C7,invullijst!$A$11:$M$185,7,FALSE))","v":"x"},{"$f":"IF(VLOOKUP($C7,invullijst!$A$11:$M$185,8,FALSE)=\"\",\"\",VLOOKUP($C7,invullijst!$A$11:$M$185,8,FALSE))","v":98},{"$f":"IF(VLOOKUP($C7,invullijst!$A$11:$M$185,9,FALSE)=\"\",\"\",VLOOKUP($C7,invullijst!$A$11:$M$185,9,FALSE))","v":98},{"$f":"IF(VLOOKUP($C7,invullijst!$A$11:$M$185,10,FALSE)=\"\",\"\",VLOOKUP($C7,invullijst!$A$11:$M$185,10,FALSE))","v":93},384,{"$f":"IF(VLOOKUP($C7,invullijst!$A$11:$M$185,11,FALSE)=\"\",\"\",VLOOKUP($C7,invullijst!$A$11:$M$185,11,FALSE))","v":48}]
[null,4,415,{"$f":"IF(VLOOKUP($C8,invullijst!$A$11:$M190,4,FALSE)=\"\",\"\",VLOOKUP($C8,invullijst!$A$11:$M190,4,FALSE))","v":"65+"},{"$f":"IF(VLOOKUP($C8,invullijst!$A$11:$M201,2,FALSE)=\"\",\"\",VLOOKUP($C8,invullijst!$A$11:$M201,2,FALSE))","v":"Wim de Gouw"},{"$f":"IF(VLOOKUP($C8,invullijst!$A$11:$M$185,3,FALSE)=\"\",\"\",VLOOKUP($C8,invullijst!$A$11:$M$185,3,FALSE))","v":"Haarsteeg"},{"$f":"IF(VLOOKUP($C8,invullijst!$A$11:$M$185,6,FALSE)=\"\",\"\",VLOOKUP($C8,invullijst!$A$11:$M$185,6,FALSE))","v":96},{"$f":"IF(VLOOKUP($C8,invullijst!$A$11:$M$185,7,FALSE)=\"\",\"\",VLOOKUP($C8,invullijst!$A$11:$M$185,7,FALSE))","v":"x"},{"$f":"IF(VLOOKUP($C8,invullijst!$A$11:$M$185,8,FALSE)=\"\",\"\",VLOOKUP($C8,invullijst!$A$11:$M$185,8,FALSE))","v":95},{"$f":"IF(VLOOKUP($C8,invullijst!$A$11:$M$185,9,FALSE)=\"\",\"\",VLOOKUP($C8,invullijst!$A$11:$M$185,9,FALSE))","v":96},{"$f":"IF(VLOOKUP($C8,invullijst!$A$11:$M$185,10,FALSE)=\"\",\"\",VLOOKUP($C8,invullijst!$A$11:$M$185,10,FALSE))","v":94},381,{"$f":"IF(VLOOKUP($C8,invullijst!$A$11:$M$185,11,FALSE)=\"\",\"\",VLOOKUP($C8,invullijst!$A$11:$M$185,11,FALSE))","v":46}]
[null,5,412,{"$f":"IF(VLOOKUP($C9,invullijst!$A$11:$M201,4,FALSE)=\"\",\"\",VLOOKUP($C9,invullijst!$A$11:$M201,4,FALSE))","v":"65+"},{"$f":"IF(VLOOKUP($C9,invullijst!$A$11:$M195,2,FALSE)=\"\",\"\",VLOOKUP($C9,invullijst!$A$11:$M195,2,FALSE))","v":"Francien v/d Wiel"},{"$f":"IF(VLOOKUP($C9,invullijst!$A$11:$M$185,3,FALSE)=\"\",\"\",VLOOKUP($C9,invullijst!$A$11:$M$185,3,FALSE))","v":"Haarsteeg"},{"$f":"IF(VLOOKUP($C9,invullijst!$A$11:$M$185,6,FALSE)=\"\",\"\",VLOOKUP($C9,invullijst!$A$11:$M$185,6,FALSE))","v":93},{"$f":"IF(VLOOKUP($C9,invullijst!$A$11:$M$185,7,FALSE)=\"\",\"\",VLOOKUP($C9,invullijst!$A$11:$M$185,7,FALSE))","v":"x"},{"$f":"IF(VLOOKUP($C9,invullijst!$A$11:$M$185,8,FALSE)=\"\",\"\",VLOOKUP($C9,invullijst!$A$11:$M$185,8,FALSE))","v":96},{"$f":"IF(VLOOKUP($C9,invullijst!$A$11:$M$185,9,FALSE)=\"\",\"\",VLOOKUP($C9,invullijst!$A$11:$M$185,9,FALSE))","v":96},{"$f":"IF(VLOOKUP($C9,invullijst!$A$11:$M$185,10,FALSE)=\"\",\"\",VLOOKUP($C9,invullijst!$A$11:$M$185,10,FALSE))","v":94},379,{"$f":"IF(VLOOKUP($C9,invullijst!$A$11:$M$185,11,FALSE)=\"\",\"\",VLOOKUP($C9,invullijst!$A$11:$M$185,11,FALSE))","v":48}]
[null,6,413,{"$f":"IF(VLOOKUP($C10,invullijst!$A$11:$M205,4,FALSE)=\"\",\"\",VLOOKUP($C10,invullijst!$A$11:$M205,4,FALSE))","v":"65+"},{"$f":"IF(VLOOKUP($C10,invullijst!$A$11:$M199,2,FALSE)=\"\",\"\",VLOOKUP($C10,invullijst!$A$11:$M199,2,FALSE))","v":"Frans Mommersteeg"},{"$f":"IF(VLOOKUP($C10,invullijst!$A$11:$M$185,3,FALSE)=\"\",\"\",VLOOKUP($C10,invullijst!$A$11:$M$185,3,FALSE))","v":"Haarsteeg"},{"$f":"IF(VLOOKUP($C10,invullijst!$A$11:$M$185,6,FALSE)=\"\",\"\",VLOOKUP($C10,invullijst!$A$11:$M$185,6,FALSE))","v":95},{"$f":"IF(VLOOKUP($C10,invullijst!$A$11:$M$185,7,FALSE)=\"\",\"\",VLOOKUP($C10,invullijst!$A$11:$M$185,7,FALSE))","v":"x"},{"$f":"IF(VLOOKUP($C10,invullijst!$A$11:$M$185,8,FALSE)=\"\",\"\",VLOOKUP($C10,invullijst!$A$11:$M$185,8,FALSE))","v":96},{"$f":"IF(VLOOKUP($C10,invullijst!$A$11:$M$185,9,FALSE)=\"\",\"\",VLOOKUP($C10,invullijst!$A$11:$M$185,9,FALSE))","v":94},{"$f":"IF(VLOOKUP($C10,invullijst!$A$11:$M$185,10,FALSE)=\"\",\"\",VLOOKUP($C10,invullijst!$A$11:$M$185,10,FALSE))","v":94},379,{"$f":"IF(VLOOKUP($C10,invullijst!$A$11:$M$185,11,FALSE)=\"\",\"\",VLOOKUP($C10,invullijst!$A$11:$M$185,11,FALSE))","v":47}]
[null,7,218,{"$f":"IF(VLOOKUP($C11,invullijst!$A$11:$M195,4,FALSE)=\"\",\"\",VLOOKUP($C11,invullijst!$A$11:$M195,4,FALSE))","v":"65+"},{"$f":"IF(VLOOKUP($C11,invullijst!$A$11:$M185,2,FALSE)=\"\",\"\",VLOOKUP($C11,invullijst!$A$11:$M185,2,FALSE))","v":"Jacob van de Werken"},{"$f":"IF(VLOOKUP($C11,invullijst!$A$11:$M$185,3,FALSE)=\"\",\"\",VLOOKUP($C11,invullijst!$A$11:$M$185,3,FALSE))","v":"Besoijen"},{"$f":"IF(VLOOKUP($C11,invullijst!$A$11:$M$185,6,FALSE)=\"\",\"\",VLOOKUP($C11,invullijst!$A$11:$M$185,6,FALSE))","v":97},{"$f":"IF(VLOOKUP($C11,invullijst!$A$11:$M$185,7,FALSE)=\"\",\"\",VLOOKUP($C11,invullijst!$A$11:$M$185,7,FALSE))","v":97},{"$f":"IF(VLOOKUP($C11,invullijst!$A$11:$M$185,8,FALSE)=\"\",\"\",VLOOKUP($C11,invullijst!$A$11:$M$185,8,FALSE))","v":94},{"$f":"IF(VLOOKUP($C11,invullijst!$A$11:$M$185,9,FALSE)=\"\",\"\",VLOOKUP($C11,invullijst!$A$11:$M$185,9,FALSE))","v":"x"},{"$f":"IF(VLOOKUP($C11,invullijst!$A$11:$M$185,10,FALSE)=\"\",\"\",VLOOKUP($C11,invullijst!$A$11:$M$185,10,FALSE))","v":91},379,{"$f":"IF(VLOOKUP($C11,invullijst!$A$11:$M$185,11,FALSE)=\"\",\"\",VLOOKUP($C11,invullijst!$A$11:$M$185,11,FALSE))","v":46}]
[null,8,219,{"$f":"IF(VLOOKUP($C12,invullijst!$A$11:$M194,4,FALSE)=\"\",\"\",VLOOKUP($C12,invullijst!$A$11:$M194,4,FALSE))","v":"65+"},{"$f":"IF(VLOOKUP($C12,invullijst!$A$11:$M192,2,FALSE)=\"\",\"\",VLOOKUP($C12,invullijst!$A$11:$M192,2,FALSE))","v":"Frans de Bont"},{"$f":"IF(VLOOKUP($C12,invullijst!$A$11:$M$185,3,FALSE)=\"\",\"\",VLOOKUP($C12,invullijst!$A$11:$M$185,3,FALSE))","v":"Besoijen"},{"$f":"IF(VLOOKUP($C12,invullijst!$A$11:$M$185,6,FALSE)=\"\",\"\",VLOOKUP($C12,invullijst!$A$11:$M$185,6,FALSE))","v":95},{"$f":"IF(VLOOKUP($C12,invullijst!$A$11:$M$185,7,FALSE)=\"\",\"\",VLOOKUP($C12,invullijst!$A$11:$M$185,7,FALSE))","v":93},{"$f":"IF(VLOOKUP($C12,invullijst!$A$11:$M$185,8,FALSE)=\"\",\"\",VLOOKUP($C12,invullijst!$A$11:$M$185,8,FALSE))","v":94},{"$f":"IF(VLOOKUP($C12,invullijst!$A$11:$M$185,9,FALSE)=\"\",\"\",VLOOKUP($C12,invullijst!$A$11:$M$185,9,FALSE))","v":"x"},{"$f":"IF(VLOOKUP($C12,invullijst!$A$11:$M$185,10,FALSE)=\"\",\"\",VLOOKUP($C12,invullijst!$A$11:$M$185,10,FALSE))","v":96},378,{"$f":"IF(VLOOKUP($C12,invullijst!$A$11:$M$185,11,FALSE)=\"\",\"\",VLOOKUP($C12,invullijst!$A$11:$M$185,11,FALSE))","v":46}]
[null,9,307,{"$f":"IF(VLOOKUP($C13,invullijst!$A$11:$M206,4,FALSE)=\"\",\"\",VLOOKUP($C13,invullijst!$A$11:$M206,4,FALSE))","v":"65+"},{"$f":"IF(VLOOKUP($C13,invullijst!$A$11:$M202,2,FALSE)=\"\",\"\",VLOOKUP($C13,invullijst!$A$11:$M202,2,FALSE))","v":"Bert van Engelen"},{"$f":"IF(VLOOKUP($C13,invullijst!$A$11:$M$185,3,FALSE)=\"\",\"\",VLOOKUP($C13,invullijst!$A$11:$M$185,3,FALSE))","v":"Elshout"},{"$f":"IF(VLOOKUP($C13,invullijst!$A$11:$M$185,6,FALSE)=\"\",\"\",VLOOKUP($C13,invullijst!$A$11:$M$185,6,FALSE))","v":95},{"$f":"IF(VLOOKUP($C13,invullijst!$A$11:$M$185,7,FALSE)=\"\",\"\",VLOOKUP($C13,invullijst!$A$11:$M$185,7,FALSE))","v":95},{"$f":"IF(VLOOKUP($C13,invullijst!$A$11:$M$185,8,FALSE)=\"\",\"\",VLOOKUP($C13,invullijst!$A$11:$M$185,8,FALSE))","v":93},{"$f":"IF(VLOOKUP($C13,invullijst!$A$11:$M$185,9,FALSE)=\"\",\"\",VLOOKUP($C13,invullijst!$A$11:$M$185,9,FALSE))","v":94},{"$f":"IF(VLOOKUP($C13,invullijst!$A$11:$M$185,10,FALSE)=\"\",\"\",VLOOKUP($C13,invullijst!$A$11:$M$185,10,FALSE))","v":"x"},377,{"$f":"IF(VLOOKUP($C13,invullijst!$A$11:$M$185,11,FALSE)=\"\",\"\",VLOOKUP($C13,invullijst!$A$11:$M$185,11,FALSE))","v":44}]
[null,10,509,{"$f":"IF(VLOOKUP($C14,invullijst!$A$11:$M188,4,FALSE)=\"\",\"\",VLOOKUP($C14,invullijst!$A$11:$M188,4,FALSE))","v":"65+"},{"$f":"IF(VLOOKUP($C14,invullijst!$A$11:$M190,2,FALSE)=\"\",\"\",VLOOKUP($C14,invullijst!$A$11:$M190,2,FALSE))","v":"Adwan de Pinth"},{"$f":"IF(VLOOKUP($C14,invullijst!$A$11:$M$185,3,FALSE)=\"\",\"\",VLOOKUP($C14,invullijst!$A$11:$M$185,3,FALSE))","v":"Kaatsheuvel"},{"$f":"IF(VLOOKUP($C14,invullijst!$A$11:$M$185,6,FALSE)=\"\",\"\",VLOOKUP($C14,invullijst!$A$11:$M$185,6,FALSE))","v":90},{"$f":"IF(VLOOKUP($C14,invullijst!$A$11:$M$185,7,FALSE)=\"\",\"\",VLOOKUP($C14,invullijst!$A$11:$M$185,7,FALSE))","v":94},{"$f":"IF(VLOOKUP($C14,invullijst!$A$11:$M$185,8,FALSE)=\"\",\"\",VLOOKUP($C14,invullijst!$A$11:$M$185,8,FALSE))","v":"x"},{"$f":"IF(VLOOKUP($C14,invullijst!$A$11:$M$185,9,FALSE)=\"\",\"\",VLOOKUP($C14,invullijst!$A$11:$M$185,9,FALSE))","v":96},{"$f":"IF(VLOOKUP($C14,invullijst!$A$11:$M$185,10,FALSE)=\"\",\"\",VLOOKUP($C14,invullijst!$A$11:$M$185,10,FALSE))","v":91},371,{"$f":"IF(VLOOKUP($C14,invullijst!$A$11:$M$185,11,FALSE)=\"\",\"\",VLOOKUP($C14,invullijst!$A$11:$M$185,11,FALSE))","v":40}]
[null,11,403,{"$f":"IF(VLOOKUP($C15,invullijst!$A$11:$M191,4,FALSE)=\"\",\"\",VLOOKUP($C15,invullijst!$A$11:$M191,4,FALSE))","v":"65+"},{"$f":"IF(VLOOKUP($C15,invullijst!$A$11:$M191,2,FALSE)=\"\",\"\",VLOOKUP($C15,invullijst!$A$11:$M191,2,FALSE))","v":"Dorien de Kort"},{"$f":"IF(VLOOKUP($C15,invullijst!$A$11:$M$185,3,FALSE)=\"\",\"\",VLOOKUP($C15,invullijst!$A$11:$M$185,3,FALSE))","v":"Haarsteeg"},{"$f":"IF(VLOOKUP($C15,invullijst!$A$11:$M$185,6,FALSE)=\"\",\"\",VLOOKUP($C15,invullijst!$A$11:$M$185,6,FALSE))","v":88},{"$f":"IF(VLOOKUP($C15,invullijst!$A$11:$M$185,7,FALSE)=\"\",\"\",VLOOKUP($C15,invullijst!$A$11:$M$185,7,FALSE))","v":"x"},{"$f":"IF(VLOOKUP($C15,invullijst!$A$11:$M$185,8,FALSE)=\"\",\"\",VLOOKUP($C15,invullijst!$A$11:$M$185,8,FALSE))","v":95},{"$f":"IF(VLOOKUP($C15,invullijst!$A$11:$M$185,9,FALSE)=\"\",\"\",VLOOKUP($C15,invullijst!$A$11:$M$185,9,FALSE))","v":96},{"$f":"IF(VLOOKUP($C15,invullijst!$A$11:$M$185,10,FALSE)=\"\",\"\",VLOOKUP($C15,invullijst!$A$11:$M$185,10,FALSE))","v":90},369,{"$f":"IF(VLOOKUP($C15,invullijst!$A$11:$M$185,11,FALSE)=\"\",\"\",VLOOKUP($C15,invullijst!$A$11:$M$185,11,FALSE))","v":49}]
[null,12,310,{"$f":"IF(VLOOKUP($C16,invullijst!$A$11:$M203,4,FALSE)=\"\",\"\",VLOOKUP($C16,invullijst!$A$11:$M203,4,FALSE))","v":"65+"},{"$f":"IF(VLOOKUP($C16,invullijst!$A$11:$M197,2,FALSE)=\"\",\"\",VLOOKUP($C16,invullijst!$A$11:$M197,2,FALSE))","v":"Tiny Boom"},{"$f":"IF(VLOOKUP($C16,invullijst!$A$11:$M$185,3,FALSE)=\"\",\"\",VLOOKUP($C16,invullijst!$A$11:$M$185,3,FALSE))","v":"Elshout"},{"$f":"IF(VLOOKUP($C16,invullijst!$A$11:$M$185,6,FALSE)=\"\",\"\",VLOOKUP($C16,invullijst!$A$11:$M$185,6,FALSE))","v":92},{"$f":"IF(VLOOKUP($C16,invullijst!$A$11:$M$185,7,FALSE)=\"\",\"\",VLOOKUP($C16,invullijst!$A$11:$M$185,7,FALSE))","v":92},{"$f":"IF(VLOOKUP($C16,invullijst!$A$11:$M$185,8,FALSE)=\"\",\"\",VLOOKUP($C16,invullijst!$A$11:$M$185,8,FALSE))","v":91},{"$f":"IF(VLOOKUP($C16,invullijst!$A$11:$M$185,9,FALSE)=\"\",\"\",VLOOKUP($C16,invullijst!$A$11:$M$185,9,FALSE))","v":94},{"$f":"IF(VLOOKUP($C16,invullijst!$A$11:$M$185,10,FALSE)=\"\",\"\",VLOOKUP($C16,invullijst!$A$11:$M$185,10,FALSE))","v":"x"},369,{"$f":"IF(VLOOKUP($C16,invullijst!$A$11:$M$185,11,FALSE)=\"\",\"\",VLOOKUP($C16,invullijst!$A$11:$M$185,11,FALSE))","v":45}]
[null,13,516,{"$f":"IF(VLOOKUP($C17,invullijst!$A$11:$M199,4,FALSE)=\"\",\"\",VLOOKUP($C17,invullijst!$A$11:$M199,4,FALSE))","v":"65+"},{"$f":"IF(VLOOKUP($C17,invullijst!$A$11:$M200,2,FALSE)=\"\",\"\",VLOOKUP($C17,invullijst!$A$11:$M200,2,FALSE))","v":"Henry Bergakker disp"},{"$f":"IF(VLOOKUP($C17,invullijst!$A$11:$M$185,3,FALSE)=\"\",\"\",VLOOKUP($C17,invullijst!$A$11:$M$185,3,FALSE))","v":"Kaatsheuvel"},{"$f":"IF(VLOOKUP($C17,invullijst!$A$11:$M$185,6,FALSE)=\"\",\"\",VLOOKUP($C17,invullijst!$A$11:$M$185,6,FALSE))","v":90},{"$f":"IF(VLOOKUP($C17,invullijst!$A$11:$M$185,7,FALSE)=\"\",\"\",VLOOKUP($C17,invullijst!$A$11:$M$185,7,FALSE))","v":92},{"$f":"IF(VLOOKUP($C17,invullijst!$A$11:$M$185,8,FALSE)=\"\",\"\",VLOOKUP($C17,invullijst!$A$11:$M$185,8,FALSE))","v":"x"},{"$f":"IF(VLOOKUP($C17,invullijst!$A$11:$M$185,9,FALSE)=\"\",\"\",VLOOKUP($C17,invullijst!$A$11:$M$185,9,FALSE))","v":90},{"$f":"IF(VLOOKUP($C17,invullijst!$A$11:$M$185,10,FALSE)=\"\",\"\",VLOOKUP($C17,invullijst!$A$11:$M$185,10,FALSE))","v":92},364,{"$f":"IF(VLOOKUP($C17,invullijst!$A$11:$M$185,11,FALSE)=\"\",\"\",VLOOKUP($C17,invullijst!$A$11:$M$185,11,FALSE))","v":47}]
["B",1,220,{"$f":"IF(VLOOKUP($C18,invullijst!$A$11:$M197,4,FALSE)=\"\",\"\",VLOOKUP($C18,invullijst!$A$11:$M197,4,FALSE))","v":"65+"},{"$f":"IF(VLOOKUP($C18,invullijst!$A$11:$M196,2,FALSE)=\"\",\"\",VLOOKUP($C18,invullijst!$A$11:$M196,2,FALSE))","v":"Kees Vos"},{"$f":"IF(VLOOKUP($C18,invullijst!$A$11:$M$185,3,FALSE)=\"\",\"\",VLOOKUP($C18,invullijst!$A$11:$M$185,3,FALSE))","v":"Besoijen"},{"$f":"IF(VLOOKUP($C18,invullijst!$A$11:$M$185,6,FALSE)=\"\",\"\",VLOOKUP($C18,invullijst!$A$11:$M$185,6,FALSE))","v":90},{"$f":"IF(VLOOKUP($C18,invullijst!$A$11:$M$185,7,FALSE)=\"\",\"\",VLOOKUP($C18,invullijst!$A$11:$M$185,7,FALSE))","v":93},{"$f":"IF(VLOOKUP($C18,invullijst!$A$11:$M$185,8,FALSE)=\"\",\"\",VLOOKUP($C18,invullijst!$A$11:$M$185,8,FALSE))","v":91},{"$f":"IF(VLOOKUP($C18,invullijst!$A$11:$M$185,9,FALSE)=\"\",\"\",VLOOKUP($C18,invullijst!$A$11:$M$185,9,FALSE))","v":"x"},{"$f":"IF(VLOOKUP($C18,invullijst!$A$11:$M$185,10,FALSE)=\"\",\"\",VLOOKUP($C18,invullijst!$A$11:$M$185,10,FALSE))","v":90},364,{"$f":"IF(VLOOKUP($C18,invullijst!$A$11:$M$185,11,FALSE)=\"\",\"\",VLOOKUP($C18,invullijst!$A$11:$M$185,11,FALSE))","v":46}]
[null,2,301,{"$f":"IF(VLOOKUP($C19,invullijst!$A$11:$M202,4,FALSE)=\"\",\"\",VLOOKUP($C19,invullijst!$A$11:$M202,4,FALSE))","v":"65+"},{"$f":"IF(VLOOKUP($C19,invullijst!$A$11:$M201,2,FALSE)=\"\",\"\",VLOOKUP($C19,invullijst!$A$11:$M201,2,FALSE))","v":"Arjen van Assem disp"},{"$f":"IF(VLOOKUP($C19,invullijst!$A$11:$M$185,3,FALSE)=\"\",\"\",VLOOKUP($C19,invullijst!$A$11:$M$185,3,FALSE))","v":"Elshout"},{"$f":"IF(VLOOKUP($C19,invullijst!$A$11:$M$185,6,FALSE)=\"\",\"\",VLOOKUP($C19,invullijst!$A$11:$M$185,6,FALSE))","v":89},{"$f":"IF(VLOOKUP($C19,invullijst!$A$11:$M$185,7,FALSE)=\"\",\"\",VLOOKUP($C19,invullijst!$A$11:$M$185,7,FALSE))","v":90},{"$f":"IF(VLOOKUP($C19,invullijst!$A$11:$M$185,8,FALSE)=\"\",\"\",VLOOKUP($C19,invullijst!$A$11:$M$185,8,FALSE))","v":89},{"$f":"IF(VLOOKUP($C19,invullijst!$A$11:$M$185,9,FALSE)=\"\",\"\",VLOOKUP($C19,invullijst!$A$11:$M$185,9,FALSE))","v":92},{"$f":"IF(VLOOKUP($C19,invullijst!$A$11:$M$185,10,FALSE)=\"\",\"\",VLOOKUP($C19,invullijst!$A$11:$M$185,10,FALSE))","v":"x"},360,{"$f":"IF(VLOOKUP($C19,invullijst!$A$11:$M$185,11,FALSE)=\"\",\"\",VLOOKUP($C19,invullijst!$A$11:$M$185,11,FALSE))","v":45}]
[null,3,214,{"$f":"IF(VLOOKUP($C20,invullijst!$A$11:$M198,4,FALSE)=\"\",\"\",VLOOKUP($C20,invullijst!$A$11:$M198,4,FALSE))","v":"65+"},{"$f":"IF(VLOOKUP($C20,invullijst!$A$11:$M198,2,FALSE)=\"\",\"\",VLOOKUP($C20,invullijst!$A$11:$M198,2,FALSE))","v":"Andre de Vaan"},{"$f":"IF(VLOOKUP($C20,invullijst!$A$11:$M$185,3,FALSE)=\"\",\"\",VLOOKUP($C20,invullijst!$A$11:$M$185,3,FALSE))","v":"Besoijen"},{"$f":"IF(VLOOKUP($C20,invullijst!$A$11:$M$185,6,FALSE)=\"\",\"\",VLOOKUP($C20,invullijst!$A$11:$M$185,6,FALSE))","v":87},{"$f":"IF(VLOOKUP($C20,invullijst!$A$11:$M$185,7,FALSE)=\"\",\"\",VLOOKUP($C20,invullijst!$A$11:$M$185,7,FALSE))","v":86},{"$f":"IF(VLOOKUP($C20,invullijst!$A$11:$M$185,8,FALSE)=\"\",\"\",VLOOKUP($C20,invullijst!$A$11:$M$185,8,FALSE))","v":89},{"$f":"IF(VLOOKUP($C20,invullijst!$A$11:$M$185,9,FALSE)=\"\",\"\",VLOOKUP($C20,invullijst!$A$11:$M$185,9,FALSE))","v":"x"},{"$f":"IF(VLOOKUP($C20,invullijst!$A$11:$M$185,10,FALSE)=\"\",\"\",VLOOKUP($C20,invullijst!$A$11:$M$185,10,FALSE))","v":90},352,{"$f":"IF(VLOOKUP($C20,invullijst!$A$11:$M$185,11,FALSE)=\"\",\"\",VLOOKUP($C20,invullijst!$A$11:$M$185,11,FALSE))","v":44}]
[null,4,515,{"$f":"IF(VLOOKUP($C21,invullijst!$A$11:$M187,4,FALSE)=\"\",\"\",VLOOKUP($C21,invullijst!$A$11:$M187,4,FALSE))","v":"65+"},{"$f":"IF(VLOOKUP($C21,invullijst!$A$11:$M188,2,FALSE)=\"\",\"\",VLOOKUP($C21,invullijst!$A$11:$M188,2,FALSE))","v":"Ilona Bergakker disp"},{"$f":"IF(VLOOKUP($C21,invullijst!$A$11:$M$185,3,FALSE)=\"\",\"\",VLOOKUP($C21,invullijst!$A$11:$M$185,3,FALSE))","v":"Kaatsheuvel"},{"$f":"IF(VLOOKUP($C21,invullijst!$A$11:$M$185,6,FALSE)=\"\",\"\",VLOOKUP($C21,invullijst!$A$11:$M$185,6,FALSE))","v":89},{"$f":"IF(VLOOKUP($C21,invullijst!$A$11:$M$185,7,FALSE)=\"\",\"\",VLOOKUP($C21,invullijst!$A$11:$M$185,7,FALSE))","v":87},{"$f":"IF(VLOOKUP($C21,invullijst!$A$11:$M$185,8,FALSE)=\"\",\"\",VLOOKUP($C21,invullijst!$A$11:$M$185,8,FALSE))","v":"x"},{"$f":"IF(VLOOKUP($C21,invullijst!$A$11:$M$185,9,FALSE)=\"\",\"\",VLOOKUP($C21,invullijst!$A$11:$M$185,9,FALSE))","v":85},{"$f":"IF(VLOOKUP($C21,invullijst!$A$11:$M$185,10,FALSE)=\"\",\"\",VLOOKUP($C21,invullijst!$A$11:$M$185,10,FALSE))","v":89},350,{"$f":"IF(VLOOKUP($C21,invullijst!$A$11:$M$185,11,FALSE)=\"\",\"\",VLOOKUP($C21,invullijst!$A$11:$M$185,11,FALSE))","v":44}]
[null,5,309,{"$f":"IF(VLOOKUP($C22,invullijst!$A$11:$M207,4,FALSE)=\"\",\"\",VLOOKUP($C22,invullijst!$A$11:$M207,4,FALSE))","v":"65+"},{"$f":"IF(VLOOKUP($C22,invullijst!$A$11:$M203,2,FALSE)=\"\",\"\",VLOOKUP($C22,invullijst!$A$11:$M203,2,FALSE))","v":"René de Jong"},{"$f":"IF(VLOOKUP($C22,invullijst!$A$11:$M$185,3,FALSE)=\"\",\"\",VLOOKUP($C22,invullijst!$A$11:$M$185,3,FALSE))","v":"Elshout"},{"$f":"IF(VLOOKUP($C22,invullijst!$A$11:$M$185,6,FALSE)=\"\",\"\",VLOOKUP($C22,invullijst!$A$11:$M$185,6,FALSE))","v":87},{"$f":"IF(VLOOKUP($C22,invullijst!$A$11:$M$185,7,FALSE)=\"\",\"\",VLOOKUP($C22,invullijst!$A$11:$M$185,7,FALSE))","v":81},{"$f":"IF(VLOOKUP($C22,invullijst!$A$11:$M$185,8,FALSE)=\"\",\"\",VLOOKUP($C22,invullijst!$A$11:$M$185,8,FALSE))","v":88},{"$f":"IF(VLOOKUP($C22,invullijst!$A$11:$M$185,9,FALSE)=\"\",\"\",VLOOKUP($C22,invullijst!$A$11:$M$185,9,FALSE))","v":88},{"$f":"IF(VLOOKUP($C22,invullijst!$A$11:$M$185,10,FALSE)=\"\",\"\",VLOOKUP($C22,invullijst!$A$11:$M$185,10,FALSE))","v":"x"},344,{"$f":"IF(VLOOKUP($C22,invullijst!$A$11:$M$185,11,FALSE)=\"\",\"\",VLOOKUP($C22,invullijst!$A$11:$M$185,11,FALSE))","v":39}]
[null,6,212,{"$f":"IF(VLOOKUP($C23,invullijst!$A$11:$M196,4,FALSE)=\"\",\"\",VLOOKUP($C23,invullijst!$A$11:$M196,4,FALSE))","v":"65+"},{"$f":"IF(VLOOKUP($C23,invullijst!$A$11:$M187,2,FALSE)=\"\",\"\",VLOOKUP($C23,invullijst!$A$11:$M187,2,FALSE))","v":"René Duquesnoy"},{"$f":"IF(VLOOKUP($C23,invullijst!$A$11:$M$185,3,FALSE)=\"\",\"\",VLOOKUP($C23,invullijst!$A$11:$M$185,3,FALSE))","v":"Besoijen"},{"$f":"IF(VLOOKUP($C23,invullijst!$A$11:$M$185,6,FALSE)=\"\",\"\",VLOOKUP($C23,invullijst!$A$11:$M$185,6,FALSE))","v":87},{"$f":"IF(VLOOKUP($C23,invullijst!$A$11:$M$185,7,FALSE)=\"\",\"\",VLOOKUP($C23,invullijst!$A$11:$M$185,7,FALSE))","v":80},{"$f":"IF(VLOOKUP($C23,invullijst!$A$11:$M$185,8,FALSE)=\"\",\"\",VLOOKUP($C23,invullijst!$A$11:$M$185,8,FALSE))","v":89},{"$f":"IF(VLOOKUP($C23,invullijst!$A$11:$M$185,9,FALSE)=\"\",\"\",VLOOKUP($C23,invullijst!$A$11:$M$185,9,FALSE))","v":"x"},{"$f":"IF(VLOOKUP($C23,invullijst!$A$11:$M$185,10,FALSE)=\"\",\"\",VLOOKUP($C23,invullijst!$A$11:$M$185,10,FALSE))","v":86},342,{"$f":"IF(VLOOKUP($C23,invullijst!$A$11:$M$185,11,FALSE)=\"\",\"\",VLOOKUP($C23,invullijst!$A$11:$M$185,11,FALSE))","v":45}]
[null,7,107,{"$f":"IF(VLOOKUP($C24,invullijst!$A$11:$M208,4,FALSE)=\"\",\"\",VLOOKUP($C24,invullijst!$A$11:$M208,4,FALSE))","v":"65+"},{"$f":"IF(VLOOKUP($C24,invullijst!$A$11:$M204,2,FALSE)=\"\",\"\",VLOOKUP($C24,invullijst!$A$11:$M204,2,FALSE))","v":"Cees Coppens"},{"$f":"IF(VLOOKUP($C24,invullijst!$A$11:$M$185,3,FALSE)=\"\",\"\",VLOOKUP($C24,invullijst!$A$11:$M$185,3,FALSE))","v":"Baardwijk"},{"$f":"IF(VLOOKUP($C24,invullijst!$A$11:$M$185,6,FALSE)=\"\",\"\",VLOOKUP($C24,invullijst!$A$11:$M$185,6,FALSE))","v":"x"},{"$f":"IF(VLOOKUP($C24,invullijst!$A$11:$M$185,7,FALSE)=\"\",\"\",VLOOKUP($C24,invullijst!$A$11:$M$185,7,FALSE))","v":86},{"$f":"IF(VLOOKUP($C24,invullijst!$A$11:$M$185,8,FALSE)=\"\",\"\",VLOOKUP($C24,invullijst!$A$11:$M$185,8,FALSE))","v":80},{"$f":"IF(VLOOKUP($C24,invullijst!$A$11:$M$185,9,FALSE)=\"\",\"\",VLOOKUP($C24,invullijst!$A$11:$M$185,9,FALSE))","v":82},{"$f":"IF(VLOOKUP($C24,invullijst!$A$11:$M$185,10,FALSE)=\"\",\"\",VLOOKUP($C24,invullijst!$A$11:$M$185,10,FALSE))","v":75},323,{"$f":"IF(VLOOKUP($C24,invullijst!$A$11:$M$185,11,FALSE)=\"\",\"\",VLOOKUP($C24,invullijst!$A$11:$M$185,11,FALSE))","v":37}]
[null,8,211,{"$f":"IF(VLOOKUP($C25,invullijst!$A$11:$M204,4,FALSE)=\"\",\"\",VLOOKUP($C25,invullijst!$A$11:$M204,4,FALSE))","v":"65+"},{"$f":"IF(VLOOKUP($C25,invullijst!$A$11:$M202,2,FALSE)=\"\",\"\",VLOOKUP($C25,invullijst!$A$11:$M202,2,FALSE))","v":"Ad van den houdt"},{"$f":"IF(VLOOKUP($C25,invullijst!$A$11:$M$185,3,FALSE)=\"\",\"\",VLOOKUP($C25,invullijst!$A$11:$M$185,3,FALSE))","v":"Besoijen"},{"$f":"IF(VLOOKUP($C25,invullijst!$A$11:$M$185,6,FALSE)=\"\",\"\",VLOOKUP($C25,invullijst!$A$11:$M$185,6,FALSE))","v":92},{"$f":"IF(VLOOKUP($C25,invullijst!$A$11:$M$185,7,FALSE)=\"\",\"\",VLOOKUP($C25,invullijst!$A$11:$M$185,7,FALSE))","v":91},{"$f":"IF(VLOOKUP($C25,invullijst!$A$11:$M$185,8,FALSE)=\"\",\"\",VLOOKUP($C25,invullijst!$A$11:$M$185,8,FALSE))","v":89},{"$f":"IF(VLOOKUP($C25,invullijst!$A$11:$M$185,9,FALSE)=\"\",\"\",VLOOKUP($C25,invullijst!$A$11:$M$185,9,FALSE))","v":"x"},{"$f":"IF(VLOOKUP($C25,invullijst!$A$11:$M$185,10,FALSE)=\"\",\"\",VLOOKUP($C25,invullijst!$A$11:$M$185,10,FALSE))","v":"x"},272,{"$f":"IF(VLOOKUP($C25,invullijst!$A$11:$M$185,11,FALSE)=\"\",\"\",VLOOKUP($C25,invullijst!$A$11:$M$185,11,FALSE))","v":46}]
[null,9,518,{"$f":"IF(VLOOKUP($C26,invullijst!$A$11:$M193,4,FALSE)=\"\",\"\",VLOOKUP($C26,invullijst!$A$11:$M193,4,FALSE))","v":"65+"},{"$f":"IF(VLOOKUP($C26,invullijst!$A$11:$M194,2,FALSE)=\"\",\"\",VLOOKUP($C26,invullijst!$A$11:$M194,2,FALSE))","v":"Ton Stanz"},{"$f":"IF(VLOOKUP($C26,invullijst!$A$11:$M$185,3,FALSE)=\"\",\"\",VLOOKUP($C26,invullijst!$A$11:$M$185,3,FALSE))","v":"Kaatsheuvel"},{"$f":"IF(VLOOKUP($C26,invullijst!$A$11:$M$185,6,FALSE)=\"\",\"\",VLOOKUP($C26,invullijst!$A$11:$M$185,6,FALSE))","v":83},{"$f":"IF(VLOOKUP($C26,invullijst!$A$11:$M$185,7,FALSE)=\"\",\"\",VLOOKUP($C26,invullijst!$A$11:$M$185,7,FALSE))","v":84},{"$f":"IF(VLOOKUP($C26,invullijst!$A$11:$M$185,8,FALSE)=\"\",\"\",VLOOKUP($C26,invullijst!$A$11:$M$185,8,FALSE))","v":"x"},{"$f":"IF(VLOOKUP($C26,invullijst!$A$11:$M$185,9,FALSE)=\"\",\"\",VLOOKUP($C26,invullijst!$A$11:$M$185,9,FALSE))","v":"x"},{"$f":"IF(VLOOKUP($C26,invullijst!$A$11:$M$185,10,FALSE)=\"\",\"\",VLOOKUP($C26,invullijst!$A$11:$M$185,10,FALSE))","v":77},244,{"$f":"IF(VLOOKUP($C26,invullijst!$A$11:$M$185,11,FALSE)=\"\",\"\",VLOOKUP($C26,invullijst!$A$11:$M$185,11,FALSE))","v":""}]
[null,10,104,{"$f":"IF(VLOOKUP($C27,invullijst!$A$11:$M210,4,FALSE)=\"\",\"\",VLOOKUP($C27,invullijst!$A$11:$M210,4,FALSE))","v":"65+"},{"$f":"IF(VLOOKUP($C27,invullijst!$A$11:$M206,2,FALSE)=\"\",\"\",VLOOKUP($C27,invullijst!$A$11:$M206,2,FALSE))","v":"Peter Brekelmans"},{"$f":"IF(VLOOKUP($C27,invullijst!$A$11:$M$185,3,FALSE)=\"\",\"\",VLOOKUP($C27,invullijst!$A$11:$M$185,3,FALSE))","v":"Baardwijk"},{"$f":"IF(VLOOKUP($C27,invullijst!$A$11:$M$185,6,FALSE)=\"\",\"\",VLOOKUP($C27,invullijst!$A$11:$M$185,6,FALSE))","v":"x"},{"$f":"IF(VLOOKUP($C27,invullijst!$A$11:$M$185,7,FALSE)=\"\",\"\",VLOOKUP($C27,invullijst!$A$11:$M$185,7,FALSE))","v":79},{"$f":"IF(VLOOKUP($C27,invullijst!$A$11:$M$185,8,FALSE)=\"\",\"\",VLOOKUP($C27,invullijst!$A$11:$M$185,8,FALSE))","v":73},{"$f":"IF(VLOOKUP($C27,invullijst!$A$11:$M$185,9,FALSE)=\"\",\"\",VLOOKUP($C27,invullijst!$A$11:$M$185,9,FALSE))","v":84},{"$f":"IF(VLOOKUP($C27,invullijst!$A$11:$M$185,10,FALSE)=\"\",\"\",VLOOKUP($C27,invullijst!$A$11:$M$185,10,FALSE))","v":"x"},236,{"$f":"IF(VLOOKUP($C27,invullijst!$A$11:$M$185,11,FALSE)=\"\",\"\",VLOOKUP($C27,invullijst!$A$11:$M$185,11,FALSE))","v":37}]
[null,11,112,{"$f":"IF(VLOOKUP($C28,invullijst!$A$11:$M209,4,FALSE)=\"\",\"\",VLOOKUP($C28,invullijst!$A$11:$M209,4,FALSE))","v":"65+"},{"$f":"IF(VLOOKUP($C28,invullijst!$A$11:$M205,2,FALSE)=\"\",\"\",VLOOKUP($C28,invullijst!$A$11:$M205,2,FALSE))","v":"Toon van Buul"},{"$f":"IF(VLOOKUP($C28,invullijst!$A$11:$M$185,3,FALSE)=\"\",\"\",VLOOKUP($C28,invullijst!$A$11:$M$185,3,FALSE))","v":"Baardwijk"},{"$f":"IF(VLOOKUP($C28,invullijst!$A$11:$M$185,6,FALSE)=\"\",\"\",VLOOKUP($C28,invullijst!$A$11:$M$185,6,FALSE))","v":"x"},{"$f":"IF(VLOOKUP($C28,invullijst!$A$11:$M$185,7,FALSE)=\"\",\"\",VLOOKUP($C28,invullijst!$A$11:$M$185,7,FALSE))","v":58},{"$f":"IF(VLOOKUP($C28,invullijst!$A$11:$M$185,8,FALSE)=\"\",\"\",VLOOKUP($C28,invullijst!$A$11:$M$185,8,FALSE))","v":"x"},{"$f":"IF(VLOOKUP($C28,invullijst!$A$11:$M$185,9,FALSE)=\"\",\"\",VLOOKUP($C28,invullijst!$A$11:$M$185,9,FALSE))","v":67},{"$f":"IF(VLOOKUP($C28,invullijst!$A$11:$M$185,10,FALSE)=\"\",\"\",VLOOKUP($C28,invullijst!$A$11:$M$185,10,FALSE))","v":64},189,{"$f":"IF(VLOOKUP($C28,invullijst!$A$11:$M$185,11,FALSE)=\"\",\"\",VLOOKUP($C28,invullijst!$A$11:$M$185,11,FALSE))","v":20}]
[null,12,503,{"$f":"IF(VLOOKUP($C29,invullijst!$A$11:$M186,4,FALSE)=\"\",\"\",VLOOKUP($C29,invullijst!$A$11:$M186,4,FALSE))","v":"65+"},{"$f":"IF(VLOOKUP($C29,invullijst!$A$11:$M187,2,FALSE)=\"\",\"\",VLOOKUP($C29,invullijst!$A$11:$M187,2,FALSE))","v":"Kees Vos"},{"$f":"IF(VLOOKUP($C29,invullijst!$A$11:$M$185,3,FALSE)=\"\",\"\",VLOOKUP($C29,invullijst!$A$11:$M$185,3,FALSE))","v":"Kaatsheuvel"},{"$f":"IF(VLOOKUP($C29,invullijst!$A$11:$M$185,6,FALSE)=\"\",\"\",VLOOKUP($C29,invullijst!$A$11:$M$185,6,FALSE))","v":81},{"$f":"IF(VLOOKUP($C29,invullijst!$A$11:$M$185,7,FALSE)=\"\",\"\",VLOOKUP($C29,invullijst!$A$11:$M$185,7,FALSE))","v":"x"},{"$f":"IF(VLOOKUP($C29,invullijst!$A$11:$M$185,8,FALSE)=\"\",\"\",VLOOKUP($C29,invullijst!$A$11:$M$185,8,FALSE))","v":"x"},{"$f":"IF(VLOOKUP($C29,invullijst!$A$11:$M$185,9,FALSE)=\"\",\"\",VLOOKUP($C29,invullijst!$A$11:$M$185,9,FALSE))","v":"x"},{"$f":"IF(VLOOKUP($C29,invullijst!$A$11:$M$185,10,FALSE)=\"\",\"\",VLOOKUP($C29,invullijst!$A$11:$M$185,10,FALSE))","v":"x"},81,{"$f":"IF(VLOOKUP($C29,invullijst!$A$11:$M$185,11,FALSE)=\"\",\"\",VLOOKUP($C29,invullijst!$A$11:$M$185,11,FALSE))","v":""}]
[{"$nulls":3},{"$f":"IF(VLOOKUP($C30,invullijst!$A$11:$M211,4,FALSE)=\"\",\"\",VLOOKUP($C30,invullijst!$A$11:$M211,4,FALSE))","v":0},{"$f":"IF(VLOOKUP($C30,invullijst!$A$11:$M207,2,FALSE)=\"\",\"\",VLOOKUP($C30,invullijst!$A$11:$M207,2,FALSE))","v":0},{"$f":"IF(VLOOKUP($C30,invullijst!$A$11:$M$185,3,FALSE)=\"\",\"\",VLOOKUP($C30,invullijst!$A$11:$M$185,3,FALSE))","v":0},{"$f":"IF(VLOOKUP($C30,invullijst!$A$11:$M$185,6,FALSE)=\"\",\"\",VLOOKUP($C30,invullijst!$A$11:$M$185,6,FALSE))","v":0},{"$f":"IF(VLOOKUP($C30,invullijst!$A$11:$M$185,7,FALSE)=\"\",\"\",VLOOKUP($C30,invullijst!$A$11:$M$185,7,FALSE))","v":0},{"$f":"IF(VLOOKUP($C30,invullijst!$A$11:$M$185,8,FALSE)=\"\",\"\",VLOOKUP($C30,invullijst!$A$11:$M$185,8,FALSE))","v":0},{"$f":"IF(VLOOKUP($C30,invullijst!$A$11:$M$185,9,FALSE)=\"\",\"\",VLOOKUP($C30,invullijst!$A$11:$M$185,9,FALSE))","v":0},{"$f":"IF(VLOOKUP($C30,invullijst!$A$11:$M$185,10,FALSE)=\"\",\"\",VLOOKUP($C30,invullijst!$A$11:$M$185,10,FALSE))","v":0},0,{"$f":"IF(VLOOKUP($C30,invullijst!$A$11:$M$185,11,FALSE)=\"\",\"\",VLOOKUP($C30,invullijst!$A$11:$M$185,11,FALSE))","v":0}]
[{"$nulls":3},{"$f":"IF(VLOOKUP($C31,invullijst!$A$11:$M212,4,FALSE)=\"\",\"\",VLOOKUP($C31,invullijst!$A$11:$M212,4,FALSE))","v":0},{"$f":"IF(VLOOKUP($C31,invullijst!$A$11:$M208,2,FALSE)=\"\",\"\",VLOOKUP($C31,invullijst!$A$11:$M208,2,FALSE))","v":0},{"$f":"IF(VLOOKUP($C31,invullijst!$A$11:$M$185,3,FALSE)=\"\",\"\",VLOOKUP($C31,invullijst!$A$11:$M$185,3,FALSE))","v":0},{"$f":"IF(VLOOKUP($C31,invullijst!$A$11:$M$185,6,FALSE)=\"\",\"\",VLOOKUP($C31,invullijst!$A$11:$M$185,6,FALSE))","v":0},{"$f":"IF(VLOOKUP($C31,invullijst!$A$11:$M$185,7,FALSE)=\"\",\"\",VLOOKUP($C31,invullijst!$A$11:$M$185,7,FALSE))","v":0},{"$f":"IF(VLOOKUP($C31,invullijst!$A$11:$M$185,8,FALSE)=\"\",\"\",VLOOKUP($C31,invullijst!$A$11:$M$185,8,FALSE))","v":0},{"$f":"IF(VLOOKUP($C31,invullijst!$A$11:$M$185,9,FALSE)=\"\",\"\",VLOOKUP($C31,invullijst!$A$11:$M$185,9,FALSE))","v":0},{"$f":"IF(VLOOKUP($C31,invullijst!$A$11:$M$185,10,FALSE)=\"\",\"\",VLOOKUP($C31,invullijst!$A$11:$M$185,10,FALSE))","v":0},0,{"$f":"IF(VLOOKUP($C31,invullijst!$A$11:$M$185,11,FALSE)=\"\",\"\",VLOOKUP($C31,invullijst!$A$11:$M$185,11,FALSE))","v":0}]
[{"$nulls":3},{"$f":"IF(VLOOKUP($C32,invullijst!$A$11:$M213,4,FALSE)=\"\",\"\",VLOOKUP($C32,invullijst!$A$11:$M213,4,FALSE))","v":0},{"$f":"IF(VLOOKUP($C32,invullijst!$A$11:$M209,2,FALSE)=\"\",\"\",VLOOKUP($C32,invullijst!$A$11:$M209,2,FALSE))","v":0},{"$f":"IF(VLOOKUP($C32,invullijst!$A$11:$M$185,3,FALSE)=\"\",\"\",VLOOKUP($C32,invullijst!$A$11:$M$185,3,FALSE))","v":0},{"$f":"IF(VLOOKUP($C32,invullijst!$A$11:$M$185,6,FALSE)=\"\",\"\",VLOOKUP($C32,invullijst!$A$11:$M$185,6,FALSE))","v":0},{"$f":"IF(VLOOKUP($C32,invullijst!$A$11:$M$185,7,FALSE)=\"\",\"\",VLOOKUP($C32,invullijst!$A$11:$M$185,7,FALSE))","v":0},{"$f":"IF(VLOOKUP($C32,invullijst!$A$11:$M$185,8,FALSE)=\"\",\"\",VLOOKUP($C32,invullijst!$A$11:$M$185,8,FALSE))","v":0},{"$f":"IF(VLOOKUP($C32,invullijst!$A$11:$M$185,9,FALSE)=\"\",\"\",VLOOKUP($C32,invullijst!$A$11:$M$185,9,FALSE))","v":0},{"$f":"IF(VLOOKUP($C32,invullijst!$A$11:$M$185,10,FALSE)=\"\",\"\",VLOOKUP($C32,invullijst!$A$11:$M$185,10,FALSE))","v":0},0,{"$f":"IF(VLOOKUP($C32,invullijst!$A$11:$M$185,11,FALSE)=\"\",\"\",VLOOKUP($C32,invullijst!$A$11:$M$185,11,FALSE))","v":0}]
[{"$nulls":3},{"$f":"IF(VLOOKUP($C33,invullijst!$A$11:$M214,4,FALSE)=\"\",\"\",VLOOKUP($C33,invullijst!$A$11:$M214,4,FALSE))","v":0},{"$f":"IF(VLOOKUP($C33,invullijst!$A$11:$M210,2,FALSE)=\"\",\"\",VLOOKUP($C33,invullijst!$A$11:$M210,2,FALSE))","v":0},{"$f":"IF(VLOOKUP($C33,invullijst!$A$11:$M$185,3,FALSE)=\"\",\"\",VLOOKUP($C33,invullijst!$A$11:$M$185,3,FALSE))","v":0},{"$f":"IF(VLOOKUP($C33,invullijst!$A$11:$M$185,6,FALSE)=\"\",\"\",VLOOKUP($C33,invullijst!$A$11:$M$185,6,FALSE))","v":0},{"$f":"IF(VLOOKUP($C33,invullijst!$A$11:$M$185,7,FALSE)=\"\",\"\",VLOOKUP($C33,invullijst!$A$11:$M$185,7,FALSE))","v":0},{"$f":"IF(VLOOKUP($C33,invullijst!$A$11:$M$185,8,FALSE)=\"\",\"\",VLOOKUP($C33,invullijst!$A$11:$M$185,8,FALSE))","v":0},{"$f":"IF(VLOOKUP($C33,invullijst!$A$11:$M$185,9,FALSE)=\"\",\"\",VLOOKUP($C33,invullijst!$A$11:$M$185,9,FALSE))","v":0},{"$f":"IF(VLOOKUP($C33,invullijst!$A$11:$M$185,10,FALSE)=\"\",\"\",VLOOKUP($C33,invullijst!$A$11:$M$185,10,FALSE))","v":0},0,{"$f":"IF(VLOOKUP($C33,invullijst!$A$11:$M$185,11,FALSE)=\"\",\"\",VLOOKUP($C33,invullijst!$A$11:$M$185,11,FALSE))","v":0}]
[{"$nulls":3},{"$f":"IF(VLOOKUP($C34,invullijst!$A$11:$M215,4,FALSE)=\"\",\"\",VLOOKUP($C34,invullijst!$A$11:$M215,4,FALSE))","v":0},{"$f":"IF(VLOOKUP($C34,invullijst!$A$11:$M211,2,FALSE)=\"\",\"\",VLOOKUP($C34,invullijst!$A$11:$M211,2,FALSE))","v":0},{"$f":"IF(VLOOKUP($C34,invullijst!$A$11:$M$185,3,FALSE)=\"\",\"\",VLOOKUP($C34,invullijst!$A$11:$M$185,3,FALSE))","v":0},{"$f":"IF(VLOOKUP($C34,invullijst!$A$11:$M$185,6,FALSE)=\"\",\"\",VLOOKUP($C34,invullijst!$A$11:$M$185,6,FALSE))","v":0},{"$f":"IF(VLOOKUP($C34,invullijst!$A$11:$M$185,7,FALSE)=\"\",\"\",VLOOKUP($C34,invullijst!$A$11:$M$185,7,FALSE))","v":0},{"$f":"IF(VLOOKUP($C34,invullijst!$A$11:$M$185,8,FALSE)=\"\",\"\",VLOOKUP($C34,invullijst!$A$11:$M$185,8,FALSE))","v":0},{"$f":"IF(VLOOKUP($C34,invullijst!$A$11:$M$185,9,FALSE)=\"\",\"\",VLOOKUP($C34,invullijst!$A$11:$M$185,9,FALSE))","v":0},{"$f":"IF(VLOOKUP($C34,invullijst!$A$11:$M$185,10,FALSE)=\"\",\"\",VLOOKUP($C34,invullijst!$A$11:$M$185,10,FALSE))","v":0},0,{"$f":"IF(VLOOKUP($C34,invullijst!$A$11:$M$185,11,FALSE)=\"\",\"\",VLOOKUP($C34,invullijst!$A$11:$M$185,11,FALSE))","v":0}]

{"sheet":"Korps","index":4,"n_rows":57,"n_cols":34,"rows_kept":57,"merged":[[0,2,0,3],[0,4,0,7],[0,9,0,13],[4,2,4,13],[4,16,4,31],[6,2,6,6],[6,9,6,13],[20,2,20,5],[20,9,20,12],[31,2,31,13],[31,16,31,31],[33,2,33,6],[33,9,33,13],[47,2,47,5],[47,9,47,12],[56,2,56,13]]}
[null,null,{"$f":"invullijst!F1","v":"Organistatie"},null,{"$f":"invullijst!H2","v":"2024 - 2025"},{"$nulls":4},{"$f":"invullijst!F3","v":"O.L.V. Schuts Elshout"}]
[]
[]
[]
[null,null,"UITSLAGEN  O.V.L.B. KORPS VRIJE-HAND",{"$nulls":13},"Hieronder niets wijzigen"]
[]
[null,null,"A-Korps Vrije-hand",{"$nulls":6},"B-Korps Vrije-hand",{"$nulls":18},"A-Korps",null,null,"B-Korps"]
[null,null,"Baardwijk",315,"-",343,"Besoijen",null,null,"Baardwijk",182,"-",308,"Besoijen",null,null,{"$f":"D8","v":315},"ba",{"$f":"IF(ISBLANK(D8),\"\",IF(D8=F8,1,IF(D8>F8,2,0)))","v":0},{"$f":"IF(ISBLANK(F8),\"\",IF(F8=D8,1,IF(F8>D8,2,0)))","v":2},"be",{"$f":"F8","v":343},{"$f":"K8","v":182},"ba",{"$f":"IF(ISBLANK(K8),\"\",IF(K8=M8,1,IF(K8>M8,2,0)))","v":0},{"$f":"IF(ISBLANK(M8),\"\",IF(M8=K8,1,IF(M8>K8,2,0)))","v":2},"be",{"$f":"M8","v":308},"Baardwijk",{"$f":"SUM(S8:S11)","v":2},{"$f":"SUM(Q8:Q11)","v":1265},"Baardwijk",{"$f":"SUM(Y8:Y11)","v":4},{"$f":"SUM(W8:W11)","v":699}]
[null,null,"Baardwijk",311,"-",318,"Elshout",null,null,"Baardwijk",206,"-",0,"Elshout",null,null,311,"ba",0,2,"el",318,{"$f":"K9","v":206},"ba",{"$f":"IF(ISBLANK(K9),\"\",IF(K9=M9,1,IF(K9>M9,2,0)))","v":2},{"$f":"IF(ISBLANK(M9),\"\",IF(M9=K9,1,IF(M9>K9,2,0)))","v":0},"el",{"$f":"M9","v":0},"Besoijen",{"$f":"SUM(T8,S12:S14)","v":8},{"$f":"SUM(V8,Q12:Q14)","v":1378},"Besoijen",{"$f":"SUM(Z8,Y12:Y14)","v":8},{"$f":"SUM(AB8,W12:W14)","v":1271}]
[null,null,"Baardwijk",323,"-",338,"Haarsteeg",null,null,"Baardwijk",128,"-",53,"Haarsteeg",null,null,323,"ba",0,2,"ha",338,128,"ba",2,0,"ha",53,"Elshout",{"$f":"SUM(T9,T12,S15:S16)","v":6},{"$f":"SUM(V9,V12,Q15:Q16)","v":1304},"Elshout",{"$f":"SUM(Z9,Z12,Y15:Y16)","v":0},{"$f":"SUM(AB9,AB12,W15:W16)","v":0}]
[null,null,"Baardwijk",316,"-",308,"Kaatsheuvel",null,null,"Baardwijk",183,"-",215,"Kaatsheuvel",null,null,316,"ba",2,0,"ka",308,183,"ba",0,2,"ka",215,"Haarsteeg",{"$f":"SUM(T10,T13,T15,S17)","v":4},{"$f":"SUM(V10,V13,V15,Q17)","v":1312},"Haarsteeg",{"$f":"SUM(Z10,Z13,Z15,Y17)","v":2},{"$f":"SUM(AB10,AB13,AB15,W17)","v":129}]
[null,null,"Besoijen",348,"-",333,"Elshout",null,null,"Besoijen",313,"-",0,"Elshout",null,null,348,"be",2,0,"el",333,313,"be",2,0,"el",0,"Kaatsheuvel",{"$f":"SUM(T11,T14,T16,T17)","v":0},{"$f":"SUM(V11,V14,V16,V17)","v":1237},"Kaatsheuvel",{"$f":"SUM(Z11,Z14,Z16,Z17)","v":6},{"$f":"SUM(AB11,AB14,AB16,AB17)","v":807}]
[null,null,"Besoijen",340,"-",314,"Haarsteeg",null,null,"Besoijen",322,"-",0,"Haarsteeg",null,null,340,"be",2,0,"ha",314,322,"be",2,0,"ha",0]
[null,null,"Besoijen",347,"-",311,"Kaatsheuvel",null,null,"Besoijen",328,"-",227,"Kaatsheuvel",null,null,347,"be",2,0,"ka",311,328,"be",2,0,"ka",227]
[null,null,"Elshout",336,"-",327,"Haarsteeg",null,null,"Elshout",0,"-",76,"Haarsteeg",null,null,336,"el",2,0,"ha",327,0,"el",0,2,"ha",76]
[null,null,"Elshout",317,"-",311,"Kaatsheuvel",null,null,"Elshout",0,"-",68,"Kaatsheuvel",null,null,317,"el",2,0,"ka",311,0,"el",0,2,"ka",68]
[null,null,"Haarsteeg",333,"-",307,"Kaatsheuvel",null,null,"Haarsteeg",0,"-",297,"Kaatsheuvel",null,null,333,"ha",2,0,"ka",307,0,"ha",0,2,"ka",297]
[null,null,"(*): de wedstrijden kunnen zowel uit- als thuiswedstrijden zijn; dus b.v. zowel Besoijen-Elshout als Elshout- Besoijen... "]
[]
[]
[null,null,"EINDSTAND A-KORPS VRIJE-HAND",{"$nulls":6},"EINDSTAND B-KORPS VRIJE-HAND"]
[{"$nulls":3},"Matchpunten","-","Totaalpunten",{"$nulls":4},"Matchpunten","-","Totaalpunten"]
[]
[1,null,"Besoijen",{"$f":"IF(ISTEXT(C24),VLOOKUP(C24,$AC$8:$AE$12,2,FALSE),\" \")","v":8},"-",{"$f":"IF(ISTEXT(C24),VLOOKUP(C24,$AC$8:$AE$12,3,FALSE),\" \")","v":1378},null,1,null,"Besoijen",{"$f":"IF(ISTEXT(J24),VLOOKUP(J24,$AF$8:$AH$12,2,FALSE),\" \")","v":8},"-",{"$f":"IF(ISTEXT(J24),VLOOKUP(J24,$AF$8:$AH$12,3,FALSE),\" \")","v":1271}]
[2,null,"Elshout",{"$f":"IF(ISTEXT(C25),VLOOKUP(C25,$AC$8:$AE$12,2,FALSE),\" \")","v":6},"-",{"$f":"IF(ISTEXT(C25),VLOOKUP(C25,$AC$8:$AE$12,3,FALSE),\" \")","v":1304},null,2,null,"Kaatsheuvel",{"$f":"IF(ISTEXT(J25),VLOOKUP(J25,$AF$8:$AH$12,2,FALSE),\" \")","v":6},"-",{"$f":"IF(ISTEXT(J25),VLOOKUP(J25,$AF$8:$AH$12,3,FALSE),\" \")","v":807}]
[3,null,"Haarsteeg",{"$f":"IF(ISTEXT(C26),VLOOKUP(C26,$AC$8:$AE$12,2,FALSE),\" \")","v":4},"-",{"$f":"IF(ISTEXT(C26),VLOOKUP(C26,$AC$8:$AE$12,3,FALSE),\" \")","v":1312},null,3,null,"Baardwijk",{"$f":"IF(ISTEXT(J26),VLOOKUP(J26,$AF$8:$AH$12,2,FALSE),\" \")","v":4},"-",{"$f":"IF(ISTEXT(J26),VLOOKUP(J26,$AF$8:$AH$12,3,FALSE),\" \")","v":699}]
[4,null,"Baardwijk",{"$f":"IF(ISTEXT(C27),VLOOKUP(C27,$AC$8:$AE$12,2,FALSE),\" \")","v":2},"-",{"$f":"IF(ISTEXT(C27),VLOOKUP(C27,$AC$8:$AE$12,3,FALSE),\" \")","v":1265},null,4,null,"Haarsteeg",{"$f":"IF(ISTEXT(J27),VLOOKUP(J27,$AF$8:$AH$12,2,FALSE),\" \")","v":2},"-",{"$f":"IF(ISTEXT(J27),VLOOKUP(J27,$AF$8:$AH$12,3,FALSE),\" \")","v":129}]
[5,null,"Kaatsheuvel",{"$f":"IF(ISTEXT(C28),VLOOKUP(C28,$AC$8:$AE$12,2,FALSE),\" \")","v":0},"-",{"$f":"IF(ISTEXT(C28),VLOOKUP(C28,$AC$8:$AE$12,3,FALSE),\" \")","v":1237},null,5,null,"Elshout",{"$f":"IF(ISTEXT(J28),VLOOKUP(J28,$AF$8:$AH$12,2,FALSE),\" \")","v":0},"-",{"$f":"IF(ISTEXT(J28),VLOOKUP(J28,$AF$8:$AH$12,3,FALSE),\" \")","v":0}]
[]
[]
[]
[null,null,"UITSLAGEN  O.V.L.B. KORPS OPGELEGD",{"$nulls":13},"Hieronder niets wijzigen"]
[]
[null,null,"A-KORPS OPGELEGD",{"$nulls":6},"B-KORPS OPGELEGD",{"$nulls":18},"A-Korps",null,null,"B-Korps"]
[null,null,"Baardwijk",139,"-",277,"Besoijen",null,null,"Baardwijk",null,"-",251,"Besoijen",null,null,{"$f":"D35","v":139},"ba",{"$f":"IF(ISBLANK(D35),\"\",IF(D35=F35,1,IF(D35>F35,2,0)))","v":0},{"$f":"IF(ISBLANK(F35),\"\",IF(F35=D35,1,IF(F35>D35,2,0)))","v":2},"be",{"$f":"F35","v":277},{"$f":"K35","v":0},"ba",{"$f":"IF(ISBLANK(K35),\"\",IF(K35=M35,1,IF(K35>M35,2,0)))","v":""},{"$f":"IF(ISBLANK(M35),\"\",IF(M35=K35,1,IF(M35>K35,2,0)))","v":2},"be",{"$f":"M35","v":251},"Baardwijk",{"$f":"SUM(S35:S38)","v":0},{"$f":"SUM(Q35:Q38)","v":748},"Baardwijk",{"$f":"SUM(Y35:Y38)","v":0},{"$f":"SUM(W35:W38)","v":0}]
[null,null,"Baardwijk",223,"-",268,"Elshout",null,null,"Baardwijk",null,"-",181,"Elshout",null,null,223,"ba",0,2,"el",268,{"$f":"K36","v":0},"ba",{"$f":"IF(ISBLANK(K36),\"\",IF(K36=M36,1,IF(K36>M36,2,0)))","v":""},{"$f":"IF(ISBLANK(M36),\"\",IF(M36=K36,1,IF(M36>K36,2,0)))","v":2},"el",{"$f":"M36","v":181},"Besoijen",{"$f":"SUM(T35,S39:S41)","v":6},{"$f":"SUM(V35,Q39:Q41)","v":1123},"Besoijen",{"$f":"SUM(Z35,Y39:Y41)","v":4},{"$f":"SUM(AB35,W39:W41)","v":846}]
[null,null,"Baardwijk",153,"-",293,"Haarsteeg",null,null,"Baardwijk",0,"-",286,"Haarsteeg",null,null,153,"ba",0,2,"ha",293,0,"ba",0,2,"ha",286,"Elshout",{"$f":"SUM(T36,T39,S42:S43)","v":4},{"$f":"SUM(V36,V39,Q42:Q43)","v":1095},"Elshout",{"$f":"SUM(Z36,Z39,Y42:Y43)","v":6},{"$f":"SUM(AB36,AB39,W42:W43)","v":540}]
[null,null,"Baardwijk",233,"-",271,"Kaatsheuvel",null,null,"Baardwijk",null,"-",null,"Kaatsheuvel",null,null,233,"ba",0,2,"ka",271,0,"ba","","","ka",0,"Haarsteeg",{"$f":"SUM(T37,T40,T42,S44)","v":8},{"$f":"SUM(V37,V40,V42,Q44)","v":1158},"Haarsteeg",{"$f":"SUM(Z37,Z40,Z42,Y44)","v":8},{"$f":"SUM(AB37,AB40,AB42,W44)","v":1137}]
[null,null,"Besoijen",279,"-",271,"Elshout",null,null,"Besoijen",74,"-",89,"Elshout",null,null,279,"be",2,0,"el",271,74,"be",0,2,"el",89,"Kaatsheuvel",{"$f":"SUM(T38,T41,T43,T44)","v":2},{"$f":"SUM(V38,V41,V43,V44)","v":1085},"Kaatsheuvel",{"$f":"SUM(Z38,Z41,Z43,Z44)","v":0},{"$f":"SUM(AB38,AB41,AB43,AB44)","v":325}]
[null,null,"Besoijen",284,"-",288,"Haarsteeg",null,null,"Besoijen",264,"-",283,"Haarsteeg",null,null,284,"be",0,2,"ha",288,264,"be",0,2,"ha",283]
[null,null,"Besoijen",283,"-",273,"Kaatsheuvel",null,null,"Besoijen",257,"-",84,"Kaatsheuvel",null,null,283,"be",2,0,"ka",273,257,"be",2,0,"ka",84]
[null,null,"Elshout",274,"-",290,"Haarsteeg",null,null,"Elshout",94,"-",286,"Haarsteeg",null,null,274,"el",0,2,"ha",290,94,"el",0,2,"ha",286]
[null,null,"Elshout",282,"-",269,"Kaatsheuvel",null,null,"Elshout",176,"-",164,"Kaatsheuvel",null,null,282,"el",2,0,"ka",269,176,"el",2,0,"ka",164]
[null,null,"Haarsteeg",287,"-",272,"Kaatsheuvel",null,null,"Haarsteeg",282,"-",77,"Kaatsheuvel",null,null,287,"ha",2,0,"ka",272,282,"ha",2,0,"ka",77]
[null,null,"(*): de wedstrijden kunnen zowel uit- als thuiswedstrijden zijn; dus b.v. zowel Besoijen-Elshout als Elshout- Besoijen... "]
[]
[]
[null,null,"EINDSTAND A-KORPS OPGELEGD",{"$nulls":6},"EINDSTAND B-KORPS OPGELEGD"]
[{"$nulls":3},"Matchpunten","-","Totaalpunten",{"$nulls":4},"Matchpunten","-","Totaalpunten"]
[]
[1,null,"Haarsteeg",{"$f":"IF(ISTEXT(C51),VLOOKUP(C51,$AC$35:$AE$39,2,FALSE),\" \")","v":8},"-",{"$f":"IF(ISTEXT(C51),VLOOKUP(C51,$AC$35:$AE$39,3,FALSE),\" \")","v":1158},null,1,null,"Haarsteeg",{"$f":"IF(ISTEXT(J51),VLOOKUP(J51,$AF$35:$AH$39,2,FALSE),\" \")","v":8},"-",{"$f":"IF(ISTEXT(J51),VLOOKUP(J51,$AF$35:$AH$39,3,FALSE),\" \")","v":1137}]
[2,null,"Besoijen",{"$f":"IF(ISTEXT(C52),VLOOKUP(C52,$AC$35:$AE$39,2,FALSE),\" \")","v":6},"-",{"$f":"IF(ISTEXT(C52),VLOOKUP(C52,$AC$35:$AE$39,3,FALSE),\" \")","v":1123},null,2,null,"Elshout",{"$f":"IF(ISTEXT(J52),VLOOKUP(J52,$AF$35:$AH$39,2,FALSE),\" \")","v":6},"-",{"$f":"IF(ISTEXT(J52),VLOOKUP(J52,$AF$35:$AH$39,3,FALSE),\" \")","v":540}]
[3,null,"Elshout",{"$f":"IF(ISTEXT(C53),VLOOKUP(C53,$AC$35:$AE$39,2,FALSE),\" \")","v":4},"-",{"$f":"IF(ISTEXT(C53),VLOOKUP(C53,$AC$35:$AE$39,3,FALSE),\" \")","v":1095},null,3,null,"Besoijen",{"$f":"IF(ISTEXT(J53),VLOOKUP(J53,$AF$35:$AH$39,2,FALSE),\" \")","v":4},"-",{"$f":"IF(ISTEXT(J53),VLOOKUP(J53,$AF$35:$AH$39,3,FALSE),\" \")","v":846}]
[4,null,"Kaatsheuvel",{"$f":"IF(ISTEXT(C54),VLOOKUP(C54,$AC$35:$AE$39,2,FALSE),\" \")","v":2},"-",{"$f":"IF(ISTEXT(C54),VLOOKUP(C54,$AC$35:$AE$39,3,FALSE),\" \")","v":1085},null,4,null,"Kaatsheuvel",{"$f":"IF(ISTEXT(J54),VLOOKUP(J54,$AF$35:$AH$39,2,FALSE),\" \")","v":0},"-",{"$f":"IF(ISTEXT(J54),VLOOKUP(J54,$AF$35:$AH$39,3,FALSE),\" \")","v":325}]
[5,null,"Baardwijk",{"$f":"IF(ISTEXT(C55),VLOOKUP(C55,$AC$35:$AE$39,2,FALSE),\" \")","v":0},"-",{"$f":"IF(ISTEXT(C55),VLOOKUP(C55,$AC$35:$AE$39,3,FALSE),\" \")","v":748},null,5,null,"Baardwijk",{"$f":"IF(ISTEXT(J55),VLOOKUP(J55,$AF$35:$AH$39,2,FALSE),\" \")","v":0},"-",{"$f":"IF(ISTEXT(J55),VLOOKUP(J55,$AF$35:$AH$39,3,FALSE),\" \")","v":0}]
[]
[null,null,"alleen in de groene kolom punten korps invullen"]

{"sheet":"wedstrijd 1A","index":5,"n_rows":38,"n_cols":15,"rows_kept":38,"merged":[[0,0,0,4],[0,5,0,7],[0,8,0,14],[1,0,1,11],[1,12,1,14],[2,1,2,5],[2,9,2,13],[4,0,4,14],[5,4,5,5],[5,12,5,13],[6,4,6,5],[6,12,6,13],[7,4,7,5],[7,12,7,13],[8,4,8,5],[8,12,8,13],[9,0,9,5],[9,8,9,13],[11,4,11,5],[11,12,11,13],[12,4,12,5],[12,12,12,13],[13,4,13,5],[13,12,13,13],[14,4,14,5],[14,12,14,13],[15,0,15,5],[15,8,15,13],[17,4,17,5],[17,12,17,13],[18,4,18,5],[18,12,18,13],[19,4,19,5],[19,12,19,13],[20,4,20,5],[20,12,20,13],[21,0,21,5],[21,8,21,13],[23,0,23,14],[24,4,24,5],[24,12,24,13],[25,4,25,5],[25,12,25,13],[26,4,26,5],[26,12,26,13],[27,0,27,5],[27,8,27,13],[29,4,29,5],[29,12,29,13],[30,4,30,5],[30,12,30,13],[31,4,31,5],[31,12,31,13],[32,0,32,5],[32,8,32,13],[34,4,34,5],[34,12,34,13],[35,4,35,5],[35,12,35,13],[36,4,36,5],[36,12,36,13],[37,0,37,5],[37,8,37,13]]}
[{"$f":"invullijst!F1","v":"Organistatie"},{"$nulls":4},{"$f":"invullijst!H2","v":"2024 - 2025"},null,null,{"$f":"invullijst!F3","v":"O.L.V. Schuts Elshout"}]
["Datum: ",{"$nulls":11},"2024-12-08"]
[5,{"$f":"IF(VLOOKUP(A3,invullijst!A1:F5,2,FALSE)=\"\",\"\",VLOOKUP(A3,invullijst!A1:F5,2,FALSE))","v":"Sint Jan Baptist Kaatsheuvel"},{"$nulls":6},3,{"$f":"IF(VLOOKUP(I3,invullijst!A1:C5,2,FALSE)=\"\",\"\",VLOOKUP(I3,invullijst!A1:C5,2,FALSE))","v":"O.L.V. Schuts Elshout"}]
[]
["vrijehand"]
[1,{"$f":"IF($G$3=\"k\",IF(VLOOKUP($D6,invullijst!$A$11:$M$185,11,FALSE)=0,\" \",VLOOKUP($D6,invullijst!$A$11:$M$185,11,FALSE)),\"\")","v":""},{"$f":"IF(VLOOKUP(D6,invullijst!A$11:F$226,4,FALSE)=\"\",\"\",VLOOKUP(D6,invullijst!A$11:D$226,4,FALSE))","v":"vr"},506,{"$f":"IF(VLOOKUP($D6,invullijst!$A$11:$M$185,2,FALSE)=\"\",\"\",VLOOKUP($D6,invullijst!$A$11:$M$185,2,FALSE))","v":"Maikel Monden"},null,{"$f":"IF(VLOOKUP($D6,invullijst!$A$11:$M$185,6,FALSE)=0,\"\",VLOOKUP($D6,invullijst!$A$11:$M$185,6,FALSE))","v":83},null,1,{"$f":"IF($O$3=\"k\",IF(VLOOKUP($L6,invullijst!$A$11:$M$185,11,FALSE)=0,\" \",VLOOKUP($L6,invullijst!$A$11:$M$185,11,FALSE)),\"\")","v":""},{"$f":"IF(VLOOKUP($L6,invullijst!$A$11:$M$226,4,FALSE)=\"\",\"\",VLOOKUP($L6,invullijst!$A$11:$M$226,4,FALSE))","v":"vr"},311,{"$f":"IF(VLOOKUP($L6,invullijst!$A$11:$M$185,2,FALSE)=\"\",\"\",VLOOKUP($L6,invullijst!$A$11:$M$185,2,FALSE))","v":"Ton Kolmans"},null,{"$f":"IF(VLOOKUP($L6,invullijst!$A$11:$M$185,6,FALSE)=0,\"\",VLOOKUP($L6,invullijst!$A$11:$M$185,6,FALSE))","v":77}]
[2,{"$f":"IF($G$3=\"k\",IF(VLOOKUP($D7,invullijst!$A$11:$M$185,11,FALSE)=0,\" \",VLOOKUP($D7,invullijst!$A$11:$M$185,11,FALSE)),\"\")","v":""},{"$f":"IF(VLOOKUP(D7,invullijst!A$11:F$226,4,FALSE)=\"\",\"\",VLOOKUP(D7,invullijst!A$11:D$226,4,FALSE))","v":"vr"},512,{"$f":"IF(VLOOKUP($D7,invullijst!$A$11:$M$185,2,FALSE)=\"\",\"\",VLOOKUP($D7,invullijst!$A$11:$M$185,2,FALSE))","v":"Hans Bergakker"},null,{"$f":"IF(VLOOKUP($D7,invullijst!$A$11:$M$185,6,FALSE)=0,\"\",VLOOKUP($D7,invullijst!$A$11:$M$185,6,FALSE))","v":72},null,2,{"$f":"IF($O$3=\"k\",IF(VLOOKUP($L7,invullijst!$A$11:$M$185,11,FALSE)=0,\" \",VLOOKUP($L7,invullijst!$A$11:$M$185,11,FALSE)),\"\")","v":""},{"$f":"IF(VLOOKUP($L7,invullijst!$A$11:$M$226,4,FALSE)=\"\",\"\",VLOOKUP($L7,invullijst!$A$11:$M$226,4,FALSE))","v":"vr"},305,{"$f":"IF(VLOOKUP($L7,invullijst!$A$11:$M$185,2,FALSE)=\"\",\"\",VLOOKUP($L7,invullijst!$A$11:$M$185,2,FALSE))","v":"Johan Klerx"},null,{"$f":"IF(VLOOKUP($L7,invullijst!$A$11:$M$185,6,FALSE)=0,\"\",VLOOKUP($L7,invullijst!$A$11:$M$185,6,FALSE))","v":84}]
[3,{"$f":"IF($G$3=\"k\",IF(VLOOKUP($D8,invullijst!$A$11:$M$185,11,FALSE)=0,\" \",VLOOKUP($D8,invullijst!$A$11:$M$185,11,FALSE)),\"\")","v":""},{"$f":"IF(VLOOKUP(D8,invullijst!A$11:F$226,4,FALSE)=\"\",\"\",VLOOKUP(D8,invullijst!A$11:D$226,4,FALSE))","v":"vr"},513,{"$f":"IF(VLOOKUP($D8,invullijst!$A$11:$M$185,2,FALSE)=\"\",\"\",VLOOKUP($D8,invullijst!$A$11:$M$185,2,FALSE))","v":"Mark van Delft"},null,{"$f":"IF(VLOOKUP($D8,invullijst!$A$11:$M$185,6,FALSE)=0,\"\",VLOOKUP($D8,invullijst!$A$11:$M$185,6,FALSE))","v":78},null,3,{"$f":"IF($O$3=\"k\",IF(VLOOKUP($L8,invullijst!$A$11:$M$185,11,FALSE)=0,\" \",VLOOKUP($L8,invullijst!$A$11:$M$185,11,FALSE)),\"\")","v":""},{"$f":"IF(VLOOKUP($L8,invullijst!$A$11:$M$226,4,FALSE)=\"\",\"\",VLOOKUP($L8,invullijst!$A$11:$M$226,4,FALSE))","v":"vr"},304,{"$f":"IF(VLOOKUP($L8,invullijst!$A$11:$M$185,2,FALSE)=\"\",\"\",VLOOKUP($L8,invullijst!$A$11:$M$185,2,FALSE))","v":"Henk Bruurmijn "},null,{"$f":"IF(VLOOKUP($L8,invullijst!$A$11:$M$185,6,FALSE)=0,\"\",VLOOKUP($L8,invullijst!$A$11:$M$185,6,FALSE))","v":80}]
[4,{"$f":"IF($G$3=\"k\",IF(VLOOKUP($D9,invullijst!$A$11:$M$185,11,FALSE)=0,\" \",VLOOKUP($D9,invullijst!$A$11:$M$185,11,FALSE)),\"\")","v":""},{"$f":"IF(VLOOKUP(D9,invullijst!A$11:F$226,4,FALSE)=\"\",\"\",VLOOKUP(D9,invullijst!A$11:D$226,4,FALSE))","v":"vr"},508,{"$f":"IF(VLOOKUP($D9,invullijst!$A$11:$M$185,2,FALSE)=\"\",\"\",VLOOKUP($D9,invullijst!$A$11:$M$185,2,FALSE))","v":"Rowan Dobbelsteen"},null,{"$f":"IF(VLOOKUP($D9,invullijst!$A$11:$M$185,6,FALSE)=0,\"\",VLOOKUP($D9,invullijst!$A$11:$M$185,6,FALSE))","v":78},null,4,{"$f":"IF($O$3=\"k\",IF(VLOOKUP($L9,invullijst!$A$11:$M$185,11,FALSE)=0,\" \",VLOOKUP($L9,invullijst!$A$11:$M$185,11,FALSE)),\"\")","v":""},{"$f":"IF(VLOOKUP($L9,invullijst!$A$11:$M$226,4,FALSE)=\"\",\"\",VLOOKUP($L9,invullijst!$A$11:$M$226,4,FALSE))","v":"vr"},306,{"$f":"IF(VLOOKUP($L9,invullijst!$A$11:$M$185,2,FALSE)=\"\",\"\",VLOOKUP($L9,invullijst!$A$11:$M$185,2,FALSE))","v":"Ron Groot"},null,{"$f":"IF(VLOOKUP($L9,invullijst!$A$11:$M$185,6,FALSE)=0,\"\",VLOOKUP($L9,invullijst!$A$11:$M$185,6,FALSE))","v":76}]
["Totaal A korps",{"$nulls":5},{"$f":"SUM(G6:G9)","v":311},null,"Totaal A korps",{"$nulls":5},{"$f":"SUM(O6:O9)","v":317}]
[]
[1,{"$f":"IF($G$3=\"k\",IF(VLOOKUP($D12,invullijst!$A$11:$M$185,11,FALSE)=0,\" \",VLOOKUP($D12,invullijst!$A$11:$M$185,11,FALSE)),\"\")","v":""},{"$f":"IF(VLOOKUP(D12,invullijst!A$11:F$226,4,FALSE)=\"\",\"\",VLOOKUP(D12,invullijst!A$11:D$226,4,FALSE))","v":"vr"},517,{"$f":"IF(VLOOKUP($D12,invullijst!$A$11:$M$185,2,FALSE)=\"\",\"\",VLOOKUP($D12,invullijst!$A$11:$M$185,2,FALSE))","v":"Diny Vos"},null,{"$f":"IF(VLOOKUP($D12,invullijst!$A$11:$M$185,6,FALSE)=0,\"\",VLOOKUP($D12,invullijst!$A$11:$M$185,6,FALSE))","v":68},null,1,{"$f":"IF($O$3=\"k\",IF(VLOOKUP($L12,invullijst!$A$11:$M$185,11,FALSE)=0,\" \",VLOOKUP($L12,invullijst!$A$11:$M$185,11,FALSE)),\"\")","v":""},{"$f":"IF(VLOOKUP($L12,invullijst!$A$11:$M$226,4,FALSE)=\"\",\"\",VLOOKUP($L12,invullijst!$A$11:$M$226,4,FALSE))","v":0},null,{"$f":"IF(VLOOKUP($L12,invullijst!$A$11:$M$185,2,FALSE)=\"\",\"\",VLOOKUP($L12,invullijst!$A$11:$M$185,2,FALSE))","v":0},null,{"$f":"IF(VLOOKUP($L12,invullijst!$A$11:$M$185,6,FALSE)=0,\"\",VLOOKUP($L12,invullijst!$A$11:$M$185,6,FALSE))","v":""}]
[2,{"$f":"IF($G$3=\"k\",IF(VLOOKUP($D13,invullijst!$A$11:$M$185,11,FALSE)=0,\" \",VLOOKUP($D13,invullijst!$A$11:$M$185,11,FALSE)),\"\")","v":""},{"$f":"IF(VLOOKUP(D13,invullijst!A$11:F$226,4,FALSE)=\"\",\"\",VLOOKUP(D13,invullijst!A$11:D$226,4,FALSE))","v":0},null,{"$f":"IF(VLOOKUP($D13,invullijst!$A$11:$M$185,2,FALSE)=\"\",\"\",VLOOKUP($D13,invullijst!$A$11:$M$185,2,FALSE))","v":0},null,{"$f":"IF(VLOOKUP($D13,invullijst!$A$11:$M$185,6,FALSE)=0,\"\",VLOOKUP($D13,invullijst!$A$11:$M$185,6,FALSE))","v":""},null,2,{"$f":"IF($O$3=\"k\",IF(VLOOKUP($L13,invullijst!$A$11:$M$185,11,FALSE)=0,\" \",VLOOKUP($L13,invullijst!$A$11:$M$185,11,FALSE)),\"\")","v":""},{"$f":"IF(VLOOKUP($L13,invullijst!$A$11:$M$226,4,FALSE)=\"\",\"\",VLOOKUP($L13,invullijst!$A$11:$M$226,4,FALSE))","v":0},null,{"$f":"IF(VLOOKUP($L13,invullijst!$A$11:$M$185,2,FALSE)=\"\",\"\",VLOOKUP($L13,invullijst!$A$11:$M$185,2,FALSE))","v":0},null,{"$f":"IF(VLOOKUP($L13,invullijst!$A$11:$M$185,6,FALSE)=0,\"\",VLOOKUP($L13,invullijst!$A$11:$M$185,6,FALSE))","v":""}]
[3,{"$f":"IF($G$3=\"k\",IF(VLOOKUP($D14,invullijst!$A$11:$M$185,11,FALSE)=0,\" \",VLOOKUP($D14,invullijst!$A$11:$M$185,11,FALSE)),\"\")","v":""},{"$f":"IF(VLOOKUP(D14,invullijst!A$11:F$226,4,FALSE)=\"\",\"\",VLOOKUP(D14,invullijst!A$11:D$226,4,FALSE))","v":0},null,{"$f":"IF(VLOOKUP($D14,invullijst!$A$11:$M$185,2,FALSE)=\"\",\"\",VLOOKUP($D14,invullijst!$A$11:$M$185,2,FALSE))","v":0},null,{"$f":"IF(VLOOKUP($D14,invullijst!$A$11:$M$185,6,FALSE)=0,\"\",VLOOKUP($D14,invullijst!$A$11:$M$185,6,FALSE))","v":""},null,3,{"$f":"IF($O$3=\"k\",IF(VLOOKUP($L14,invullijst!$A$11:$M$185,11,FALSE)=0,\" \",VLOOKUP($L14,invullijst!$A$11:$M$185,11,FALSE)),\"\")","v":""},{"$f":"IF(VLOOKUP($L14,invullijst!$A$11:$M$226,4,FALSE)=\"\",\"\",VLOOKUP($L14,invullijst!$A$11:$M$226,4,FALSE))","v":0},null,{"$f":"IF(VLOOKUP($L14,invullijst!$A$11:$M$185,2,FALSE)=\"\",\"\",VLOOKUP($L14,invullijst!$A$11:$M$185,2,FALSE))","v":0},null,{"$f":"IF(VLOOKUP($L14,invullijst!$A$11:$M$185,6,FALSE)=0,\"\",VLOOKUP($L14,invullijst!$A$11:$M$185,6,FALSE))","v":""}]
[4,{"$f":"IF($G$3=\"k\",IF(VLOOKUP($D15,invullijst!$A$11:$M$185,11,FALSE)=0,\" \",VLOOKUP($D15,invullijst!$A$11:$M$185,11,FALSE)),\"\")","v":""},{"$f":"IF(VLOOKUP(D15,invullijst!A$11:F$226,4,FALSE)=\"\",\"\",VLOOKUP(D15,invullijst!A$11:D$226,4,FALSE))","v":0},null,{"$f":"IF(VLOOKUP($D15,invullijst!$A$11:$M$185,2,FALSE)=\"\",\"\",VLOOKUP($D15,invullijst!$A$11:$M$185,2,FALSE))","v":0},null,{"$f":"IF(VLOOKUP($D15,invullijst!$A$11:$M$185,6,FALSE)=0,\"\",VLOOKUP($D15,invullijst!$A$11:$M$185,6,FALSE))","v":""},null,4,{"$f":"IF($O$3=\"k\",IF(VLOOKUP($L15,invullijst!$A$11:$M$185,11,FALSE)=0,\" \",VLOOKUP($L15,invullijst!$A$11:$M$185,11,FALSE)),\"\")","v":""},{"$f":"IF(VLOOKUP($L15,invullijst!$A$11:$M$226,4,FALSE)=\"\",\"\",VLOOKUP($L15,invullijst!$A$11:$M$226,4,FALSE))","v":0},null,{"$f":"IF(VLOOKUP($L15,invullijst!$A$11:$M$185,2,FALSE)=\"\",\"\",VLOOKUP($L15,invullijst!$A$11:$M$185,2,FALSE))","v":0},null,{"$f":"IF(VLOOKUP($L15,invullijst!$A$11:$M$185,6,FALSE)=0,\"\",VLOOKUP($L15,invullijst!$A$11:$M$185,6,FALSE))","v":""}]
["Totaal B1 korps",{"$nulls":5},{"$f":"SUM(G12:G15)","v":68},null,"Totaal B1 korps",{"$nulls":5},{"$f":"SUM(O12:O15)","v":0}]
[]
[1,{"$f":"IF($G$3=\"k\",IF(VLOOKUP($D18,invullijst!$A$11:$M$185,11,FALSE)=0,\" \",VLOOKUP($D18,invullijst!$A$11:$M$185,11,FALSE)),\"\")","v":""},{"$f":"IF(VLOOKUP(D18,invullijst!A$11:F$226,4,FALSE)=\"\",\"\",VLOOKUP(D18,invullijst!A$11:D$226,4,FALSE))","v":0},null,{"$f":"IF(VLOOKUP($D18,invullijst!$A$11:$M$185,2,FALSE)=\"\",\"\",VLOOKUP($D18,invullijst!$A$11:$M$185,2,FALSE))","v":0},null,{"$f":"IF(VLOOKUP($D18,invullijst!$A$11:$M$185,6,FALSE)=0,\"\",VLOOKUP($D18,invullijst!$A$11:$M$185,6,FALSE))","v":""},null,1,{"$f":"IF($O$3=\"k\",IF(VLOOKUP($L18,invullijst!$A$11:$M$185,11,FALSE)=0,\" \",VLOOKUP($L18,invullijst!$A$11:$M$185,11,FALSE)),\"\")","v":""},{"$f":"IF(VLOOKUP($L18,invullijst!$A$11:$M$226,4,FALSE)=\"\",\"\",VLOOKUP($L18,invullijst!$A$11:$M$226,4,FALSE))","v":0},null,{"$f":"IF(VLOOKUP($L18,invullijst!$A$11:$M$185,2,FALSE)=\"\",\"\",VLOOKUP($L18,invullijst!$A$11:$M$185,2,FALSE))","v":0},null,{"$f":"IF(VLOOKUP($L18,invullijst!$A$11:$M$185,6,FALSE)=0,\"\",VLOOKUP($L18,invullijst!$A$11:$M$185,6,FALSE))","v":""}]
[2,{"$f":"IF($G$3=\"k\",IF(VLOOKUP($D19,invullijst!$A$11:$M$185,11,FALSE)=0,\" \",VLOOKUP($D19,invullijst!$A$11:$M$185,11,FALSE)),\"\")","v":""},{"$f":"IF(VLOOKUP(D19,invullijst!A$11:F$226,4,FALSE)=\"\",\"\",VLOOKUP(D19,invullijst!A$11:D$226,4,FALSE))","v":0},null,{"$f":"IF(VLOOKUP($D19,invullijst!$A$11:$M$185,2,FALSE)=\"\",\"\",VLOOKUP($D19,invullijst!$A$11:$M$185,2,FALSE))","v":0},null,{"$f":"IF(VLOOKUP($D19,invullijst!$A$11:$M$185,6,FALSE)=0,\"\",VLOOKUP($D19,invullijst!$A$11:$M$185,6,FALSE))","v":""},null,2,{"$f":"IF($O$3=\"k\",IF(VLOOKUP($L19,invullijst!$A$11:$M$185,11,FALSE)=0,\" \",VLOOKUP($L19,invullijst!$A$11:$M$185,11,FALSE)),\"\")","v":""},{"$f":"IF(VLOOKUP($L19,invullijst!$A$11:$M$226,4,FALSE)=\"\",\"\",VLOOKUP($L19,invullijst!$A$11:$M$226,4,FALSE))","v":0},null,{"$f":"IF(VLOOKUP($L19,invullijst!$A$11:$M$185,2,FALSE)=\"\",\"\",VLOOKUP($L19,invullijst!$A$11:$M$185,2,FALSE))","v":0},null,{"$f":"IF(VLOOKUP($L19,invullijst!$A$11:$M$185,6,FALSE)=0,\"\",VLOOKUP($L19,invullijst!$A$11:$M$185,6,FALSE))","v":""}]
[3,{"$f":"IF($G$3=\"k\",IF(VLOOKUP($D20,invullijst!$A$11:$M$185,11,FALSE)=0,\" \",VLOOKUP($D20,invullijst!$A$11:$M$185,11,FALSE)),\"\")","v":""},{"$f":"IF(VLOOKUP(D20,invullijst!A$11:F$226,4,FALSE)=\"\",\"\",VLOOKUP(D20,invullijst!A$11:D$226,4,FALSE))","v":0},null,{"$f":"IF(VLOOKUP($D20,invullijst!$A$11:$M$185,2,FALSE)=\"\",\"\",VLOOKUP($D20,invullijst!$A$11:$M$185,2,FALSE))","v":0},null,{"$f":"IF(VLOOKUP($D20,invullijst!$A$11:$M$185,6,FALSE)=0,\"\",VLOOKUP($D20,invullijst!$A$11:$M$185,6,FALSE))","v":""},null,3,{"$f":"IF($O$3=\"k\",IF(VLOOKUP($L20,invullijst!$A$11:$M$185,11,FALSE)=0,\" \",VLOOKUP($L20,invullijst!$A$11:$M$185,11,FALSE)),\"\")","v":""},{"$f":"IF(VLOOKUP($L20,invullijst!$A$11:$M$226,4,FALSE)=\"\",\"\",VLOOKUP($L20,invullijst!$A$11:$M$226,4,FALSE))","v":0},null,{"$f":"IF(VLOOKUP($L20,invullijst!$A$11:$M$185,2,FALSE)=\"\",\"\",VLOOKUP($L20,invullijst!$A$11:$M$185,2,FALSE))","v":0},null,{"$f":"IF(VLOOKUP($L20,invullijst!$A$11:$M$185,6,FALSE)=0,\"\",VLOOKUP($L20,invullijst!$A$11:$M$185,6,FALSE))","v":""}]
[4,{"$f":"IF($G$3=\"k\",IF(VLOOKUP($D21,invullijst!$A$11:$M$185,11,FALSE)=0,\" \",VLOOKUP($D21,invullijst!$A$11:$M$185,11,FALSE)),\"\")","v":""},{"$f":"IF(VLOOKUP(D21,invullijst!A$11:F$226,4,FALSE)=\"\",\"\",VLOOKUP(D21,invullijst!A$11:D$226,4,FALSE))","v":0},null,{"$f":"IF(VLOOKUP($D21,invullijst!$A$11:$M$185,2,FALSE)=\"\",\"\",VLOOKUP($D21,invullijst!$A$11:$M$185,2,FALSE))","v":0},null,{"$f":"IF(VLOOKUP($D21,invullijst!$A$11:$M$185,6,FALSE)=0,\"\",VLOOKUP($D21,invullijst!$A$11:$M$185,6,FALSE))","v":""},null,4,{"$f":"IF($O$3=\"k\",IF(VLOOKUP($L21,invullijst!$A$11:$M$185,11,FALSE)=0,\" \",VLOOKUP($L21,invullijst!$A$11:$M$185,11,FALSE)),\"\")","v":""},{"$f":"IF(VLOOKUP($L21,invullijst!$A$11:$M$226,4,FALSE)=\"\",\"\",VLOOKUP($L21,invullijst!$A$11:$M$226,4,FALSE))","v":0},null,{"$f":"IF(VLOOKUP($L21,invullijst!$A$11:$M$185,2,FALSE)=\"\",\"\",VLOOKUP($L21,invullijst!$A$11:$M$185,2,FALSE))","v":0},null,{"$f":"IF(VLOOKUP($L21,invullijst!$A$11:$M$185,6,FALSE)=0,\"\",VLOOKUP($L21,invullijst!$A$11:$M$185,6,FALSE))","v":""}]
["DIVERSEN / INHAAL",{"$nulls":7},"DIVERSEN / INHAAL"]
[]
["OPGELEGD (Jeugd <16 en 65+)"]
[1,{"$f":"IF($G$3=\"k\",IF(VLOOKUP($D25,invullijst!$A$11:$M$185,11,FALSE)=0,\" \",VLOOKUP($D25,invullijst!$A$11:$M$185,11,FALSE)),\"\")","v":""},{"$f":"IF(VLOOKUP(D25,invullijst!A$11:F$226,4,FALSE)=\"\",\"\",VLOOKUP(D25,invullijst!A$11:D$226,4,FALSE))","v":"65+"},516,{"$f":"IF(VLOOKUP($D25,invullijst!$A$11:$M$185,2,FALSE)=\"\",\"\",VLOOKUP($D25,invullijst!$A$11:$M$185,2,FALSE))","v":"Henry Bergakker disp"},null,{"$f":"IF(VLOOKUP($D25,invullijst!$A$11:$M$185,6,FALSE)=0,\"\",VLOOKUP($D25,invullijst!$A$11:$M$185,6,FALSE))","v":90},null,1,{"$f":"IF($O$3=\"k\",IF(VLOOKUP($L25,invullijst!$A$11:$M$185,11,FALSE)=0,\" \",VLOOKUP($L25,invullijst!$A$11:$M$185,11,FALSE)),\"\")","v":""},{"$f":"IF(VLOOKUP($L25,invullijst!$A$11:$M$226,4,FALSE)=\"\",\"\",VLOOKUP($L25,invullijst!$A$11:$M$226,4,FALSE))","v":"65+"},307,{"$f":"IF(VLOOKUP($L25,invullijst!$A$11:$M$185,2,FALSE)=\"\",\"\",VLOOKUP($L25,invullijst!$A$11:$M$185,2,FALSE))","v":"Bert van Engelen"},null,{"$f":"IF(VLOOKUP($L25,invullijst!$A$11:$M$185,6,FALSE)=0,\"\",VLOOKUP($L25,invullijst!$A$11:$M$185,6,FALSE))","v":95}]
[2,{"$f":"IF($G$3=\"k\",IF(VLOOKUP($D26,invullijst!$A$11:$M$185,11,FALSE)=0,\" \",VLOOKUP($D26,invullijst!$A$11:$M$185,11,FALSE)),\"\")","v":""},{"$f":"IF(VLOOKUP(D26,invullijst!A$11:F$226,4,FALSE)=\"\",\"\",VLOOKUP(D26,invullijst!A$11:D$226,4,FALSE))","v":"65+"},509,{"$f":"IF(VLOOKUP($D26,invullijst!$A$11:$M$185,2,FALSE)=\"\",\"\",VLOOKUP($D26,invullijst!$A$11:$M$185,2,FALSE))","v":"Adwan de Pinth"},null,{"$f":"IF(VLOOKUP($D26,invullijst!$A$11:$M$185,6,FALSE)=0,\"\",VLOOKUP($D26,invullijst!$A$11:$M$185,6,FALSE))","v":90},null,2,{"$f":"IF($O$3=\"k\",IF(VLOOKUP($L26,invullijst!$A$11:$M$185,11,FALSE)=0,\" \",VLOOKUP($L26,invullijst!$A$11:$M$185,11,FALSE)),\"\")","v":""},{"$f":"IF(VLOOKUP($L26,invullijst!$A$11:$M$226,4,FALSE)=\"\",\"\",VLOOKUP($L26,invullijst!$A$11:$M$226,4,FALSE))","v":"65+"},310,{"$f":"IF(VLOOKUP($L26,invullijst!$A$11:$M$185,2,FALSE)=\"\",\"\",VLOOKUP($L26,invullijst!$A$11:$M$185,2,FALSE))","v":"Tiny Boom"},null,{"$f":"IF(VLOOKUP($L26,invullijst!$A$11:$M$185,6,FALSE)=0,\"\",VLOOKUP($L26,invullijst!$A$11:$M$185,6,FALSE))","v":92}]
[3,{"$f":"IF($G$3=\"k\",IF(VLOOKUP($D27,invullijst!$A$11:$M$185,11,FALSE)=0,\" \",VLOOKUP($D27,invullijst!$A$11:$M$185,11,FALSE)),\"\")","v":""},{"$f":"IF(VLOOKUP(D27,invullijst!A$11:F$226,4,FALSE)=\"\",\"\",VLOOKUP(D27,invullijst!A$11:D$226,4,FALSE))","v":"65+"},515,{"$f":"IF(VLOOKUP($D27,invullijst!$A$11:$M$185,2,FALSE)=\"\",\"\",VLOOKUP($D27,invullijst!$A$11:$M$185,2,FALSE))","v":"Ilona Bergakker disp"},null,{"$f":"IF(VLOOKUP($D27,invullijst!$A$11:$M$185,6,FALSE)=0,\"\",VLOOKUP($D27,invullijst!$A$11:$M$185,6,FALSE))","v":89},null,3,{"$f":"IF($O$3=\"k\",IF(VLOOKUP($L27,invullijst!$A$11:$M$185,11,FALSE)=0,\" \",VLOOKUP($L27,invullijst!$A$11:$M$185,11,FALSE)),\"\")","v":""},{"$f":"IF(VLOOKUP($L27,invullijst!$A$11:$M$226,4,FALSE)=\"\",\"\",VLOOKUP($L27,invullijst!$A$11:$M$226,4,FALSE))","v":"J"},312,{"$f":"IF(VLOOKUP($L27,invullijst!$A$11:$M$185,2,FALSE)=\"\",\"\",VLOOKUP($L27,invullijst!$A$11:$M$185,2,FALSE))","v":"Floor de Jong"},null,{"$f":"IF(VLOOKUP($L27,invullijst!$A$11:$M$185,6,FALSE)=0,\"\",VLOOKUP($L27,invullijst!$A$11:$M$185,6,FALSE))","v":95}]
["Totaal korps opgelegd A1",{"$nulls":5},{"$f":"SUM(G25:G27)","v":269},null,"Totaal korps opgelegd A1",{"$nulls":5},{"$f":"SUM(O25:O27)","v":282}]
[]
[1,{"$f":"IF($G$3=\"k\",IF(VLOOKUP($D30,invullijst!$A$11:$M$185,11,FALSE)=0,\" \",VLOOKUP($D30,invullijst!$A$11:$M$185,11,FALSE)),\"\")","v":""},{"$f":"IF(VLOOKUP(D30,invullijst!A$11:F$226,4,FALSE)=\"\",\"\",VLOOKUP(D30,invullijst!A$11:D$226,4,FALSE))","v":"65+"},503,{"$f":"IF(VLOOKUP($D30,invullijst!$A$11:$M$185,2,FALSE)=\"\",\"\",VLOOKUP($D30,invullijst!$A$11:$M$185,2,FALSE))","v":"Kees Vos"},null,{"$f":"IF(VLOOKUP($D30,invullijst!$A$11:$M$185,6,FALSE)=0,\"\",VLOOKUP($D30,invullijst!$A$11:$M$185,6,FALSE))","v":81},null,1,{"$f":"IF($O$3=\"k\",IF(VLOOKUP($L30,invullijst!$A$11:$M$185,11,FALSE)=0,\" \",VLOOKUP($L30,invullijst!$A$11:$M$185,11,FALSE)),\"\")","v":""},{"$f":"IF(VLOOKUP($L30,invullijst!$A$11:$M$226,4,FALSE)=\"\",\"\",VLOOKUP($L30,invullijst!$A$11:$M$226,4,FALSE))","v":"65+"},301,{"$f":"IF(VLOOKUP($L30,invullijst!$A$11:$M$185,2,FALSE)=\"\",\"\",VLOOKUP($L30,invullijst!$A$11:$M$185,2,FALSE))","v":"Arjen van Assem disp"},null,{"$f":"IF(VLOOKUP($L30,invullijst!$A$11:$M$185,6,FALSE)=0,\"\",VLOOKUP($L30,invullijst!$A$11:$M$185,6,FALSE))","v":89}]
[2,{"$f":"IF($G$3=\"k\",IF(VLOOKUP($D31,invullijst!$A$11:$M$185,11,FALSE)=0,\" \",VLOOKUP($D31,invullijst!$A$11:$M$185,11,FALSE)),\"\")","v":""},{"$f":"IF(VLOOKUP(D31,invullijst!A$11:F$226,4,FALSE)=\"\",\"\",VLOOKUP(D31,invullijst!A$11:D$226,4,FALSE))","v":"65+"},518,{"$f":"IF(VLOOKUP($D31,invullijst!$A$11:$M$185,2,FALSE)=\"\",\"\",VLOOKUP($D31,invullijst!$A$11:$M$185,2,FALSE))","v":"Ton Stanz"},null,{"$f":"IF(VLOOKUP($D31,invullijst!$A$11:$M$185,6,FALSE)=0,\"\",VLOOKUP($D31,invullijst!$A$11:$M$185,6,FALSE))","v":83},null,2,{"$f":"IF($O$3=\"k\",IF(VLOOKUP($L31,invullijst!$A$11:$M$185,11,FALSE)=0,\" \",VLOOKUP($L31,invullijst!$A$11:$M$185,11,FALSE)),\"\")","v":""},{"$f":"IF(VLOOKUP($L31,invullijst!$A$11:$M$226,4,FALSE)=\"\",\"\",VLOOKUP($L31,invullijst!$A$11:$M$226,4,FALSE))","v":"65+"},309,{"$f":"IF(VLOOKUP($L31,invullijst!$A$11:$M$185,2,FALSE)=\"\",\"\",VLOOKUP($L31,invullijst!$A$11:$M$185,2,FALSE))","v":"René de Jong"},null,{"$f":"IF(VLOOKUP($L31,invullijst!$A$11:$M$185,6,FALSE)=0,\"\",VLOOKUP($L31,invullijst!$A$11:$M$185,6,FALSE))","v":87}]
[3,{"$f":"IF($G$3=\"k\",IF(VLOOKUP($D32,invullijst!$A$11:$M$185,11,FALSE)=0,\" \",VLOOKUP($D32,invullijst!$A$11:$M$185,11,FALSE)),\"\")","v":""},{"$f":"IF(VLOOKUP(D32,invullijst!A$11:F$226,4,FALSE)=\"\",\"\",VLOOKUP(D32,invullijst!A$11:D$226,4,FALSE))","v":0},null,{"$f":"IF(VLOOKUP($D32,invullijst!$A$11:$M$185,2,FALSE)=\"\",\"\",VLOOKUP($D32,invullijst!$A$11:$M$185,2,FALSE))","v":0},null,{"$f":"IF(VLOOKUP($D32,invullijst!$A$11:$M$185,6,FALSE)=0,\"\",VLOOKUP($D32,invullijst!$A$11:$M$185,6,FALSE))","v":""},null,3,{"$f":"IF($O$3=\"k\",IF(VLOOKUP($L32,invullijst!$A$11:$M$185,11,FALSE)=0,\" \",VLOOKUP($L32,invullijst!$A$11:$M$185,11,FALSE)),\"\")","v":""},{"$f":"IF(VLOOKUP($L32,invullijst!$A$11:$M$226,4,FALSE)=\"\",\"\",VLOOKUP($L32,invullijst!$A$11:$M$226,4,FALSE))","v":0},null,{"$f":"IF(VLOOKUP($L32,invullijst!$A$11:$M$185,2,FALSE)=\"\",\"\",VLOOKUP($L32,invullijst!$A$11:$M$185,2,FALSE))","v":0},null,{"$f":"IF(VLOOKUP($L32,invullijst!$A$11:$M$185,6,FALSE)=0,\"\",VLOOKUP($L32,invullijst!$A$11:$M$185,6,FALSE))","v":""}]
["Totaal korps opgelegd A2",{"$nulls":5},{"$f":"SUM(G30:G32)","v":164},null,"Totaal korps opgelegd A2",{"$nulls":5},{"$f":"SUM(O30:O32)","v":176}]
[]
[1,{"$f":"IF($G$3=\"k\",IF(VLOOKUP($D35,invullijst!$A$11:$M$185,11,FALSE)=0,\" \",VLOOKUP($D35,invullijst!$A$11:$M$185,11,FALSE)),\"\")","v":""},{"$f":"IF(VLOOKUP(D35,invullijst!A$11:F$226,4,FALSE)=\"\",\"\",VLOOKUP(D35,invullijst!A$11:D$226,4,FALSE))","v":0},null,{"$f":"IF(VLOOKUP($D35,invullijst!$A$11:$M$185,2,FALSE)=\"\",\"\",VLOOKUP($D35,invullijst!$A$11:$M$185,2,FALSE))","v":0},null,{"$f":"IF(VLOOKUP($D35,invullijst!$A$11:$M$185,6,FALSE)=0,\"\",VLOOKUP($D35,invullijst!$A$11:$M$185,6,FALSE))","v":""},null,1,{"$f":"IF($O$3=\"k\",IF(VLOOKUP($L35,invullijst!$A$11:$M$185,11,FALSE)=0,\" \",VLOOKUP($L35,invullijst!$A$11:$M$185,11,FALSE)),\"\")","v":""},{"$f":"IF(VLOOKUP($L35,invullijst!$A$11:$M$226,4,FALSE)=\"\",\"\",VLOOKUP($L35,invullijst!$A$11:$M$226,4,FALSE))","v":0},null,{"$f":"IF(VLOOKUP($L35,invullijst!$A$11:$M$185,2,FALSE)=\"\",\"\",VLOOKUP($L35,invullijst!$A$11:$M$185,2,FALSE))","v":0},null,{"$f":"IF(VLOOKUP($L35,invullijst!$A$11:$M$185,6,FALSE)=0,\"\",VLOOKUP($L35,invullijst!$A$11:$M$185,6,FALSE))","v":""}]
[2,{"$f":"IF($G$3=\"k\",IF(VLOOKUP($D36,invullijst!$A$11:$M$185,11,FALSE)=0,\" \",VLOOKUP($D36,invullijst!$A$11:$M$185,11,FALSE)),\"\")","v":""},{"$f":"IF(VLOOKUP(D36,invullijst!A$11:F$226,4,FALSE)=\"\",\"\",VLOOKUP(D36,invullijst!A$11:D$226,4,FALSE))","v":0},null,{"$f":"IF(VLOOKUP($D36,invullijst!$A$11:$M$185,2,FALSE)=\"\",\"\",VLOOKUP($D36,invullijst!$A$11:$M$185,2,FALSE))","v":0},null,{"$f":"IF(VLOOKUP($D36,invullijst!$A$11:$M$185,6,FALSE)=0,\"\",VLOOKUP($D36,invullijst!$A$11:$M$185,6,FALSE))","v":""},null,2,{"$f":"IF($O$3=\"k\",IF(VLOOKUP($L36,invullijst!$A$11:$M$185,11,FALSE)=0,\" \",VLOOKUP($L36,invullijst!$A$11:$M$185,11,FALSE)),\"\")","v":""},{"$f":"IF(VLOOKUP($L36,invullijst!$A$11:$M$226,4,FALSE)=\"\",\"\",VLOOKUP($L36,invullijst!$A$11:$M$226,4,FALSE))","v":0},null,{"$f":"IF(VLOOKUP($L36,invullijst!$A$11:$M$185,2,FALSE)=\"\",\"\",VLOOKUP($L36,invullijst!$A$11:$M$185,2,FALSE))","v":0},null,{"$f":"IF(VLOOKUP($L36,invullijst!$A$11:$M$185,6,FALSE)=0,\"\",VLOOKUP($L36,invullijst!$A$11:$M$185,6,FALSE))","v":""}]
[3,{"$f":"IF($G$3=\"k\",IF(VLOOKUP($D37,invullijst!$A$11:$M$185,11,FALSE)=0,\" \",VLOOKUP($D37,invullijst!$A$11:$M$185,11,FALSE)),\"\")","v":""},{"$f":"IF(VLOOKUP(D37,invullijst!A$11:F$226,4,FALSE)=\"\",\"\",VLOOKUP(D37,invullijst!A$11:D$226,4,FALSE))","v":0},null,{"$f":"IF(VLOOKUP($D37,invullijst!$A$11:$M$185,2,FALSE)=\"\",\"\",VLOOKUP($D37,invullijst!$A$11:$M$185,2,FALSE))","v":0},null,{"$f":"IF(VLOOKUP($D37,invullijst!$A$11:$M$185,6,FALSE)=0,\"\",VLOOKUP($D37,invullijst!$A$11:$M$185,6,FALSE))","v":""},null,3,{"$f":"IF($O$3=\"k\",IF(VLOOKUP($L37,invullijst!$A$11:$M$185,11,FALSE)=0,\" \",VLOOKUP($L37,invullijst!$A$11:$M$185,11,FALSE)),\"\")","v":""},{"$f":"IF(VLOOKUP($L37,invullijst!$A$11:$M$226,4,FALSE)=\"\",\"\",VLOOKUP($L37,invullijst!$A$11:$M$226,4,FALSE))","v":0},null,{"$f":"IF(VLOOKUP($L37,invullijst!$A$11:$M$185,2,FALSE)=\"\",\"\",VLOOKUP($L37,invullijst!$A$11:$M$185,2,FALSE))","v":0},null,{"$f":"IF(VLOOKUP($L37,invullijst!$A$11:$M$185,6,FALSE)=0,\"\",VLOOKUP($L37,invullijst!$A$11:$M$185,6,FALSE))","v":""}]
["Totaal korps opgelegd A3",{"$nulls":5},{"$f":"SUM(G35:G37)","v":0},null,"Totaal korps opgelegd A3",{"$nulls":5},{"$f":"IF(VLOOKUP($L38,invullijst!$A$11:$M$185,6,FALSE)=0,\"\",VLOOKUP($L38,invullijst!$A$11:$M$185,6,FALSE))","v":""}]

{"sheet":"wedstrijd 1B","index":6,"n_rows":38,"n_cols":15,"rows_kept":38,"merged":[[0,0,0,4],[0,5,0,7],[0,8,0,14],[1,0,1,11],[1,12,1,14],[2,1,2,5],[2,9,2,13],[4,0,4,14],[5,4,5,5],[5,12,5,13],[6,4,6,5],[6,12,6,13],[7,4,7,5],[7,12,7,13],[8,4,8,5],[8,12,8,13],[9,0,9,5],[9,8,9,13],[11,4,11,5],[11,12,11,13],[12,4,12,5],[12,12,12,13],[13,4,13,5],[13,12,13,13],[14,4,14,5],[14,12,14,13],[15,0,15,5],[15,8,15,13],[17,4,17,5],[17,12,17,13],[18,4,18,5],[18,12,18,13],[19,4,19,5],[19,12,19,13],[20,4,20,5],[20,12,20,13],[21,0,21,5],[21,8,21,13],[23,0,23,14],[24,4,24,5],[24,12,24,13],[25,4,25,5],[25,12,25,13],[26,4,26,5],[26,12,26,13],[27,0,27,5],[27,8,27,13],[29,4,29,5],[29,12,29,13],[30,4,30,5],[30,12,30,13],[31,4,31,5],[31,12,31,13],[32,0,32,5],[32,8,32,13],[34,4,34,5],[34,12,34,13],[35,4,35,5],[35,12,35,13],[36,4,36,5],[36,12,36,13],[37,0,37,5],[37,8,37,13]]}
[{"$f":"invullijst!F1","v":"Organistatie"},{"$nulls":4},{"$f":"invullijst!H2","v":"2024 - 2025"},null,null,{"$f":"invullijst!F3","v":"O.L.V. Schuts Elshout"}]
["Datum: ",{"$nulls":11},"2024-12-08"]
[2,{"$f":"IF(VLOOKUP(A3,invullijst!A1:F5,2,FALSE)=\"\",\"\",VLOOKUP(A3,invullijst!A1:F5,2,FALSE))","v":"St. Crispinus & Crispinianus Besoijen"},{"$nulls":6},4,{"$f":"IF(VLOOKUP(I3,invullijst!A1:C5,2,FALSE)=\"\",\"\",VLOOKUP(I3,invullijst!A1:C5,2,FALSE))","v":"Sint Ambrosius Haarsteeg"}]
[]
["vrijehand"]
[1,{"$f":"IF($G$3=\"k\",IF(VLOOKUP($D6,invullijst!$A$11:$M$185,11,FALSE)=0,\" \",VLOOKUP($D6,invullijst!$A$11:$M$185,11,FALSE)),\"\")","v":""},{"$f":"IF(VLOOKUP(D6,invullijst!A$11:F$226,4,FALSE)=\"\",\"\",VLOOKUP(D6,invullijst!A$11:D$226,4,FALSE))","v":"vr"},210,{"$f":"IF(VLOOKUP($D6,invullijst!$A$11:$M$185,2,FALSE)=\"\",\"\",VLOOKUP($D6,invullijst!$A$11:$M$185,2,FALSE))","v":"Sander Oome"},null,{"$f":"IF(VLOOKUP($D6,invullijst!$A$11:$M$185,6,FALSE)=0,\"\",VLOOKUP($D6,invullijst!$A$11:$M$185,6,FALSE))","v":91},null,1,{"$f":"IF($O$3=\"k\",IF(VLOOKUP($L6,invullijst!$A$11:$M$185,11,FALSE)=0,\" \",VLOOKUP($L6,invullijst!$A$11:$M$185,11,FALSE)),\"\")","v":""},{"$f":"IF(VLOOKUP($L6,invullijst!$A$11:$M$226,4,FALSE)=\"\",\"\",VLOOKUP($L6,invullijst!$A$11:$M$226,4,FALSE))","v":"vr"},408,{"$f":"IF(VLOOKUP($L6,invullijst!$A$11:$M$185,2,FALSE)=\"\",\"\",VLOOKUP($L6,invullijst!$A$11:$M$185,2,FALSE))","v":"Rudy van Falier"},null,{"$f":"IF(VLOOKUP($L6,invullijst!$A$11:$M$185,6,FALSE)=0,\"\",VLOOKUP($L6,invullijst!$A$11:$M$185,6,FALSE))","v":81}]
[2,{"$f":"IF($G$3=\"k\",IF(VLOOKUP($D7,invullijst!$A$11:$M$185,11,FALSE)=0,\" \",VLOOKUP($D7,invullijst!$A$11:$M$185,11,FALSE)),\"\")","v":""},{"$f":"IF(VLOOKUP(D7,invullijst!A$11:F$226,4,FALSE)=\"\",\"\",VLOOKUP(D7,invullijst!A$11:D$226,4,FALSE))","v":"vr"},216,{"$f":"IF(VLOOKUP($D7,invullijst!$A$11:$M$185,2,FALSE)=\"\",\"\",VLOOKUP($D7,invullijst!$A$11:$M$185,2,FALSE))","v":"Pieter Laghuwitz"},null,{"$f":"IF(VLOOKUP($D7,invullijst!$A$11:$M$185,6,FALSE)=0,\"\",VLOOKUP($D7,invullijst!$A$11:$M$185,6,FALSE))","v":87},null,2,{"$f":"IF($O$3=\"k\",IF(VLOOKUP($L7,invullijst!$A$11:$M$185,11,FALSE)=0,\" \",VLOOKUP($L7,invullijst!$A$11:$M$185,11,FALSE)),\"\")","v":""},{"$f":"IF(VLOOKUP($L7,invullijst!$A$11:$M$226,4,FALSE)=\"\",\"\",VLOOKUP($L7,invullijst!$A$11:$M$226,4,FALSE))","v":"vr"},410,{"$f":"IF(VLOOKUP($L7,invullijst!$A$11:$M$185,2,FALSE)=\"\",\"\",VLOOKUP($L7,invullijst!$A$11:$M$185,2,FALSE))","v":"Tonnie Koks"},null,{"$f":"IF(VLOOKUP($L7,invullijst!$A$11:$M$185,6,FALSE)=0,\"\",VLOOKUP($L7,invullijst!$A$11:$M$185,6,FALSE))","v":88}]
[3,{"$f":"IF($G$3=\"k\",IF(VLOOKUP($D8,invullijst!$A$11:$M$185,11,FALSE)=0,\" \",VLOOKUP($D8,invullijst!$A$11:$M$185,11,FALSE)),\"\")","v":""},{"$f":"IF(VLOOKUP(D8,invullijst!A$11:F$226,4,FALSE)=\"\",\"\",VLOOKUP(D8,invullijst!A$11:D$226,4,FALSE))","v":"vr"},206,{"$f":"IF(VLOOKUP($D8,invullijst!$A$11:$M$185,2,FALSE)=\"\",\"\",VLOOKUP($D8,invullijst!$A$11:$M$185,2,FALSE))","v":"Kees van Hulten"},null,{"$f":"IF(VLOOKUP($D8,invullijst!$A$11:$M$185,6,FALSE)=0,\"\",VLOOKUP($D8,invullijst!$A$11:$M$185,6,FALSE))","v":73},null,3,{"$f":"IF($O$3=\"k\",IF(VLOOKUP($L8,invullijst!$A$11:$M$185,11,FALSE)=0,\" \",VLOOKUP($L8,invullijst!$A$11:$M$185,11,FALSE)),\"\")","v":""},{"$f":"IF(VLOOKUP($L8,invullijst!$A$11:$M$226,4,FALSE)=\"\",\"\",VLOOKUP($L8,invullijst!$A$11:$M$226,4,FALSE))","v":"vr"},402,{"$f":"IF(VLOOKUP($L8,invullijst!$A$11:$M$185,2,FALSE)=\"\",\"\",VLOOKUP($L8,invullijst!$A$11:$M$185,2,FALSE))","v":"Daniëlle v/d Lee"},null,{"$f":"IF(VLOOKUP($L8,invullijst!$A$11:$M$185,6,FALSE)=0,\"\",VLOOKUP($L8,invullijst!$A$11:$M$185,6,FALSE))","v":84}]
[4,{"$f":"IF($G$3=\"k\",IF(VLOOKUP($D9,invullijst!$A$11:$M$185,11,FALSE)=0,\" \",VLOOKUP($D9,invullijst!$A$11:$M$185,11,FALSE)),\"\")","v":""},{"$f":"IF(VLOOKUP(D9,invullijst!A$11:F$226,4,FALSE)=\"\",\"\",VLOOKUP(D9,invullijst!A$11:D$226,4,FALSE))","v":"vr"},207,{"$f":"IF(VLOOKUP($D9,invullijst!$A$11:$M$185,2,FALSE)=\"\",\"\",VLOOKUP($D9,invullijst!$A$11:$M$185,2,FALSE))","v":"Max de Louw"},null,{"$f":"IF(VLOOKUP($D9,invullijst!$A$11:$M$185,6,FALSE)=0,\"\",VLOOKUP($D9,invullijst!$A$11:$M$185,6,FALSE))","v":89},null,4,{"$f":"IF($O$3=\"k\",IF(VLOOKUP($L9,invullijst!$A$11:$M$185,11,FALSE)=0,\" \",VLOOKUP($L9,invullijst!$A$11:$M$185,11,FALSE)),\"\")","v":""},{"$f":"IF(VLOOKUP($L9,invullijst!$A$11:$M$226,4,FALSE)=\"\",\"\",VLOOKUP($L9,invullijst!$A$11:$M$226,4,FALSE))","v":"vr"},411,{"$f":"IF(VLOOKUP($L9,invullijst!$A$11:$M$185,2,FALSE)=\"\",\"\",VLOOKUP($L9,invullijst!$A$11:$M$185,2,FALSE))","v":"Wilma v/d Lee"},null,{"$f":"IF(VLOOKUP($L9,invullijst!$A$11:$M$185,6,FALSE)=0,\"\",VLOOKUP($L9,invullijst!$A$11:$M$185,6,FALSE))","v":61}]
["Totaal A korps",{"$nulls":5},{"$f":"SUM(G6:G9)","v":340},null,"Totaal A korps",{"$nulls":5},{"$f":"SUM(O6:O9)","v":314}]
[]
[1,{"$f":"IF($G$3=\"k\",IF(VLOOKUP($D12,invullijst!$A$11:$M$185,11,FALSE)=0,\" \",VLOOKUP($D12,invullijst!$A$11:$M$185,11,FALSE)),\"\")","v":""},{"$f":"IF(VLOOKUP(D12,invullijst!A$11:F$226,4,FALSE)=\"\",\"\",VLOOKUP(D12,invullijst!A$11:D$226,4,FALSE))","v":"vr"},203,{"$f":"IF(VLOOKUP($D12,invullijst!$A$11:$M$185,2,FALSE)=\"\",\"\",VLOOKUP($D12,invullijst!$A$11:$M$185,2,FALSE))","v":"Frank van den Houdt"},null,{"$f":"IF(VLOOKUP($D12,invullijst!$A$11:$M$185,6,FALSE)=0,\"\",VLOOKUP($D12,invullijst!$A$11:$M$185,6,FALSE))","v":86},null,1,{"$f":"IF($O$3=\"k\",IF(VLOOKUP($L12,invullijst!$A$11:$M$185,11,FALSE)=0,\" \",VLOOKUP($L12,invullijst!$A$11:$M$185,11,FALSE)),\"\")","v":""},{"$f":"IF(VLOOKUP($L12,invullijst!$A$11:$M$226,4,FALSE)=\"\",\"\",VLOOKUP($L12,invullijst!$A$11:$M$226,4,FALSE))","v":0},null,{"$f":"IF(VLOOKUP($L12,invullijst!$A$11:$M$185,2,FALSE)=\"\",\"\",VLOOKUP($L12,invullijst!$A$11:$M$185,2,FALSE))","v":0},null,{"$f":"IF(VLOOKUP($L12,invullijst!$A$11:$M$185,6,FALSE)=0,\"\",VLOOKUP($L12,invullijst!$A$11:$M$185,6,FALSE))","v":""}]
[2,{"$f":"IF($G$3=\"k\",IF(VLOOKUP($D13,invullijst!$A$11:$M$185,11,FALSE)=0,\" \",VLOOKUP($D13,invullijst!$A$11:$M$185,11,FALSE)),\"\")","v":""},{"$f":"IF(VLOOKUP(D13,invullijst!A$11:F$226,4,FALSE)=\"\",\"\",VLOOKUP(D13,invullijst!A$11:D$226,4,FALSE))","v":"vr"},205,{"$f":"IF(VLOOKUP($D13,invullijst!$A$11:$M$185,2,FALSE)=\"\",\"\",VLOOKUP($D13,invullijst!$A$11:$M$185,2,FALSE))","v":"Jos v/d Snepscheut"},null,{"$f":"IF(VLOOKUP($D13,invullijst!$A$11:$M$185,6,FALSE)=0,\"\",VLOOKUP($D13,invullijst!$A$11:$M$185,6,FALSE))","v":75},null,2,{"$f":"IF($O$3=\"k\",IF(VLOOKUP($L13,invullijst!$A$11:$M$185,11,FALSE)=0,\" \",VLOOKUP($L13,invullijst!$A$11:$M$185,11,FALSE)),\"\")","v":""},{"$f":"IF(VLOOKUP($L13,invullijst!$A$11:$M$226,4,FALSE)=\"\",\"\",VLOOKUP($L13,invullijst!$A$11:$M$226,4,FALSE))","v":0},null,{"$f":"IF(VLOOKUP($L13,invullijst!$A$11:$M$185,2,FALSE)=\"\",\"\",VLOOKUP($L13,invullijst!$A$11:$M$185,2,FALSE))","v":0},null,{"$f":"IF(VLOOKUP($L13,invullijst!$A$11:$M$185,6,FALSE)=0,\"\",VLOOKUP($L13,invullijst!$A$11:$M$185,6,FALSE))","v":""}]
[3,{"$f":"IF($G$3=\"k\",IF(VLOOKUP($D14,invullijst!$A$11:$M$185,11,FALSE)=0,\" \",VLOOKUP($D14,invullijst!$A$11:$M$185,11,FALSE)),\"\")","v":""},{"$f":"IF(VLOOKUP(D14,invullijst!A$11:F$226,4,FALSE)=\"\",\"\",VLOOKUP(D14,invullijst!A$11:D$226,4,FALSE))","v":"vr"},204,{"$f":"IF(VLOOKUP($D14,invullijst!$A$11:$M$185,2,FALSE)=\"\",\"\",VLOOKUP($D14,invullijst!$A$11:$M$185,2,FALSE))","v":"Harry de Louw"},null,{"$f":"IF(VLOOKUP($D14,invullijst!$A$11:$M$185,6,FALSE)=0,\"\",VLOOKUP($D14,invullijst!$A$11:$M$185,6,FALSE))","v":80},null,3,{"$f":"IF($O$3=\"k\",IF(VLOOKUP($L14,invullijst!$A$11:$M$185,11,FALSE)=0,\" \",VLOOKUP($L14,invullijst!$A$11:$M$185,11,FALSE)),\"\")","v":""},{"$f":"IF(VLOOKUP($L14,invullijst!$A$11:$M$226,4,FALSE)=\"\",\"\",VLOOKUP($L14,invullijst!$A$11:$M$226,4,FALSE))","v":0},null,{"$f":"IF(VLOOKUP($L14,invullijst!$A$11:$M$185,2,FALSE)=\"\",\"\",VLOOKUP($L14,invullijst!$A$11:$M$185,2,FALSE))","v":0},null,{"$f":"IF(VLOOKUP($L14,invullijst!$A$11:$M$185,6,FALSE)=0,\"\",VLOOKUP($L14,invullijst!$A$11:$M$185,6,FALSE))","v":""}]
[4,{"$f":"IF($G$3=\"k\",IF(VLOOKUP($D15,invullijst!$A$11:$M$185,11,FALSE)=0,\" \",VLOOKUP($D15,invullijst!$A$11:$M$185,11,FALSE)),\"\")","v":""},{"$f":"IF(VLOOKUP(D15,invullijst!A$11:F$226,4,FALSE)=\"\",\"\",VLOOKUP(D15,invullijst!A$11:D$226,4,FALSE))","v":"vr"},209,{"$f":"IF(VLOOKUP($D15,invullijst!$A$11:$M$185,2,FALSE)=\"\",\"\",VLOOKUP($D15,invullijst!$A$11:$M$185,2,FALSE))","v":"René van Kuijk"},null,{"$f":"IF(VLOOKUP($D15,invullijst!$A$11:$M$185,6,FALSE)=0,\"\",VLOOKUP($D15,invullijst!$A$11:$M$185,6,FALSE))","v":81},null,4,{"$f":"IF($O$3=\"k\",IF(VLOOKUP($L15,invullijst!$A$11:$M$185,11,FALSE)=0,\" \",VLOOKUP($L15,invullijst!$A$11:$M$185,11,FALSE)),\"\")","v":""},{"$f":"IF(VLOOKUP($L15,invullijst!$A$11:$M$226,4,FALSE)=\"\",\"\",VLOOKUP($L15,invullijst!$A$11:$M$226,4,FALSE))","v":0},null,{"$f":"IF(VLOOKUP($L15,invullijst!$A$11:$M$185,2,FALSE)=\"\",\"\",VLOOKUP($L15,invullijst!$A$11:$M$185,2,FALSE))","v":0},null,{"$f":"IF(VLOOKUP($L15,invullijst!$A$11:$M$185,6,FALSE)=0,\"\",VLOOKUP($L15,invullijst!$A$11:$M$185,6,FALSE))","v":""}]
["Totaal B1 korps",{"$nulls":5},{"$f":"SUM(G12:G15)","v":322},null,"Totaal B1 korps",{"$nulls":5},{"$f":"SUM(O12:O15)","v":0}]
[]
[1,{"$f":"IF($G$3=\"k\",IF(VLOOKUP($D18,invullijst!$A$11:$M$185,11,FALSE)=0,\" \",VLOOKUP($D18,invullijst!$A$11:$M$185,11,FALSE)),\"\")","v":""},{"$f":"IF(VLOOKUP(D18,invullijst!A$11:F$226,4,FALSE)=\"\",\"\",VLOOKUP(D18,invullijst!A$11:D$226,4,FALSE))","v":"vr"},208,{"$f":"IF(VLOOKUP($D18,invullijst!$A$11:$M$185,2,FALSE)=\"\",\"\",VLOOKUP($D18,invullijst!$A$11:$M$185,2,FALSE))","v":"Erin van Hulten"},null,{"$f":"IF(VLOOKUP($D18,invullijst!$A$11:$M$185,6,FALSE)=0,\"\",VLOOKUP($D18,invullijst!$A$11:$M$185,6,FALSE))","v":77},null,1,{"$f":"IF($O$3=\"k\",IF(VLOOKUP($L18,invullijst!$A$11:$M$185,11,FALSE)=0,\" \",VLOOKUP($L18,invullijst!$A$11:$M$185,11,FALSE)),\"\")","v":""},{"$f":"IF(VLOOKUP($L18,invullijst!$A$11:$M$226,4,FALSE)=\"\",\"\",VLOOKUP($L18,invullijst!$A$11:$M$226,4,FALSE))","v":0},null,{"$f":"IF(VLOOKUP($L18,invullijst!$A$11:$M$185,2,FALSE)=\"\",\"\",VLOOKUP($L18,invullijst!$A$11:$M$185,2,FALSE))","v":0},null,{"$f":"IF(VLOOKUP($L18,invullijst!$A$11:$M$185,6,FALSE)=0,\"\",VLOOKUP($L18,invullijst!$A$11:$M$185,6,FALSE))","v":""}]
[2,{"$f":"IF($G$3=\"k\",IF(VLOOKUP($D19,invullijst!$A$11:$M$185,11,FALSE)=0,\" \",VLOOKUP($D19,invullijst!$A$11:$M$185,11,FALSE)),\"\")","v":""},{"$f":"IF(VLOOKUP(D19,invullijst!A$11:F$226,4,FALSE)=\"\",\"\",VLOOKUP(D19,invullijst!A$11:D$226,4,FALSE))","v":"vr"},213,{"$f":"IF(VLOOKUP($D19,invullijst!$A$11:$M$185,2,FALSE)=\"\",\"\",VLOOKUP($D19,invullijst!$A$11:$M$185,2,FALSE))","v":"Roland van Delft"},null,{"$f":"IF(VLOOKUP($D19,invullijst!$A$11:$M$185,6,FALSE)=0,\"\",VLOOKUP($D19,invullijst!$A$11:$M$185,6,FALSE))","v":74},null,2,{"$f":"IF($O$3=\"k\",IF(VLOOKUP($L19,invullijst!$A$11:$M$185,11,FALSE)=0,\" \",VLOOKUP($L19,invullijst!$A$11:$M$185,11,FALSE)),\"\")","v":""},{"$f":"IF(VLOOKUP($L19,invullijst!$A$11:$M$226,4,FALSE)=\"\",\"\",VLOOKUP($L19,invullijst!$A$11:$M$226,4,FALSE))","v":0},null,{"$f":"IF(VLOOKUP($L19,invullijst!$A$11:$M$185,2,FALSE)=\"\",\"\",VLOOKUP($L19,invullijst!$A$11:$M$185,2,FALSE))","v":0},null,{"$f":"IF(VLOOKUP($L19,invullijst!$A$11:$M$185,6,FALSE)=0,\"\",VLOOKUP($L19,invullijst!$A$11:$M$185,6,FALSE))","v":""}]
[3,{"$f":"IF($G$3=\"k\",IF(VLOOKUP($D20,invullijst!$A$11:$M$185,11,FALSE)=0,\" \",VLOOKUP($D20,invullijst!$A$11:$M$185,11,FALSE)),\"\")","v":""},{"$f":"IF(VLOOKUP(D20,invullijst!A$11:F$226,4,FALSE)=\"\",\"\",VLOOKUP(D20,invullijst!A$11:D$226,4,FALSE))","v":"vr"},217,{"$f":"IF(VLOOKUP($D20,invullijst!$A$11:$M$185,2,FALSE)=\"\",\"\",VLOOKUP($D20,invullijst!$A$11:$M$185,2,FALSE))","v":"Hans Laghuwitz"},null,{"$f":"IF(VLOOKUP($D20,invullijst!$A$11:$M$185,6,FALSE)=0,\"\",VLOOKUP($D20,invullijst!$A$11:$M$185,6,FALSE))","v":76},null,3,{"$f":"IF($O$3=\"k\",IF(VLOOKUP($L20,invullijst!$A$11:$M$185,11,FALSE)=0,\" \",VLOOKUP($L20,invullijst!$A$11:$M$185,11,FALSE)),\"\")","v":""},{"$f":"IF(VLOOKUP($L20,invullijst!$A$11:$M$226,4,FALSE)=\"\",\"\",VLOOKUP($L20,invullijst!$A$11:$M$226,4,FALSE))","v":0},null,{"$f":"IF(VLOOKUP($L20,invullijst!$A$11:$M$185,2,FALSE)=\"\",\"\",VLOOKUP($L20,invullijst!$A$11:$M$185,2,FALSE))","v":0},null,{"$f":"IF(VLOOKUP($L20,invullijst!$A$11:$M$185,6,FALSE)=0,\"\",VLOOKUP($L20,invullijst!$A$11:$M$185,6,FALSE))","v":""}]
[4,{"$f":"IF($G$3=\"k\",IF(VLOOKUP($D21,invullijst!$A$11:$M$185,11,FALSE)=0,\" \",VLOOKUP($D21,invullijst!$A$11:$M$185,11,FALSE)),\"\")","v":""},{"$f":"IF(VLOOKUP(D21,invullijst!A$11:F$226,4,FALSE)=\"\",\"\",VLOOKUP(D21,invullijst!A$11:D$226,4,FALSE))","v":"vr"},202,{"$f":"IF(VLOOKUP($D21,invullijst!$A$11:$M$185,2,FALSE)=\"\",\"\",VLOOKUP($D21,invullijst!$A$11:$M$185,2,FALSE))","v":"Arco van Kuijk"},null,{"$f":"IF(VLOOKUP($D21,invullijst!$A$11:$M$185,6,FALSE)=0,\"\",VLOOKUP($D21,invullijst!$A$11:$M$185,6,FALSE))","v":73},null,4,{"$f":"IF($O$3=\"k\",IF(VLOOKUP($L21,invullijst!$A$11:$M$185,11,FALSE)=0,\" \",VLOOKUP($L21,invullijst!$A$11:$M$185,11,FALSE)),\"\")","v":""},{"$f":"IF(VLOOKUP($L21,invullijst!$A$11:$M$226,4,FALSE)=\"\",\"\",VLOOKUP($L21,invullijst!$A$11:$M$226,4,FALSE))","v":0},null,{"$f":"IF(VLOOKUP($L21,invullijst!$A$11:$M$185,2,FALSE)=\"\",\"\",VLOOKUP($L21,invullijst!$A$11:$M$185,2,FALSE))","v":0},null,{"$f":"IF(VLOOKUP($L21,invullijst!$A$11:$M$185,6,FALSE)=0,\"\",VLOOKUP($L21,invullijst!$A$11:$M$185,6,FALSE))","v":""}]
["DIVERSEN / INHAAL",{"$nulls":5},{"$f":"SUM(G18:G21)","v":300},null,"DIVERSEN / INHAAL"]
[]
["OPGELEGD (Jeugd <16 en 65+)"]
[1,{"$f":"IF($G$3=\"k\",IF(VLOOKUP($D25,invullijst!$A$11:$M$185,11,FALSE)=0,\" \",VLOOKUP($D25,invullijst!$A$11:$M$185,11,FALSE)),\"\")","v":""},{"$f":"IF(VLOOKUP(D25,invullijst!A$11:F$226,4,FALSE)=\"\",\"\",VLOOKUP(D25,invullijst!A$11:D$226,4,FALSE))","v":"65+"},218,{"$f":"IF(VLOOKUP($D25,invullijst!$A$11:$M$185,2,FALSE)=\"\",\"\",VLOOKUP($D25,invullijst!$A$11:$M$185,2,FALSE))","v":"Jacob van de Werken"},null,{"$f":"IF(VLOOKUP($D25,invullijst!$A$11:$M$185,6,FALSE)=0,\"\",VLOOKUP($D25,invullijst!$A$11:$M$185,6,FALSE))","v":97},null,1,{"$f":"IF($O$3=\"k\",IF(VLOOKUP($L25,invullijst!$A$11:$M$185,11,FALSE)=0,\" \",VLOOKUP($L25,invullijst!$A$11:$M$185,11,FALSE)),\"\")","v":""},{"$f":"IF(VLOOKUP($L25,invullijst!$A$11:$M$226,4,FALSE)=\"\",\"\",VLOOKUP($L25,invullijst!$A$11:$M$226,4,FALSE))","v":"65+"},405,{"$f":"IF(VLOOKUP($L25,invullijst!$A$11:$M$185,2,FALSE)=\"\",\"\",VLOOKUP($L25,invullijst!$A$11:$M$185,2,FALSE))","v":"Jan de Vaan"},null,{"$f":"IF(VLOOKUP($L25,invullijst!$A$11:$M$185,6,FALSE)=0,\"\",VLOOKUP($L25,invullijst!$A$11:$M$185,6,FALSE))","v":98}]
[2,{"$f":"IF($G$3=\"k\",IF(VLOOKUP($D26,invullijst!$A$11:$M$185,11,FALSE)=0,\" \",VLOOKUP($D26,invullijst!$A$11:$M$185,11,FALSE)),\"\")","v":""},{"$f":"IF(VLOOKUP(D26,invullijst!A$11:F$226,4,FALSE)=\"\",\"\",VLOOKUP(D26,invullijst!A$11:D$226,4,FALSE))","v":"65+"},211,{"$f":"IF(VLOOKUP($D26,invullijst!$A$11:$M$185,2,FALSE)=\"\",\"\",VLOOKUP($D26,invullijst!$A$11:$M$185,2,FALSE))","v":"Ad van den houdt"},null,{"$f":"IF(VLOOKUP($D26,invullijst!$A$11:$M$185,6,FALSE)=0,\"\",VLOOKUP($D26,invullijst!$A$11:$M$185,6,FALSE))","v":92},null,2,{"$f":"IF($O$3=\"k\",IF(VLOOKUP($L26,invullijst!$A$11:$M$185,11,FALSE)=0,\" \",VLOOKUP($L26,invullijst!$A$11:$M$185,11,FALSE)),\"\")","v":""},{"$f":"IF(VLOOKUP($L26,invullijst!$A$11:$M$226,4,FALSE)=\"\",\"\",VLOOKUP($L26,invullijst!$A$11:$M$226,4,FALSE))","v":"65+"},401,{"$f":"IF(VLOOKUP($L26,invullijst!$A$11:$M$185,2,FALSE)=\"\",\"\",VLOOKUP($L26,invullijst!$A$11:$M$185,2,FALSE))","v":"Frans van Beurden"},null,{"$f":"IF(VLOOKUP($L26,invullijst!$A$11:$M$185,6,FALSE)=0,\"\",VLOOKUP($L26,invullijst!$A$11:$M$185,6,FALSE))","v":95}]
[3,{"$f":"IF($G$3=\"k\",IF(VLOOKUP($D27,invullijst!$A$11:$M$185,11,FALSE)=0,\" \",VLOOKUP($D27,invullijst!$A$11:$M$185,11,FALSE)),\"\")","v":""},{"$f":"IF(VLOOKUP(D27,invullijst!A$11:F$226,4,FALSE)=\"\",\"\",VLOOKUP(D27,invullijst!A$11:D$226,4,FALSE))","v":"65+"},219,{"$f":"IF(VLOOKUP($D27,invullijst!$A$11:$M$185,2,FALSE)=\"\",\"\",VLOOKUP($D27,invullijst!$A$11:$M$185,2,FALSE))","v":"Frans de Bont"},null,{"$f":"IF(VLOOKUP($D27,invullijst!$A$11:$M$185,6,FALSE)=0,\"\",VLOOKUP($D27,invullijst!$A$11:$M$185,6,FALSE))","v":95},null,3,{"$f":"IF($O$3=\"k\",IF(VLOOKUP($L27,invullijst!$A$11:$M$185,11,FALSE)=0,\" \",VLOOKUP($L27,invullijst!$A$11:$M$185,11,FALSE)),\"\")","v":""},{"$f":"IF(VLOOKUP($L27,invullijst!$A$11:$M$226,4,FALSE)=\"\",\"\",VLOOKUP($L27,invullijst!$A$11:$M$226,4,FALSE))","v":"65+"},413,{"$f":"IF(VLOOKUP($L27,invullijst!$A$11:$M$185,2,FALSE)=\"\",\"\",VLOOKUP($L27,invullijst!$A$11:$M$185,2,FALSE))","v":"Frans Mommersteeg"},null,{"$f":"IF(VLOOKUP($L27,invullijst!$A$11:$M$185,6,FALSE)=0,\"\",VLOOKUP($L27,invullijst!$A$11:$M$185,6,FALSE))","v":95}]
["Totaal korps opgelegd A1",{"$nulls":5},{"$f":"SUM(G25:G27)","v":284},null,"Totaal korps opgelegd A1",{"$nulls":5},{"$f":"SUM(O25:O27)","v":288}]
[]
[1,{"$f":"IF($G$3=\"k\",IF(VLOOKUP($D30,invullijst!$A$11:$M$185,11,FALSE)=0,\" \",VLOOKUP($D30,invullijst!$A$11:$M$185,11,FALSE)),\"\")","v":""},{"$f":"IF(VLOOKUP(D30,invullijst!A$11:F$226,4,FALSE)=\"\",\"\",VLOOKUP(D30,invullijst!A$11:D$226,4,FALSE))","v":"65+"},214,{"$f":"IF(VLOOKUP($D30,invullijst!$A$11:$M$185,2,FALSE)=\"\",\"\",VLOOKUP($D30,invullijst!$A$11:$M$185,2,FALSE))","v":"Andre de Vaan"},null,{"$f":"IF(VLOOKUP($D30,invullijst!$A$11:$M$185,6,FALSE)=0,\"\",VLOOKUP($D30,invullijst!$A$11:$M$185,6,FALSE))","v":87},null,1,{"$f":"IF($O$3=\"k\",IF(VLOOKUP($L30,invullijst!$A$11:$M$185,11,FALSE)=0,\" \",VLOOKUP($L30,invullijst!$A$11:$M$185,11,FALSE)),\"\")","v":""},{"$f":"IF(VLOOKUP($L30,invullijst!$A$11:$M$226,4,FALSE)=\"\",\"\",VLOOKUP($L30,invullijst!$A$11:$M$226,4,FALSE))","v":"65+"},404,{"$f":"IF(VLOOKUP($L30,invullijst!$A$11:$M$185,2,FALSE)=\"\",\"\",VLOOKUP($L30,invullijst!$A$11:$M$185,2,FALSE))","v":"Gerard van Beurden"},null,{"$f":"IF(VLOOKUP($L30,invullijst!$A$11:$M$185,6,FALSE)=0,\"\",VLOOKUP($L30,invullijst!$A$11:$M$185,6,FALSE))","v":94}]
[2,{"$f":"IF($G$3=\"k\",IF(VLOOKUP($D31,invullijst!$A$11:$M$185,11,FALSE)=0,\" \",VLOOKUP($D31,invullijst!$A$11:$M$185,11,FALSE)),\"\")","v":""},{"$f":"IF(VLOOKUP(D31,invullijst!A$11:F$226,4,FALSE)=\"\",\"\",VLOOKUP(D31,invullijst!A$11:D$226,4,FALSE))","v":"65+"},220,{"$f":"IF(VLOOKUP($D31,invullijst!$A$11:$M$185,2,FALSE)=\"\",\"\",VLOOKUP($D31,invullijst!$A$11:$M$185,2,FALSE))","v":"Kees Vos"},null,{"$f":"IF(VLOOKUP($D31,invullijst!$A$11:$M$185,6,FALSE)=0,\"\",VLOOKUP($D31,invullijst!$A$11:$M$185,6,FALSE))","v":90},null,2,{"$f":"IF($O$3=\"k\",IF(VLOOKUP($L31,invullijst!$A$11:$M$185,11,FALSE)=0,\" \",VLOOKUP($L31,invullijst!$A$11:$M$185,11,FALSE)),\"\")","v":""},{"$f":"IF(VLOOKUP($L31,invullijst!$A$11:$M$226,4,FALSE)=\"\",\"\",VLOOKUP($L31,invullijst!$A$11:$M$226,4,FALSE))","v":"65+"},412,{"$f":"IF(VLOOKUP($L31,invullijst!$A$11:$M$185,2,FALSE)=\"\",\"\",VLOOKUP($L31,invullijst!$A$11:$M$185,2,FALSE))","v":"Francien v/d Wiel"},null,{"$f":"IF(VLOOKUP($L31,invullijst!$A$11:$M$185,6,FALSE)=0,\"\",VLOOKUP($L31,invullijst!$A$11:$M$185,6,FALSE))","v":93}]
[3,{"$f":"IF($G$3=\"k\",IF(VLOOKUP($D32,invullijst!$A$11:$M$185,11,FALSE)=0,\" \",VLOOKUP($D32,invullijst!$A$11:$M$185,11,FALSE)),\"\")","v":""},{"$f":"IF(VLOOKUP(D32,invullijst!A$11:F$226,4,FALSE)=\"\",\"\",VLOOKUP(D32,invullijst!A$11:D$226,4,FALSE))","v":"65+"},212,{"$f":"IF(VLOOKUP($D32,invullijst!$A$11:$M$185,2,FALSE)=\"\",\"\",VLOOKUP($D32,invullijst!$A$11:$M$185,2,FALSE))","v":"René Duquesnoy"},null,{"$f":"IF(VLOOKUP($D32,invullijst!$A$11:$M$185,6,FALSE)=0,\"\",VLOOKUP($D32,invullijst!$A$11:$M$185,6,FALSE))","v":87},null,3,{"$f":"IF($O$3=\"k\",IF(VLOOKUP($L32,invullijst!$A$11:$M$185,11,FALSE)=0,\" \",VLOOKUP($L32,invullijst!$A$11:$M$185,11,FALSE)),\"\")","v":""},{"$f":"IF(VLOOKUP($L32,invullijst!$A$11:$M$226,4,FALSE)=\"\",\"\",VLOOKUP($L32,invullijst!$A$11:$M$226,4,FALSE))","v":"65+"},415,{"$f":"IF(VLOOKUP($L32,invullijst!$A$11:$M$185,2,FALSE)=\"\",\"\",VLOOKUP($L32,invullijst!$A$11:$M$185,2,FALSE))","v":"Wim de Gouw"},null,{"$f":"IF(VLOOKUP($L32,invullijst!$A$11:$M$185,6,FALSE)=0,\"\",VLOOKUP($L32,invullijst!$A$11:$M$185,6,FALSE))","v":96}]
["Totaal korps opgelegd A2",{"$nulls":5},{"$f":"SUM(G30:G32)","v":264},null,"Totaal korps opgelegd A2",{"$nulls":5},{"$f":"SUM(O30:O32)","v":283}]
[]
[1,{"$f":"IF($G$3=\"k\",IF(VLOOKUP($D35,invullijst!$A$11:$M$185,11,FALSE)=0,\" \",VLOOKUP($D35,invullijst!$A$11:$M$185,11,FALSE)),\"\")","v":""},{"$f":"IF(VLOOKUP(D35,invullijst!A$11:F$226,4,FALSE)=\"\",\"\",VLOOKUP(D35,invullijst!A$11:D$226,4,FALSE))","v":"J"},221,{"$f":"IF(VLOOKUP($D35,invullijst!$A$11:$M$185,2,FALSE)=\"\",\"\",VLOOKUP($D35,invullijst!$A$11:$M$185,2,FALSE))","v":"Mees Huijben"},null,{"$f":"IF(VLOOKUP($D35,invullijst!$A$11:$M$185,6,FALSE)=0,\"\",VLOOKUP($D35,invullijst!$A$11:$M$185,6,FALSE))","v":63},null,1,{"$f":"IF($O$3=\"k\",IF(VLOOKUP($L35,invullijst!$A$11:$M$185,11,FALSE)=0,\" \",VLOOKUP($L35,invullijst!$A$11:$M$185,11,FALSE)),\"\")","v":""},{"$f":"IF(VLOOKUP($L35,invullijst!$A$11:$M$226,4,FALSE)=\"\",\"\",VLOOKUP($L35,invullijst!$A$11:$M$226,4,FALSE))","v":"65+"},403,{"$f":"IF(VLOOKUP($L35,invullijst!$A$11:$M$185,2,FALSE)=\"\",\"\",VLOOKUP($L35,invullijst!$A$11:$M$185,2,FALSE))","v":"Dorien de Kort"},null,{"$f":"IF(VLOOKUP($L35,invullijst!$A$11:$M$185,6,FALSE)=0,\"\",VLOOKUP($L35,invullijst!$A$11:$M$185,6,FALSE))","v":88}]
[2,{"$f":"IF($G$3=\"k\",IF(VLOOKUP($D36,invullijst!$A$11:$M$185,11,FALSE)=0,\" \",VLOOKUP($D36,invullijst!$A$11:$M$185,11,FALSE)),\"\")","v":""},{"$f":"IF(VLOOKUP(D36,invullijst!A$11:F$226,4,FALSE)=\"\",\"\",VLOOKUP(D36,invullijst!A$11:D$226,4,FALSE))","v":"vr"},222,{"$f":"IF(VLOOKUP($D36,invullijst!$A$11:$M$185,2,FALSE)=\"\",\"\",VLOOKUP($D36,invullijst!$A$11:$M$185,2,FALSE))","v":"Nick de Vaan"},null,{"$f":"IF(VLOOKUP($D36,invullijst!$A$11:$M$185,6,FALSE)=0,\"\",VLOOKUP($D36,invullijst!$A$11:$M$185,6,FALSE))","v":72},null,2,{"$f":"IF($O$3=\"k\",IF(VLOOKUP($L36,invullijst!$A$11:$M$185,11,FALSE)=0,\" \",VLOOKUP($L36,invullijst!$A$11:$M$185,11,FALSE)),\"\")","v":""},{"$f":"IF(VLOOKUP($L36,invullijst!$A$11:$M$226,4,FALSE)=\"\",\"\",VLOOKUP($L36,invullijst!$A$11:$M$226,4,FALSE))","v":0},null,{"$f":"IF(VLOOKUP($L36,invullijst!$A$11:$M$185,2,FALSE)=\"\",\"\",VLOOKUP($L36,invullijst!$A$11:$M$185,2,FALSE))","v":0},null,{"$f":"IF(VLOOKUP($L36,invullijst!$A$11:$M$185,6,FALSE)=0,\"\",VLOOKUP($L36,invullijst!$A$11:$M$185,6,FALSE))","v":""}]
[3,{"$f":"IF($G$3=\"k\",IF(VLOOKUP($D37,invullijst!$A$11:$M$185,11,FALSE)=0,\" \",VLOOKUP($D37,invullijst!$A$11:$M$185,11,FALSE)),\"\")","v":""},{"$f":"IF(VLOOKUP(D37,invullijst!A$11:F$226,4,FALSE)=\"\",\"\",VLOOKUP(D37,invullijst!A$11:D$226,4,FALSE))","v":"vr"},223,{"$f":"IF(VLOOKUP($D37,invullijst!$A$11:$M$185,2,FALSE)=\"\",\"\",VLOOKUP($D37,invullijst!$A$11:$M$185,2,FALSE))","v":"Jänis Jakobsons"},null,{"$f":"IF(VLOOKUP($D37,invullijst!$A$11:$M$185,6,FALSE)=0,\"\",VLOOKUP($D37,invullijst!$A$11:$M$185,6,FALSE))","v":77},null,3,{"$f":"IF($O$3=\"k\",IF(VLOOKUP($L37,invullijst!$A$11:$M$185,11,FALSE)=0,\" \",VLOOKUP($L37,invullijst!$A$11:$M$185,11,FALSE)),\"\")","v":""},{"$f":"IF(VLOOKUP($L37,invullijst!$A$11:$M$226,4,FALSE)=\"\",\"\",VLOOKUP($L37,invullijst!$A$11:$M$226,4,FALSE))","v":0},null,{"$f":"IF(VLOOKUP($L37,invullijst!$A$11:$M$185,2,FALSE)=\"\",\"\",VLOOKUP($L37,invullijst!$A$11:$M$185,2,FALSE))","v":0},null,{"$f":"IF(VLOOKUP($L37,invullijst!$A$11:$M$185,6,FALSE)=0,\"\",VLOOKUP($L37,invullijst!$A$11:$M$185,6,FALSE))","v":""}]
["Diversen",{"$nulls":7},"Totaal korps opgelegd A3",{"$nulls":5},{"$f":"SUM(O35:O37)","v":88}]

{"sheet":"wedstrijd 2A","index":7,"n_rows":38,"n_cols":15,"rows_kept":38,"merged":[[0,0,0,4],[0,5,0,7],[0,8,0,14],[1,0,1,11],[1,12,1,14],[2,1,2,5],[2,9,2,13],[4,0,4,14],[5,4,5,5],[5,12,5,13],[6,4,6,5],[6,12,6,13],[7,4,7,5],[7,12,7,13],[8,4,8,5],[8,12,8,13],[9,0,9,5],[9,8,9,13],[11,4,11,5],[11,12,11,13],[12,4,12,5],[12,12,12,13],[13,4,13,5],[13,12,13,13],[14,4,14,5],[14,12,14,13],[15,0,15,5],[15,8,15,13],[17,4,17,5],[17,12,17,13],[18,4,18,5],[18,12,18,13],[19,4,19,5],[19,12,19,13],[20,4,20,5],[20,12,20,13],[21,0,21,5],[21,8,21,13],[23,0,23,14],[24,4,24,5],[24,12,24,13],[25,4,25,5],[25,12,25,13],[26,4,26,5],[26,12,26,13],[27,0,27,5],[27,8,27,13],[29,4,29,5],[29,12,29,13],[30,4,30,5],[30,12,30,13],[31,4,31,5],[31,12,31,13],[32,0,32,5],[32,8,32,13],[34,4,34,5],[34,12,34,13],[35,4,35,5],[35,12,35,13],[36,4,36,5],[36,12,36,13],[37,0,37,5],[37,8,37,13]]}
[{"$f":"invullijst!F1","v":"Organistatie"},{"$nulls":4},{"$f":"invullijst!H2","v":"2024 - 2025"},null,null,{"$f":"invullijst!F3","v":"O.L.V. Schuts Elshout"}]
["Datum: ",{"$nulls":11},"2025-01-19"]
[1,{"$f":"IF(VLOOKUP(A3,invullijst!A1:F5,2,FALSE)=\"\",\"\",VLOOKUP(A3,invullijst!A1:F5,2,FALSE))","v":"Sint Ambrosius Baardwijk"},{"$nulls":6},3,{"$f":"IF(VLOOKUP(I3,invullijst!A1:C5,2,FALSE)=\"\",\"\",VLOOKUP(I3,invullijst!A1:C5,2,FALSE))","v":"O.L.V. Schuts Elshout"}]
[]
["vrijehand"]
[1,{"$f":"IF($G$3=\"k\",IF(VLOOKUP($D6,invullijst!$A$11:$M$185,11,FALSE)=0,\" \",VLOOKUP($D6,invullijst!$A$11:$M$185,11,FALSE)),\"\")","v":""},{"$f":"IF(VLOOKUP(D6,invullijst!A$11:F$226,4,FALSE)=\"\",\"\",VLOOKUP(D6,invullijst!A$11:D$226,4,FALSE))","v":"vr"},105,{"$f":"IF(VLOOKUP($D6,invullijst!$A$11:$M$185,2,FALSE)=\"\",\"\",VLOOKUP($D6,invullijst!$A$11:$M$185,2,FALSE))","v":"René Klijn"},null,{"$f":"IF(VLOOKUP($D6,invullijst!$A$11:$M$185,7,FALSE)=0,\"\",VLOOKUP($D6,invullijst!$A$11:$M$185,7,FALSE))","v":85},null,1,{"$f":"IF($O$3=\"k\",IF(VLOOKUP($L6,invullijst!$A$11:$M$185,11,FALSE)=0,\" \",VLOOKUP($L6,invullijst!$A$11:$M$185,11,FALSE)),\"\")","v":""},{"$f":"IF(VLOOKUP($L6,invullijst!$A$11:$M$226,4,FALSE)=\"\",\"\",VLOOKUP($L6,invullijst!$A$11:$M$226,4,FALSE))","v":"vr"},302,{"$f":"IF(VLOOKUP($L6,invullijst!$A$11:$M$185,2,FALSE)=\"\",\"\",VLOOKUP($L6,invullijst!$A$11:$M$185,2,FALSE))","v":"Freek de Jong"},null,{"$f":"IF(VLOOKUP($L6,invullijst!$A$11:$M$185,7,FALSE)=0,\"\",VLOOKUP($L6,invullijst!$A$11:$M$185,7,FALSE))","v":90}]
[2,{"$f":"IF($G$3=\"k\",IF(VLOOKUP($D7,invullijst!$A$11:$M$185,11,FALSE)=0,\" \",VLOOKUP($D7,invullijst!$A$11:$M$185,11,FALSE)),\"\")","v":""},{"$f":"IF(VLOOKUP(D7,invullijst!A$11:F$226,4,FALSE)=\"\",\"\",VLOOKUP(D7,invullijst!A$11:D$226,4,FALSE))","v":"vr"},102,{"$f":"IF(VLOOKUP($D7,invullijst!$A$11:$M$185,2,FALSE)=\"\",\"\",VLOOKUP($D7,invullijst!$A$11:$M$185,2,FALSE))","v":"John de Jong"},null,{"$f":"IF(VLOOKUP($D7,invullijst!$A$11:$M$185,7,FALSE)=0,\"\",VLOOKUP($D7,invullijst!$A$11:$M$185,7,FALSE))","v":73},null,2,{"$f":"IF($O$3=\"k\",IF(VLOOKUP($L7,invullijst!$A$11:$M$185,11,FALSE)=0,\" \",VLOOKUP($L7,invullijst!$A$11:$M$185,11,FALSE)),\"\")","v":""},{"$f":"IF(VLOOKUP($L7,invullijst!$A$11:$M$226,4,FALSE)=\"\",\"\",VLOOKUP($L7,invullijst!$A$11:$M$226,4,FALSE))","v":"vr"},305,{"$f":"IF(VLOOKUP($L7,invullijst!$A$11:$M$185,2,FALSE)=\"\",\"\",VLOOKUP($L7,invullijst!$A$11:$M$185,2,FALSE))","v":"Johan Klerx"},null,{"$f":"IF(VLOOKUP($L7,invullijst!$A$11:$M$185,7,FALSE)=0,\"\",VLOOKUP($L7,invullijst!$A$11:$M$185,7,FALSE))","v":85}]
[3,{"$f":"IF($G$3=\"k\",IF(VLOOKUP($D8,invullijst!$A$11:$M$185,11,FALSE)=0,\" \",VLOOKUP($D8,invullijst!$A$11:$M$185,11,FALSE)),\"\")","v":""},{"$f":"IF(VLOOKUP(D8,invullijst!A$11:F$226,4,FALSE)=\"\",\"\",VLOOKUP(D8,invullijst!A$11:D$226,4,FALSE))","v":"vr"},108,{"$f":"IF(VLOOKUP($D8,invullijst!$A$11:$M$185,2,FALSE)=\"\",\"\",VLOOKUP($D8,invullijst!$A$11:$M$185,2,FALSE))","v":"Bram Pullens"},null,{"$f":"IF(VLOOKUP($D8,invullijst!$A$11:$M$185,7,FALSE)=0,\"\",VLOOKUP($D8,invullijst!$A$11:$M$185,7,FALSE))","v":77},null,3,{"$f":"IF($O$3=\"k\",IF(VLOOKUP($L8,invullijst!$A$11:$M$185,11,FALSE)=0,\" \",VLOOKUP($L8,invullijst!$A$11:$M$185,11,FALSE)),\"\")","v":""},{"$f":"IF(VLOOKUP($L8,invullijst!$A$11:$M$226,4,FALSE)=\"\",\"\",VLOOKUP($L8,invullijst!$A$11:$M$226,4,FALSE))","v":"vr"},306,{"$f":"IF(VLOOKUP($L8,invullijst!$A$11:$M$185,2,FALSE)=\"\",\"\",VLOOKUP($L8,invullijst!$A$11:$M$185,2,FALSE))","v":"Ron Groot"},null,{"$f":"IF(VLOOKUP($L8,invullijst!$A$11:$M$185,7,FALSE)=0,\"\",VLOOKUP($L8,invullijst!$A$11:$M$185,7,FALSE))","v":81}]
[4,{"$f":"IF($G$3=\"k\",IF(VLOOKUP($D9,invullijst!$A$11:$M$185,11,FALSE)=0,\" \",VLOOKUP($D9,invullijst!$A$11:$M$185,11,FALSE)),\"\")","v":""},{"$f":"IF(VLOOKUP(D9,invullijst!A$11:F$226,4,FALSE)=\"\",\"\",VLOOKUP(D9,invullijst!A$11:D$226,4,FALSE))","v":"vr"},106,{"$f":"IF(VLOOKUP($D9,invullijst!$A$11:$M$185,2,FALSE)=\"\",\"\",VLOOKUP($D9,invullijst!$A$11:$M$185,2,FALSE))","v":"René Pullens"},null,{"$f":"IF(VLOOKUP($D9,invullijst!$A$11:$M$185,7,FALSE)=0,\"\",VLOOKUP($D9,invullijst!$A$11:$M$185,7,FALSE))","v":76},null,4,{"$f":"IF($O$3=\"k\",IF(VLOOKUP($L9,invullijst!$A$11:$M$185,11,FALSE)=0,\" \",VLOOKUP($L9,invullijst!$A$11:$M$185,11,FALSE)),\"\")","v":""},{"$f":"IF(VLOOKUP($L9,invullijst!$A$11:$M$226,4,FALSE)=\"\",\"\",VLOOKUP($L9,invullijst!$A$11:$M$226,4,FALSE))","v":"vr"},304,{"$f":"IF(VLOOKUP($L9,invullijst!$A$11:$M$185,2,FALSE)=\"\",\"\",VLOOKUP($L9,invullijst!$A$11:$M$185,2,FALSE))","v":"Henk Bruurmijn "},null,{"$f":"IF(VLOOKUP($L9,invullijst!$A$11:$M$185,7,FALSE)=0,\"\",VLOOKUP($L9,invullijst!$A$11:$M$185,7,FALSE))","v":62}]
["Totaal A korps",{"$nulls":5},{"$f":"SUM(G6:G9)","v":311},null,"Totaal A korps",{"$nulls":5},{"$f":"SUM(O6:O9)","v":318}]
[]
[1,{"$f":"IF($G$3=\"k\",IF(VLOOKUP($D12,invullijst!$A$11:$M$185,11,FALSE)=0,\" \",VLOOKUP($D12,invullijst!$A$11:$M$185,11,FALSE)),\"\")","v":""},{"$f":"IF(VLOOKUP(D12,invullijst!A$11:F$226,4,FALSE)=\"\",\"\",VLOOKUP(D12,invullijst!A$11:D$226,4,FALSE))","v":"vr"},101,{"$f":"IF(VLOOKUP($D12,invullijst!$A$11:$M$185,2,FALSE)=\"\",\"\",VLOOKUP($D12,invullijst!$A$11:$M$185,2,FALSE))","v":"Antwan van Buul"},null,{"$f":"IF(VLOOKUP($D12,invullijst!$A$11:$M$185,7,FALSE)=0,\"\",VLOOKUP($D12,invullijst!$A$11:$M$185,7,FALSE))","v":68},null,1,{"$f":"IF($O$3=\"k\",IF(VLOOKUP($L12,invullijst!$A$11:$M$185,11,FALSE)=0,\" \",VLOOKUP($L12,invullijst!$A$11:$M$185,11,FALSE)),\"\")","v":""},{"$f":"IF(VLOOKUP($L12,invullijst!$A$11:$M$226,4,FALSE)=\"\",\"\",VLOOKUP($L12,invullijst!$A$11:$M$226,4,FALSE))","v":0},null,{"$f":"IF(VLOOKUP($L12,invullijst!$A$11:$M$185,2,FALSE)=\"\",\"\",VLOOKUP($L12,invullijst!$A$11:$M$185,2,FALSE))","v":0},null,{"$f":"IF(VLOOKUP($L12,invullijst!$A$11:$M$185,7,FALSE)=0,\"\",VLOOKUP($L12,invullijst!$A$11:$M$185,7,FALSE))","v":""}]
[2,{"$f":"IF($G$3=\"k\",IF(VLOOKUP($D13,invullijst!$A$11:$M$185,11,FALSE)=0,\" \",VLOOKUP($D13,invullijst!$A$11:$M$185,11,FALSE)),\"\")","v":""},{"$f":"IF(VLOOKUP(D13,invullijst!A$11:F$226,4,FALSE)=\"\",\"\",VLOOKUP(D13,invullijst!A$11:D$226,4,FALSE))","v":"vr"},109,{"$f":"IF(VLOOKUP($D13,invullijst!$A$11:$M$185,2,FALSE)=\"\",\"\",VLOOKUP($D13,invullijst!$A$11:$M$185,2,FALSE))","v":"Gijs Pullens"},null,{"$f":"IF(VLOOKUP($D13,invullijst!$A$11:$M$185,7,FALSE)=0,\"\",VLOOKUP($D13,invullijst!$A$11:$M$185,7,FALSE))","v":83},null,2,{"$f":"IF($O$3=\"k\",IF(VLOOKUP($L13,invullijst!$A$11:$M$185,11,FALSE)=0,\" \",VLOOKUP($L13,invullijst!$A$11:$M$185,11,FALSE)),\"\")","v":""},{"$f":"IF(VLOOKUP($L13,invullijst!$A$11:$M$226,4,FALSE)=\"\",\"\",VLOOKUP($L13,invullijst!$A$11:$M$226,4,FALSE))","v":0},null,{"$f":"IF(VLOOKUP($L13,invullijst!$A$11:$M$185,2,FALSE)=\"\",\"\",VLOOKUP($L13,invullijst!$A$11:$M$185,2,FALSE))","v":0},null,{"$f":"IF(VLOOKUP($L13,invullijst!$A$11:$M$185,7,FALSE)=0,\"\",VLOOKUP($L13,invullijst!$A$11:$M$185,7,FALSE))","v":""}]
[3,{"$f":"IF($G$3=\"k\",IF(VLOOKUP($D14,invullijst!$A$11:$M$185,11,FALSE)=0,\" \",VLOOKUP($D14,invullijst!$A$11:$M$185,11,FALSE)),\"\")","v":""},{"$f":"IF(VLOOKUP(D14,invullijst!A$11:F$226,4,FALSE)=\"\",\"\",VLOOKUP(D14,invullijst!A$11:D$226,4,FALSE))","v":"vr"},103,{"$f":"IF(VLOOKUP($D14,invullijst!$A$11:$M$185,2,FALSE)=\"\",\"\",VLOOKUP($D14,invullijst!$A$11:$M$185,2,FALSE))","v":"Norbert van Buul"},null,{"$f":"IF(VLOOKUP($D14,invullijst!$A$11:$M$185,7,FALSE)=0,\"\",VLOOKUP($D14,invullijst!$A$11:$M$185,7,FALSE))","v":55},null,3,{"$f":"IF($O$3=\"k\",IF(VLOOKUP($L14,invullijst!$A$11:$M$185,11,FALSE)=0,\" \",VLOOKUP($L14,invullijst!$A$11:$M$185,11,FALSE)),\"\")","v":""},{"$f":"IF(VLOOKUP($L14,invullijst!$A$11:$M$226,4,FALSE)=\"\",\"\",VLOOKUP($L14,invullijst!$A$11:$M$226,4,FALSE))","v":0},null,{"$f":"IF(VLOOKUP($L14,invullijst!$A$11:$M$185,2,FALSE)=\"\",\"\",VLOOKUP($L14,invullijst!$A$11:$M$185,2,FALSE))","v":0},null,{"$f":"IF(VLOOKUP($L14,invullijst!$A$11:$M$185,7,FALSE)=0,\"\",VLOOKUP($L14,invullijst!$A$11:$M$185,7,FALSE))","v":""}]
[4,{"$f":"IF($G$3=\"k\",IF(VLOOKUP($D15,invullijst!$A$11:$M$185,11,FALSE)=0,\" \",VLOOKUP($D15,invullijst!$A$11:$M$185,11,FALSE)),\"\")","v":""},{"$f":"IF(VLOOKUP(D15,invullijst!A$11:F$226,4,FALSE)=\"\",\"\",VLOOKUP(D15,invullijst!A$11:D$226,4,FALSE))","v":0},null,{"$f":"IF(VLOOKUP($D15,invullijst!$A$11:$M$185,2,FALSE)=\"\",\"\",VLOOKUP($D15,invullijst!$A$11:$M$185,2,FALSE))","v":0},null,{"$f":"IF(VLOOKUP($D15,invullijst!$A$11:$M$185,7,FALSE)=0,\"\",VLOOKUP($D15,invullijst!$A$11:$M$185,7,FALSE))","v":""},null,4,{"$f":"IF($O$3=\"k\",IF(VLOOKUP($L15,invullijst!$A$11:$M$185,11,FALSE)=0,\" \",VLOOKUP($L15,invullijst!$A$11:$M$185,11,FALSE)),\"\")","v":""},{"$f":"IF(VLOOKUP($L15,invullijst!$A$11:$M$226,4,FALSE)=\"\",\"\",VLOOKUP($L15,invullijst!$A$11:$M$226,4,FALSE))","v":0},null,{"$f":"IF(VLOOKUP($L15,invullijst!$A$11:$M$185,2,FALSE)=\"\",\"\",VLOOKUP($L15,invullijst!$A$11:$M$185,2,FALSE))","v":0},null,{"$f":"IF(VLOOKUP($L15,invullijst!$A$11:$M$185,7,FALSE)=0,\"\",VLOOKUP($L15,invullijst!$A$11:$M$185,7,FALSE))","v":""}]
["Totaal B1 korps",{"$nulls":5},{"$f":"SUM(G12:G15)","v":206},null,"Totaal B1 korps",{"$nulls":5},{"$f":"SUM(O12:O15)","v":0}]
[]
[1,{"$f":"IF($G$3=\"k\",IF(VLOOKUP($D18,invullijst!$A$11:$M$185,11,FALSE)=0,\" \",VLOOKUP($D18,invullijst!$A$11:$M$185,11,FALSE)),\"\")","v":""},{"$f":"IF(VLOOKUP(D18,invullijst!A$11:F$226,4,FALSE)=\"\",\"\",VLOOKUP(D18,invullijst!A$11:D$226,4,FALSE))","v":0},null,{"$f":"IF(VLOOKUP($D18,invullijst!$A$11:$M$185,2,FALSE)=\"\",\"\",VLOOKUP($D18,invullijst!$A$11:$M$185,2,FALSE))","v":0},null,{"$f":"IF(VLOOKUP($D18,invullijst!$A$11:$M$185,7,FALSE)=0,\"\",VLOOKUP($D18,invullijst!$A$11:$M$185,7,FALSE))","v":""},null,1,{"$f":"IF($O$3=\"k\",IF(VLOOKUP($L18,invullijst!$A$11:$M$185,11,FALSE)=0,\" \",VLOOKUP($L18,invullijst!$A$11:$M$185,11,FALSE)),\"\")","v":""},{"$f":"IF(VLOOKUP($L18,invullijst!$A$11:$M$226,4,FALSE)=\"\",\"\",VLOOKUP($L18,invullijst!$A$11:$M$226,4,FALSE))","v":0},null,{"$f":"IF(VLOOKUP($L18,invullijst!$A$11:$M$185,2,FALSE)=\"\",\"\",VLOOKUP($L18,invullijst!$A$11:$M$185,2,FALSE))","v":0},null,{"$f":"IF(VLOOKUP($L18,invullijst!$A$11:$M$185,7,FALSE)=0,\"\",VLOOKUP($L18,invullijst!$A$11:$M$185,7,FALSE))","v":""}]
[2,{"$f":"IF($G$3=\"k\",IF(VLOOKUP($D19,invullijst!$A$11:$M$185,11,FALSE)=0,\" \",VLOOKUP($D19,invullijst!$A$11:$M$185,11,FALSE)),\"\")","v":""},{"$f":"IF(VLOOKUP(D19,invullijst!A$11:F$226,4,FALSE)=\"\",\"\",VLOOKUP(D19,invullijst!A$11:D$226,4,FALSE))","v":0},null,{"$f":"IF(VLOOKUP($D19,invullijst!$A$11:$M$185,2,FALSE)=\"\",\"\",VLOOKUP($D19,invullijst!$A$11:$M$185,2,FALSE))","v":0},null,{"$f":"IF(VLOOKUP($D19,invullijst!$A$11:$M$185,7,FALSE)=0,\"\",VLOOKUP($D19,invullijst!$A$11:$M$185,7,FALSE))","v":""},null,2,{"$f":"IF($O$3=\"k\",IF(VLOOKUP($L19,invullijst!$A$11:$M$185,11,FALSE)=0,\" \",VLOOKUP($L19,invullijst!$A$11:$M$185,11,FALSE)),\"\")","v":""},{"$f":"IF(VLOOKUP($L19,invullijst!$A$11:$M$226,4,FALSE)=\"\",\"\",VLOOKUP($L19,invullijst!$A$11:$M$226,4,FALSE))","v":0},null,{"$f":"IF(VLOOKUP($L19,invullijst!$A$11:$M$185,2,FALSE)=\"\",\"\",VLOOKUP($L19,invullijst!$A$11:$M$185,2,FALSE))","v":0},null,{"$f":"IF(VLOOKUP($L19,invullijst!$A$11:$M$185,7,FALSE)=0,\"\",VLOOKUP($L19,invullijst!$A$11:$M$185,7,FALSE))","v":""}]
[3,{"$f":"IF($G$3=\"k\",IF(VLOOKUP($D20,invullijst!$A$11:$M$185,11,FALSE)=0,\" \",VLOOKUP($D20,invullijst!$A$11:$M$185,11,FALSE)),\"\")","v":""},{"$f":"IF(VLOOKUP(D20,invullijst!A$11:F$226,4,FALSE)=\"\",\"\",VLOOKUP(D20,invullijst!A$11:D$226,4,FALSE))","v":0},null,{"$f":"IF(VLOOKUP($D20,invullijst!$A$11:$M$185,2,FALSE)=\"\",\"\",VLOOKUP($D20,invullijst!$A$11:$M$185,2,FALSE))","v":0},null,{"$f":"IF(VLOOKUP($D20,invullijst!$A$11:$M$185,7,FALSE)=0,\"\",VLOOKUP($D20,invullijst!$A$11:$M$185,7,FALSE))","v":""},null,3,{"$f":"IF($O$3=\"k\",IF(VLOOKUP($L20,invullijst!$A$11:$M$185,11,FALSE)=0,\" \",VLOOKUP($L20,invullijst!$A$11:$M$185,11,FALSE)),\"\")","v":""},{"$f":"IF(VLOOKUP($L20,invullijst!$A$11:$M$226,4,FALSE)=\"\",\"\",VLOOKUP($L20,invullijst!$A$11:$M$226,4,FALSE))","v":0},null,{"$f":"IF(VLOOKUP($L20,invullijst!$A$11:$M$185,2,FALSE)=\"\",\"\",VLOOKUP($L20,invullijst!$A$11:$M$185,2,FALSE))","v":0},null,{"$f":"IF(VLOOKUP($L20,invullijst!$A$11:$M$185,7,FALSE)=0,\"\",VLOOKUP($L20,invullijst!$A$11:$M$185,7,FALSE))","v":""}]
[4,{"$f":"IF($G$3=\"k\",IF(VLOOKUP($D21,invullijst!$A$11:$M$185,11,FALSE)=0,\" \",VLOOKUP($D21,invullijst!$A$11:$M$185,11,FALSE)),\"\")","v":""},{"$f":"IF(VLOOKUP(D21,invullijst!A$11:F$226,4,FALSE)=\"\",\"\",VLOOKUP(D21,invullijst!A$11:D$226,4,FALSE))","v":0},null,{"$f":"IF(VLOOKUP($D21,invullijst!$A$11:$M$185,2,FALSE)=\"\",\"\",VLOOKUP($D21,invullijst!$A$11:$M$185,2,FALSE))","v":0},null,{"$f":"IF(VLOOKUP($D21,invullijst!$A$11:$M$185,7,FALSE)=0,\"\",VLOOKUP($D21,invullijst!$A$11:$M$185,7,FALSE))","v":""},null,4,{"$f":"IF($O$3=\"k\",IF(VLOOKUP($L21,invullijst!$A$11:$M$185,11,FALSE)=0,\" \",VLOOKUP($L21,invullijst!$A$11:$M$185,11,FALSE)),\"\")","v":""},{"$f":"IF(VLOOKUP($L21,invullijst!$A$11:$M$226,4,FALSE)=\"\",\"\",VLOOKUP($L21,invullijst!$A$11:$M$226,4,FALSE))","v":0},null,{"$f":"IF(VLOOKUP($L21,invullijst!$A$11:$M$185,2,FALSE)=\"\",\"\",VLOOKUP($L21,invullijst!$A$11:$M$185,2,FALSE))","v":0},null,{"$f":"IF(VLOOKUP($L21,invullijst!$A$11:$M$185,7,FALSE)=0,\"\",VLOOKUP($L21,invullijst!$A$11:$M$185,7,FALSE))","v":""}]
["DIVERSEN / INHAAL",{"$nulls":7},"DIVERSEN / INHAAL"]
[]
["OPGELEGD (Jeugd <16 en 65+)"]
[1,{"$f":"IF($G$3=\"k\",IF(VLOOKUP($D25,invullijst!$A$11:$M$185,11,FALSE)=0,\" \",VLOOKUP($D25,invullijst!$A$11:$M$185,11,FALSE)),\"\")","v":""},{"$f":"IF(VLOOKUP(D25,invullijst!A$11:F$226,4,FALSE)=\"\",\"\",VLOOKUP(D25,invullijst!A$11:D$226,4,FALSE))","v":"65+"},104,{"$f":"IF(VLOOKUP($D25,invullijst!$A$11:$M$185,2,FALSE)=\"\",\"\",VLOOKUP($D25,invullijst!$A$11:$M$185,2,FALSE))","v":"Peter Brekelmans"},null,{"$f":"IF(VLOOKUP($D25,invullijst!$A$11:$M$185,7,FALSE)=0,\"\",VLOOKUP($D25,invullijst!$A$11:$M$185,7,FALSE))","v":79},null,1,{"$f":"IF($O$3=\"k\",IF(VLOOKUP($L25,invullijst!$A$11:$M$185,11,FALSE)=0,\" \",VLOOKUP($L25,invullijst!$A$11:$M$185,11,FALSE)),\"\")","v":""},{"$f":"IF(VLOOKUP($L25,invullijst!$A$11:$M$226,4,FALSE)=\"\",\"\",VLOOKUP($L25,invullijst!$A$11:$M$226,4,FALSE))","v":"65+"},307,{"$f":"IF(VLOOKUP($L25,invullijst!$A$11:$M$185,2,FALSE)=\"\",\"\",VLOOKUP($L25,invullijst!$A$11:$M$185,2,FALSE))","v":"Bert van Engelen"},null,{"$f":"IF(VLOOKUP($L25,invullijst!$A$11:$M$185,7,FALSE)=0,\"\",VLOOKUP($L25,invullijst!$A$11:$M$185,7,FALSE))","v":95}]
[2,{"$f":"IF($G$3=\"k\",IF(VLOOKUP($D26,invullijst!$A$11:$M$185,11,FALSE)=0,\" \",VLOOKUP($D26,invullijst!$A$11:$M$185,11,FALSE)),\"\")","v":""},{"$f":"IF(VLOOKUP(D26,invullijst!A$11:F$226,4,FALSE)=\"\",\"\",VLOOKUP(D26,invullijst!A$11:D$226,4,FALSE))","v":"65+"},112,{"$f":"IF(VLOOKUP($D26,invullijst!$A$11:$M$185,2,FALSE)=\"\",\"\",VLOOKUP($D26,invullijst!$A$11:$M$185,2,FALSE))","v":"Toon van Buul"},null,{"$f":"IF(VLOOKUP($D26,invullijst!$A$11:$M$185,7,FALSE)=0,\"\",VLOOKUP($D26,invullijst!$A$11:$M$185,7,FALSE))","v":58},null,2,{"$f":"IF($O$3=\"k\",IF(VLOOKUP($L26,invullijst!$A$11:$M$185,11,FALSE)=0,\" \",VLOOKUP($L26,invullijst!$A$11:$M$185,11,FALSE)),\"\")","v":""},{"$f":"IF(VLOOKUP($L26,invullijst!$A$11:$M$226,4,FALSE)=\"\",\"\",VLOOKUP($L26,invullijst!$A$11:$M$226,4,FALSE))","v":"65+"},310,{"$f":"IF(VLOOKUP($L26,invullijst!$A$11:$M$185,2,FALSE)=\"\",\"\",VLOOKUP($L26,invullijst!$A$11:$M$185,2,FALSE))","v":"Tiny Boom"},null,{"$f":"IF(VLOOKUP($L26,invullijst!$A$11:$M$185,7,FALSE)=0,\"\",VLOOKUP($L26,invullijst!$A$11:$M$185,7,FALSE))","v":92}]
[3,{"$f":"IF($G$3=\"k\",IF(VLOOKUP($D27,invullijst!$A$11:$M$185,11,FALSE)=0,\" \",VLOOKUP($D27,invullijst!$A$11:$M$185,11,FALSE)),\"\")","v":""},{"$f":"IF(VLOOKUP(D27,invullijst!A$11:F$226,4,FALSE)=\"\",\"\",VLOOKUP(D27,invullijst!A$11:D$226,4,FALSE))","v":"65+"},107,{"$f":"IF(VLOOKUP($D27,invullijst!$A$11:$M$185,2,FALSE)=\"\",\"\",VLOOKUP($D27,invullijst!$A$11:$M$185,2,FALSE))","v":"Cees Coppens"},null,{"$f":"IF(VLOOKUP($D27,invullijst!$A$11:$M$185,7,FALSE)=0,\"\",VLOOKUP($D27,invullijst!$A$11:$M$185,7,FALSE))","v":86},null,3,{"$f":"IF($O$3=\"k\",IF(VLOOKUP($L27,invullijst!$A$11:$M$185,11,FALSE)=0,\" \",VLOOKUP($L27,invullijst!$A$11:$M$185,11,FALSE)),\"\")","v":""},{"$f":"IF(VLOOKUP($L27,invullijst!$A$11:$M$226,4,FALSE)=\"\",\"\",VLOOKUP($L27,invullijst!$A$11:$M$226,4,FALSE))","v":"65+"},309,{"$f":"IF(VLOOKUP($L27,invullijst!$A$11:$M$185,2,FALSE)=\"\",\"\",VLOOKUP($L27,invullijst!$A$11:$M$185,2,FALSE))","v":"René de Jong"},null,{"$f":"IF(VLOOKUP($L27,invullijst!$A$11:$M$185,7,FALSE)=0,\"\",VLOOKUP($L27,invullijst!$A$11:$M$185,7,FALSE))","v":81}]
["Totaal korps opgelegd A1",{"$nulls":5},{"$f":"SUM(G25:G27)","v":223},null,"Totaal korps opgelegd A1",{"$nulls":5},{"$f":"SUM(O25:O27)","v":268}]
[]
[1,{"$f":"IF($G$3=\"k\",IF(VLOOKUP($D30,invullijst!$A$11:$M$185,11,FALSE)=0,\" \",VLOOKUP($D30,invullijst!$A$11:$M$185,11,FALSE)),\"\")","v":""},{"$f":"IF(VLOOKUP(D30,invullijst!A$11:F$226,4,FALSE)=\"\",\"\",VLOOKUP(D30,invullijst!A$11:D$226,4,FALSE))","v":0},null,{"$f":"IF(VLOOKUP($D30,invullijst!$A$11:$M$185,2,FALSE)=\"\",\"\",VLOOKUP($D30,invullijst!$A$11:$M$185,2,FALSE))","v":0},null,{"$f":"IF(VLOOKUP($D30,invullijst!$A$11:$M$185,7,FALSE)=0,\"\",VLOOKUP($D30,invullijst!$A$11:$M$185,7,FALSE))","v":""},null,1,{"$f":"IF($O$3=\"k\",IF(VLOOKUP($L30,invullijst!$A$11:$M$185,11,FALSE)=0,\" \",VLOOKUP($L30,invullijst!$A$11:$M$185,11,FALSE)),\"\")","v":""},{"$f":"IF(VLOOKUP($L30,invullijst!$A$11:$M$226,4,FALSE)=\"\",\"\",VLOOKUP($L30,invullijst!$A$11:$M$226,4,FALSE))","v":"J"},312,{"$f":"IF(VLOOKUP($L30,invullijst!$A$11:$M$185,2,FALSE)=\"\",\"\",VLOOKUP($L30,invullijst!$A$11:$M$185,2,FALSE))","v":"Floor de Jong"},null,{"$f":"IF(VLOOKUP($L30,invullijst!$A$11:$M$185,7,FALSE)=0,\"\",VLOOKUP($L30,invullijst!$A$11:$M$185,7,FALSE))","v":91}]
[2,{"$f":"IF($G$3=\"k\",IF(VLOOKUP($D31,invullijst!$A$11:$M$185,11,FALSE)=0,\" \",VLOOKUP($D31,invullijst!$A$11:$M$185,11,FALSE)),\"\")","v":""},{"$f":"IF(VLOOKUP(D31,invullijst!A$11:F$226,4,FALSE)=\"\",\"\",VLOOKUP(D31,invullijst!A$11:D$226,4,FALSE))","v":0},null,{"$f":"IF(VLOOKUP($D31,invullijst!$A$11:$M$185,2,FALSE)=\"\",\"\",VLOOKUP($D31,invullijst!$A$11:$M$185,2,FALSE))","v":0},null,{"$f":"IF(VLOOKUP($D31,invullijst!$A$11:$M$185,7,FALSE)=0,\"\",VLOOKUP($D31,invullijst!$A$11:$M$185,7,FALSE))","v":""},null,2,{"$f":"IF($O$3=\"k\",IF(VLOOKUP($L31,invullijst!$A$11:$M$185,11,FALSE)=0,\" \",VLOOKUP($L31,invullijst!$A$11:$M$185,11,FALSE)),\"\")","v":""},{"$f":"IF(VLOOKUP($L31,invullijst!$A$11:$M$226,4,FALSE)=\"\",\"\",VLOOKUP($L31,invullijst!$A$11:$M$226,4,FALSE))","v":"65+"},301,{"$f":"IF(VLOOKUP($L31,invullijst!$A$11:$M$185,2,FALSE)=\"\",\"\",VLOOKUP($L31,invullijst!$A$11:$M$185,2,FALSE))","v":"Arjen van Assem disp"},null,{"$f":"IF(VLOOKUP($L31,invullijst!$A$11:$M$185,7,FALSE)=0,\"\",VLOOKUP($L31,invullijst!$A$11:$M$185,7,FALSE))","v":90}]
[3,{"$f":"IF($G$3=\"k\",IF(VLOOKUP($D32,invullijst!$A$11:$M$185,11,FALSE)=0,\" \",VLOOKUP($D32,invullijst!$A$11:$M$185,11,FALSE)),\"\")","v":""},{"$f":"IF(VLOOKUP(D32,invullijst!A$11:F$226,4,FALSE)=\"\",\"\",VLOOKUP(D32,invullijst!A$11:D$226,4,FALSE))","v":0},null,{"$f":"IF(VLOOKUP($D32,invullijst!$A$11:$M$185,2,FALSE)=\"\",\"\",VLOOKUP($D32,invullijst!$A$11:$M$185,2,FALSE))","v":0},null,{"$f":"IF(VLOOKUP($D32,invullijst!$A$11:$M$185,7,FALSE)=0,\"\",VLOOKUP($D32,invullijst!$A$11:$M$185,7,FALSE))","v":""},null,3,{"$f":"IF($O$3=\"k\",IF(VLOOKUP($L32,invullijst!$A$11:$M$185,11,FALSE)=0,\" \",VLOOKUP($L32,invullijst!$A$11:$M$185,11,FALSE)),\"\")","v":""},{"$f":"IF(VLOOKUP($L32,invullijst!$A$11:$M$226,4,FALSE)=\"\",\"\",VLOOKUP($L32,invullijst!$A$11:$M$226,4,FALSE))","v":0},null,{"$f":"IF(VLOOKUP($L32,invullijst!$A$11:$M$185,2,FALSE)=\"\",\"\",VLOOKUP($L32,invullijst!$A$11:$M$185,2,FALSE))","v":0},null,{"$f":"IF(VLOOKUP($L32,invullijst!$A$11:$M$185,7,FALSE)=0,\"\",VLOOKUP($L32,invullijst!$A$11:$M$185,7,FALSE))","v":""}]
["Totaal korps opgelegd A2",{"$nulls":5},{"$f":"SUM(G30:G32)","v":0},null,"Totaal korps opgelegd A2",{"$nulls":5},{"$f":"SUM(O30:O32)","v":181}]
[]
[1,{"$f":"IF($G$3=\"k\",IF(VLOOKUP($D35,invullijst!$A$11:$M$185,11,FALSE)=0,\" \",VLOOKUP($D35,invullijst!$A$11:$M$185,11,FALSE)),\"\")","v":""},{"$f":"IF(VLOOKUP(D35,invullijst!A$11:F$226,4,FALSE)=\"\",\"\",VLOOKUP(D35,invullijst!A$11:D$226,4,FALSE))","v":0},null,{"$f":"IF(VLOOKUP($D35,invullijst!$A$11:$M$185,2,FALSE)=\"\",\"\",VLOOKUP($D35,invullijst!$A$11:$M$185,2,FALSE))","v":0},null,{"$f":"IF(VLOOKUP($D35,invullijst!$A$11:$M$185,7,FALSE)=0,\"\",VLOOKUP($D35,invullijst!$A$11:$M$185,7,FALSE))","v":""},null,1,{"$f":"IF($O$3=\"k\",IF(VLOOKUP($L35,invullijst!$A$11:$M$185,11,FALSE)=0,\" \",VLOOKUP($L35,invullijst!$A$11:$M$185,11,FALSE)),\"\")","v":""},{"$f":"IF(VLOOKUP($L35,invullijst!$A$11:$M$226,4,FALSE)=\"\",\"\",VLOOKUP($L35,invullijst!$A$11:$M$226,4,FALSE))","v":0},null,{"$f":"IF(VLOOKUP($L35,invullijst!$A$11:$M$185,2,FALSE)=\"\",\"\",VLOOKUP($L35,invullijst!$A$11:$M$185,2,FALSE))","v":0},null,{"$f":"IF(VLOOKUP($L35,invullijst!$A$11:$M$185,7,FALSE)=0,\"\",VLOOKUP($L35,invullijst!$A$11:$M$185,7,FALSE))","v":""}]
[2,{"$f":"IF($G$3=\"k\",IF(VLOOKUP($D36,invullijst!$A$11:$M$185,11,FALSE)=0,\" \",VLOOKUP($D36,invullijst!$A$11:$M$185,11,FALSE)),\"\")","v":""},{"$f":"IF(VLOOKUP(D36,invullijst!A$11:F$226,4,FALSE)=\"\",\"\",VLOOKUP(D36,invullijst!A$11:D$226,4,FALSE))","v":0},null,{"$f":"IF(VLOOKUP($D36,invullijst!$A$11:$M$185,2,FALSE)=\"\",\"\",VLOOKUP($D36,invullijst!$A$11:$M$185,2,FALSE))","v":0},null,{"$f":"IF(VLOOKUP($D36,invullijst!$A$11:$M$185,7,FALSE)=0,\"\",VLOOKUP($D36,invullijst!$A$11:$M$185,7,FALSE))","v":""},null,2,{"$f":"IF($O$3=\"k\",IF(VLOOKUP($L36,invullijst!$A$11:$M$185,11,FALSE)=0,\" \",VLOOKUP($L36,invullijst!$A$11:$M$185,11,FALSE)),\"\")","v":""},{"$f":"IF(VLOOKUP($L36,invullijst!$A$11:$M$226,4,FALSE)=\"\",\"\",VLOOKUP($L36,invullijst!$A$11:$M$226,4,FALSE))","v":0},null,{"$f":"IF(VLOOKUP($L36,invullijst!$A$11:$M$185,2,FALSE)=\"\",\"\",VLOOKUP($L36,invullijst!$A$11:$M$185,2,FALSE))","v":0},null,{"$f":"IF(VLOOKUP($L36,invullijst!$A$11:$M$185,7,FALSE)=0,\"\",VLOOKUP($L36,invullijst!$A$11:$M$185,7,FALSE))","v":""}]
[3,{"$f":"IF($G$3=\"k\",IF(VLOOKUP($D37,invullijst!$A$11:$M$185,11,FALSE)=0,\" \",VLOOKUP($D37,invullijst!$A$11:$M$185,11,FALSE)),\"\")","v":""},{"$f":"IF(VLOOKUP(D37,invullijst!A$11:F$226,4,FALSE)=\"\",\"\",VLOOKUP(D37,invullijst!A$11:D$226,4,FALSE))","v":0},null,{"$f":"IF(VLOOKUP($D37,invullijst!$A$11:$M$185,2,FALSE)=\"\",\"\",VLOOKUP($D37,invullijst!$A$11:$M$185,2,FALSE))","v":0},null,{"$f":"IF(VLOOKUP($D37,invullijst!$A$11:$M$185,7,FALSE)=0,\"\",VLOOKUP($D37,invullijst!$A$11:$M$185,7,FALSE))","v":""},null,3,{"$f":"IF($O$3=\"k\",IF(VLOOKUP($L37,invullijst!$A$11:$M$185,11,FALSE)=0,\" \",VLOOKUP($L37,invullijst!$A$11:$M$185,11,FALSE)),\"\")","v":""},{"$f":"IF(VLOOKUP($L37,invullijst!$A$11:$M$226,4,FALSE)=\"\",\"\",VLOOKUP($L37,invullijst!$A$11:$M$226,4,FALSE))","v":0},null,{"$f":"IF(VLOOKUP($L37,invullijst!$A$11:$M$185,2,FALSE)=\"\",\"\",VLOOKUP($L37,invullijst!$A$11:$M$185,2,FALSE))","v":0},null,{"$f":"IF(VLOOKUP($L37,invullijst!$A$11:$M$185,7,FALSE)=0,\"\",VLOOKUP($L37,invullijst!$A$11:$M$185,7,FALSE))","v":""}]
["Totaal korps opgelegd A3",{"$nulls":5},{"$f":"SUM(G35:G37)","v":0},null,"Totaal korps opgelegd A3",{"$nulls":5},{"$f":"SUM(O35:O37)","v":0}]

{"sheet":"wedstrijd 2B","index":8,"n_rows":38,"n_cols":15,"rows_kept":38,"merged":[[0,0,0,4],[0,5,0,7],[0,8,0,14],[1,0,1,11],[1,12,1,14],[2,1,2,5],[2,9,2,13],[4,0,4,14],[5,4,5,5],[5,12,5,13],[6,4,6,5],[6,12,6,13],[7,4,7,5],[7,12,7,13],[8,4,8,5],[8,12,8,13],[9,0,9,5],[9,8,9,13],[11,4,11,5],[11,12,11,13],[12,4,12,5],[12,12,12,13],[13,4,13,5],[13,12,13,13],[14,4,14,5],[14,12,14,13],[15,0,15,5],[15,8,15,13],[17,4,17,5],[17,12,17,13],[18,4,18,5],[18,12,18,13],[19,4,19,5],[19,12,19,13],[20,4,20,5],[20,12,20,13],[21,0,21,5],[21,8,21,13],[23,0,23,14],[24,4,24,5],[24,12,24,13],[25,4,25,5],[25,12,25,13],[26,4,26,5],[26,12,26,13],[27,0,27,5],[27,8,27,13],[29,4,29,5],[29,12,29,13],[30,4,30,5],[30,12,30,13],[31,4,31,5],[31,12,31,13],[32,0,32,5],[32,8,32,13],[34,4,34,5],[34,12,34,13],[35,4,35,5],[35,12,35,13],[36,4,36,5],[36,12,36,13],[37,0,37,5],[37,8,37,13]]}
[{"$f":"invullijst!F1","v":"Organistatie"},{"$nulls":4},{"$f":"invullijst!H2","v":"2024 - 2025"},null,null,{"$f":"invullijst!F3","v":"O.L.V. Schuts Elshout"}]
["Datum: ",{"$nulls":11},"2025-01-19"]
[5,{"$f":"IF(VLOOKUP(A3,invullijst!A1:F5,2,FALSE)=\"\",\"\",VLOOKUP(A3,invullijst!A1:F5,2,FALSE))","v":"Sint Jan Baptist Kaatsheuvel"},{"$nulls":6},2,{"$f":"IF(VLOOKUP(I3,invullijst!A1:C5,2,FALSE)=\"\",\"\",VLOOKUP(I3,invullijst!A1:C5,2,FALSE))","v":"St. Crispinus & Crispinianus Besoijen"}]
[]
["vrijehand"]
[1,{"$f":"IF($G$3=\"k\",IF(VLOOKUP($D6,invullijst!$A$11:$M$185,11,FALSE)=0,\" \",VLOOKUP($D6,invullijst!$A$11:$M$185,11,FALSE)),\"\")","v":""},{"$f":"IF(VLOOKUP(D6,invullijst!A$11:F$226,4,FALSE)=\"\",\"\",VLOOKUP(D6,invullijst!A$11:D$226,4,FALSE))","v":"vr"},506,{"$f":"IF(VLOOKUP($D6,invullijst!$A$11:$M$185,2,FALSE)=\"\",\"\",VLOOKUP($D6,invullijst!$A$11:$M$185,2,FALSE))","v":"Maikel Monden"},null,{"$f":"IF(VLOOKUP($D6,invullijst!$A$11:$M$185,7,FALSE)=0,\"\",VLOOKUP($D6,invullijst!$A$11:$M$185,7,FALSE))","v":81},null,1,{"$f":"IF($O$3=\"k\",IF(VLOOKUP($L6,invullijst!$A$11:$M$185,11,FALSE)=0,\" \",VLOOKUP($L6,invullijst!$A$11:$M$185,11,FALSE)),\"\")","v":""},{"$f":"IF(VLOOKUP($L6,invullijst!$A$11:$M$226,4,FALSE)=\"\",\"\",VLOOKUP($L6,invullijst!$A$11:$M$226,4,FALSE))","v":"vr"},210,{"$f":"IF(VLOOKUP($L6,invullijst!$A$11:$M$185,2,FALSE)=\"\",\"\",VLOOKUP($L6,invullijst!$A$11:$M$185,2,FALSE))","v":"Sander Oome"},null,{"$f":"IF(VLOOKUP($L6,invullijst!$A$11:$M$185,7,FALSE)=0,\"\",VLOOKUP($L6,invullijst!$A$11:$M$185,7,FALSE))","v":87}]
[2,{"$f":"IF($G$3=\"k\",IF(VLOOKUP($D7,invullijst!$A$11:$M$185,11,FALSE)=0,\" \",VLOOKUP($D7,invullijst!$A$11:$M$185,11,FALSE)),\"\")","v":""},{"$f":"IF(VLOOKUP(D7,invullijst!A$11:F$226,4,FALSE)=\"\",\"\",VLOOKUP(D7,invullijst!A$11:D$226,4,FALSE))","v":"vr"},507,{"$f":"IF(VLOOKUP($D7,invullijst!$A$11:$M$185,2,FALSE)=\"\",\"\",VLOOKUP($D7,invullijst!$A$11:$M$185,2,FALSE))","v":"Michael Blaauwbroek"},null,{"$f":"IF(VLOOKUP($D7,invullijst!$A$11:$M$185,7,FALSE)=0,\"\",VLOOKUP($D7,invullijst!$A$11:$M$185,7,FALSE))","v":74},null,2,{"$f":"IF($O$3=\"k\",IF(VLOOKUP($L7,invullijst!$A$11:$M$185,11,FALSE)=0,\" \",VLOOKUP($L7,invullijst!$A$11:$M$185,11,FALSE)),\"\")","v":""},{"$f":"IF(VLOOKUP($L7,invullijst!$A$11:$M$226,4,FALSE)=\"\",\"\",VLOOKUP($L7,invullijst!$A$11:$M$226,4,FALSE))","v":"vr"},207,{"$f":"IF(VLOOKUP($L7,invullijst!$A$11:$M$185,2,FALSE)=\"\",\"\",VLOOKUP($L7,invullijst!$A$11:$M$185,2,FALSE))","v":"Max de Louw"},null,{"$f":"IF(VLOOKUP($L7,invullijst!$A$11:$M$185,7,FALSE)=0,\"\",VLOOKUP($L7,invullijst!$A$11:$M$185,7,FALSE))","v":88}]
[3,{"$f":"IF($G$3=\"k\",IF(VLOOKUP($D8,invullijst!$A$11:$M$185,11,FALSE)=0,\" \",VLOOKUP($D8,invullijst!$A$11:$M$185,11,FALSE)),\"\")","v":""},{"$f":"IF(VLOOKUP(D8,invullijst!A$11:F$226,4,FALSE)=\"\",\"\",VLOOKUP(D8,invullijst!A$11:D$226,4,FALSE))","v":"vr"},512,{"$f":"IF(VLOOKUP($D8,invullijst!$A$11:$M$185,2,FALSE)=\"\",\"\",VLOOKUP($D8,invullijst!$A$11:$M$185,2,FALSE))","v":"Hans Bergakker"},null,{"$f":"IF(VLOOKUP($D8,invullijst!$A$11:$M$185,7,FALSE)=0,\"\",VLOOKUP($D8,invullijst!$A$11:$M$185,7,FALSE))","v":78},null,3,{"$f":"IF($O$3=\"k\",IF(VLOOKUP($L8,invullijst!$A$11:$M$185,11,FALSE)=0,\" \",VLOOKUP($L8,invullijst!$A$11:$M$185,11,FALSE)),\"\")","v":""},{"$f":"IF(VLOOKUP($L8,invullijst!$A$11:$M$226,4,FALSE)=\"\",\"\",VLOOKUP($L8,invullijst!$A$11:$M$226,4,FALSE))","v":"vr"},216,{"$f":"IF(VLOOKUP($L8,invullijst!$A$11:$M$185,2,FALSE)=\"\",\"\",VLOOKUP($L8,invullijst!$A$11:$M$185,2,FALSE))","v":"Pieter Laghuwitz"},null,{"$f":"IF(VLOOKUP($L8,invullijst!$A$11:$M$185,7,FALSE)=0,\"\",VLOOKUP($L8,invullijst!$A$11:$M$185,7,FALSE))","v":87}]
[4,{"$f":"IF($G$3=\"k\",IF(VLOOKUP($D9,invullijst!$A$11:$M$185,11,FALSE)=0,\" \",VLOOKUP($D9,invullijst!$A$11:$M$185,11,FALSE)),\"\")","v":""},{"$f":"IF(VLOOKUP(D9,invullijst!A$11:F$226,4,FALSE)=\"\",\"\",VLOOKUP(D9,invullijst!A$11:D$226,4,FALSE))","v":"vr"},501,{"$f":"IF(VLOOKUP($D9,invullijst!$A$11:$M$185,2,FALSE)=\"\",\"\",VLOOKUP($D9,invullijst!$A$11:$M$185,2,FALSE))","v":"Annette Vos"},null,{"$f":"IF(VLOOKUP($D9,invullijst!$A$11:$M$185,7,FALSE)=0,\"\",VLOOKUP($D9,invullijst!$A$11:$M$185,7,FALSE))","v":78},null,4,{"$f":"IF($O$3=\"k\",IF(VLOOKUP($L9,invullijst!$A$11:$M$185,11,FALSE)=0,\" \",VLOOKUP($L9,invullijst!$A$11:$M$185,11,FALSE)),\"\")","v":""},{"$f":"IF(VLOOKUP($L9,invullijst!$A$11:$M$226,4,FALSE)=\"\",\"\",VLOOKUP($L9,invullijst!$A$11:$M$226,4,FALSE))","v":"vr"},204,{"$f":"IF(VLOOKUP($L9,invullijst!$A$11:$M$185,2,FALSE)=\"\",\"\",VLOOKUP($L9,invullijst!$A$11:$M$185,2,FALSE))","v":"Harry de Louw"},null,{"$f":"IF(VLOOKUP($L9,invullijst!$A$11:$M$185,7,FALSE)=0,\"\",VLOOKUP($L9,invullijst!$A$11:$M$185,7,FALSE))","v":85}]
["Totaal A korps",{"$nulls":5},{"$f":"SUM(G6:G9)","v":311},null,"Totaal A korps",{"$nulls":5},{"$f":"SUM(O6:O9)","v":347}]
[]
[1,{"$f":"IF($G$3=\"k\",IF(VLOOKUP($D12,invullijst!$A$11:$M$185,11,FALSE)=0,\" \",VLOOKUP($D12,invullijst!$A$11:$M$185,11,FALSE)),\"\")","v":""},{"$f":"IF(VLOOKUP(D12,invullijst!A$11:F$226,4,FALSE)=\"\",\"\",VLOOKUP(D12,invullijst!A$11:D$226,4,FALSE))","v":"vr"},517,{"$f":"IF(VLOOKUP($D12,invullijst!$A$11:$M$185,2,FALSE)=\"\",\"\",VLOOKUP($D12,invullijst!$A$11:$M$185,2,FALSE))","v":"Diny Vos"},null,{"$f":"IF(VLOOKUP($D12,invullijst!$A$11:$M$185,7,FALSE)=0,\"\",VLOOKUP($D12,invullijst!$A$11:$M$185,7,FALSE))","v":75},null,1,{"$f":"IF($O$3=\"k\",IF(VLOOKUP($L12,invullijst!$A$11:$M$185,11,FALSE)=0,\" \",VLOOKUP($L12,invullijst!$A$11:$M$185,11,FALSE)),\"\")","v":""},{"$f":"IF(VLOOKUP($L12,invullijst!$A$11:$M$226,4,FALSE)=\"\",\"\",VLOOKUP($L12,invullijst!$A$11:$M$226,4,FALSE))","v":"vr"},203,{"$f":"IF(VLOOKUP($L12,invullijst!$A$11:$M$185,2,FALSE)=\"\",\"\",VLOOKUP($L12,invullijst!$A$11:$M$185,2,FALSE))","v":"Frank van den Houdt"},null,{"$f":"IF(VLOOKUP($L12,invullijst!$A$11:$M$185,7,FALSE)=0,\"\",VLOOKUP($L12,invullijst!$A$11:$M$185,7,FALSE))","v":84}]
[2,{"$f":"IF($G$3=\"k\",IF(VLOOKUP($D13,invullijst!$A$11:$M$185,11,FALSE)=0,\" \",VLOOKUP($D13,invullijst!$A$11:$M$185,11,FALSE)),\"\")","v":""},{"$f":"IF(VLOOKUP(D13,invullijst!A$11:F$226,4,FALSE)=\"\",\"\",VLOOKUP(D13,invullijst!A$11:D$226,4,FALSE))","v":"vr"},508,{"$f":"IF(VLOOKUP($D13,invullijst!$A$11:$M$185,2,FALSE)=\"\",\"\",VLOOKUP($D13,invullijst!$A$11:$M$185,2,FALSE))","v":"Rowan Dobbelsteen"},null,{"$f":"IF(VLOOKUP($D13,invullijst!$A$11:$M$185,7,FALSE)=0,\"\",VLOOKUP($D13,invullijst!$A$11:$M$185,7,FALSE))","v":75},null,2,{"$f":"IF($O$3=\"k\",IF(VLOOKUP($L13,invullijst!$A$11:$M$185,11,FALSE)=0,\" \",VLOOKUP($L13,invullijst!$A$11:$M$185,11,FALSE)),\"\")","v":""},{"$f":"IF(VLOOKUP($L13,invullijst!$A$11:$M$226,4,FALSE)=\"\",\"\",VLOOKUP($L13,invullijst!$A$11:$M$226,4,FALSE))","v":"vr"},205,{"$f":"IF(VLOOKUP($L13,invullijst!$A$11:$M$185,2,FALSE)=\"\",\"\",VLOOKUP($L13,invullijst!$A$11:$M$185,2,FALSE))","v":"Jos v/d Snepscheut"},null,{"$f":"IF(VLOOKUP($L13,invullijst!$A$11:$M$185,7,FALSE)=0,\"\",VLOOKUP($L13,invullijst!$A$11:$M$185,7,FALSE))","v":80}]
[3,{"$f":"IF($G$3=\"k\",IF(VLOOKUP($D14,invullijst!$A$11:$M$185,11,FALSE)=0,\" \",VLOOKUP($D14,invullijst!$A$11:$M$185,11,FALSE)),\"\")","v":""},{"$f":"IF(VLOOKUP(D14,invullijst!A$11:F$226,4,FALSE)=\"\",\"\",VLOOKUP(D14,invullijst!A$11:D$226,4,FALSE))","v":"vr"},513,{"$f":"IF(VLOOKUP($D14,invullijst!$A$11:$M$185,2,FALSE)=\"\",\"\",VLOOKUP($D14,invullijst!$A$11:$M$185,2,FALSE))","v":"Mark van Delft"},null,{"$f":"IF(VLOOKUP($D14,invullijst!$A$11:$M$185,7,FALSE)=0,\"\",VLOOKUP($D14,invullijst!$A$11:$M$185,7,FALSE))","v":77},null,3,{"$f":"IF($O$3=\"k\",IF(VLOOKUP($L14,invullijst!$A$11:$M$185,11,FALSE)=0,\" \",VLOOKUP($L14,invullijst!$A$11:$M$185,11,FALSE)),\"\")","v":""},{"$f":"IF(VLOOKUP($L14,invullijst!$A$11:$M$226,4,FALSE)=\"\",\"\",VLOOKUP($L14,invullijst!$A$11:$M$226,4,FALSE))","v":"vr"},209,{"$f":"IF(VLOOKUP($L14,invullijst!$A$11:$M$185,2,FALSE)=\"\",\"\",VLOOKUP($L14,invullijst!$A$11:$M$185,2,FALSE))","v":"René van Kuijk"},null,{"$f":"IF(VLOOKUP($L14,invullijst!$A$11:$M$185,7,FALSE)=0,\"\",VLOOKUP($L14,invullijst!$A$11:$M$185,7,FALSE))","v":82}]
[4,{"$f":"IF($G$3=\"k\",IF(VLOOKUP($D15,invullijst!$A$11:$M$185,11,FALSE)=0,\" \",VLOOKUP($D15,invullijst!$A$11:$M$185,11,FALSE)),\"\")","v":""},{"$f":"IF(VLOOKUP(D15,invullijst!A$11:F$226,4,FALSE)=\"\",\"\",VLOOKUP(D15,invullijst!A$11:D$226,4,FALSE))","v":0},null,{"$f":"IF(VLOOKUP($D15,invullijst!$A$11:$M$185,2,FALSE)=\"\",\"\",VLOOKUP($D15,invullijst!$A$11:$M$185,2,FALSE))","v":0},null,{"$f":"IF(VLOOKUP($D15,invullijst!$A$11:$M$185,7,FALSE)=0,\"\",VLOOKUP($D15,invullijst!$A$11:$M$185,7,FALSE))","v":""},null,4,{"$f":"IF($O$3=\"k\",IF(VLOOKUP($L15,invullijst!$A$11:$M$185,11,FALSE)=0,\" \",VLOOKUP($L15,invullijst!$A$11:$M$185,11,FALSE)),\"\")","v":""},{"$f":"IF(VLOOKUP($L15,invullijst!$A$11:$M$226,4,FALSE)=\"\",\"\",VLOOKUP($L15,invullijst!$A$11:$M$226,4,FALSE))","v":"vr"},208,{"$f":"IF(VLOOKUP($L15,invullijst!$A$11:$M$185,2,FALSE)=\"\",\"\",VLOOKUP($L15,invullijst!$A$11:$M$185,2,FALSE))","v":"Erin van Hulten"},null,{"$f":"IF(VLOOKUP($L15,invullijst!$A$11:$M$185,7,FALSE)=0,\"\",VLOOKUP($L15,invullijst!$A$11:$M$185,7,FALSE))","v":82}]
["Totaal B1 korps",{"$nulls":5},{"$f":"SUM(G12:G15)","v":227},null,"Totaal B1 korps",{"$nulls":5},{"$f":"SUM(O12:O15)","v":328}]
[]
[1,{"$f":"IF($G$3=\"k\",IF(VLOOKUP($D18,invullijst!$A$11:$M$185,11,FALSE)=0,\" \",VLOOKUP($D18,invullijst!$A$11:$M$185,11,FALSE)),\"\")","v":""},{"$f":"IF(VLOOKUP(D18,invullijst!A$11:F$226,4,FALSE)=\"\",\"\",VLOOKUP(D18,invullijst!A$11:D$226,4,FALSE))","v":0},null,{"$f":"IF(VLOOKUP($D18,invullijst!$A$11:$M$185,2,FALSE)=\"\",\"\",VLOOKUP($D18,invullijst!$A$11:$M$185,2,FALSE))","v":0},null,{"$f":"IF(VLOOKUP($D18,invullijst!$A$11:$M$185,7,FALSE)=0,\"\",VLOOKUP($D18,invullijst!$A$11:$M$185,7,FALSE))","v":""},null,1,{"$f":"IF($O$3=\"k\",IF(VLOOKUP($L18,invullijst!$A$11:$M$185,11,FALSE)=0,\" \",VLOOKUP($L18,invullijst!$A$11:$M$185,11,FALSE)),\"\")","v":""},{"$f":"IF(VLOOKUP($L18,invullijst!$A$11:$M$226,4,FALSE)=\"\",\"\",VLOOKUP($L18,invullijst!$A$11:$M$226,4,FALSE))","v":"vr"},213,{"$f":"IF(VLOOKUP($L18,invullijst!$A$11:$M$185,2,FALSE)=\"\",\"\",VLOOKUP($L18,invullijst!$A$11:$M$185,2,FALSE))","v":"Roland van Delft"},null,{"$f":"IF(VLOOKUP($L18,invullijst!$A$11:$M$185,7,FALSE)=0,\"\",VLOOKUP($L18,invullijst!$A$11:$M$185,7,FALSE))","v":71}]
[2,{"$f":"IF($G$3=\"k\",IF(VLOOKUP($D19,invullijst!$A$11:$M$185,11,FALSE)=0,\" \",VLOOKUP($D19,invullijst!$A$11:$M$185,11,FALSE)),\"\")","v":""},{"$f":"IF(VLOOKUP(D19,invullijst!A$11:F$226,4,FALSE)=\"\",\"\",VLOOKUP(D19,invullijst!A$11:D$226,4,FALSE))","v":0},null,{"$f":"IF(VLOOKUP($D19,invullijst!$A$11:$M$185,2,FALSE)=\"\",\"\",VLOOKUP($D19,invullijst!$A$11:$M$185,2,FALSE))","v":0},null,{"$f":"IF(VLOOKUP($D19,invullijst!$A$11:$M$185,7,FALSE)=0,\"\",VLOOKUP($D19,invullijst!$A$11:$M$185,7,FALSE))","v":""},null,2,{"$f":"IF($O$3=\"k\",IF(VLOOKUP($L19,invullijst!$A$11:$M$185,11,FALSE)=0,\" \",VLOOKUP($L19,invullijst!$A$11:$M$185,11,FALSE)),\"\")","v":""},{"$f":"IF(VLOOKUP($L19,invullijst!$A$11:$M$226,4,FALSE)=\"\",\"\",VLOOKUP($L19,invullijst!$A$11:$M$226,4,FALSE))","v":"vr"},217,{"$f":"IF(VLOOKUP($L19,invullijst!$A$11:$M$185,2,FALSE)=\"\",\"\",VLOOKUP($L19,invullijst!$A$11:$M$185,2,FALSE))","v":"Hans Laghuwitz"},null,{"$f":"IF(VLOOKUP($L19,invullijst!$A$11:$M$185,7,FALSE)=0,\"\",VLOOKUP($L19,invullijst!$A$11:$M$185,7,FALSE))","v":81}]
[3,"INH",{"$f":"IF(VLOOKUP(D20,invullijst!A$11:F$226,4,FALSE)=\"\",\"\",VLOOKUP(D20,invullijst!A$11:D$226,4,FALSE))","v":"vr"},507,{"$f":"IF(VLOOKUP($D20,invullijst!$A$11:$M$185,2,FALSE)=\"\",\"\",VLOOKUP($D20,invullijst!$A$11:$M$185,2,FALSE))","v":"Michael Blaauwbroek"},null,76,null,3,{"$f":"IF($O$3=\"k\",IF(VLOOKUP($L20,invullijst!$A$11:$M$185,11,FALSE)=0,\" \",VLOOKUP($L20,invullijst!$A$11:$M$185,11,FALSE)),\"\")","v":""},{"$f":"IF(VLOOKUP($L20,invullijst!$A$11:$M$226,4,FALSE)=\"\",\"\",VLOOKUP($L20,invullijst!$A$11:$M$226,4,FALSE))","v":"vr"},222,{"$f":"IF(VLOOKUP($L20,invullijst!$A$11:$M$185,2,FALSE)=\"\",\"\",VLOOKUP($L20,invullijst!$A$11:$M$185,2,FALSE))","v":"Nick de Vaan"},null,{"$f":"IF(VLOOKUP($L20,invullijst!$A$11:$M$185,7,FALSE)=0,\"\",VLOOKUP($L20,invullijst!$A$11:$M$185,7,FALSE))","v":75}]
[4,"INH",{"$f":"IF(VLOOKUP(D21,invullijst!A$11:F$226,4,FALSE)=\"\",\"\",VLOOKUP(D21,invullijst!A$11:D$226,4,FALSE))","v":"vr"},501,{"$f":"IF(VLOOKUP($D21,invullijst!$A$11:$M$185,2,FALSE)=\"\",\"\",VLOOKUP($D21,invullijst!$A$11:$M$185,2,FALSE))","v":"Annette Vos"},null,85,null,4,{"$f":"IF($O$3=\"k\",IF(VLOOKUP($L21,invullijst!$A$11:$M$185,11,FALSE)=0,\" \",VLOOKUP($L21,invullijst!$A$11:$M$185,11,FALSE)),\"\")","v":""},{"$f":"IF(VLOOKUP($L21,invullijst!$A$11:$M$226,4,FALSE)=\"\",\"\",VLOOKUP($L21,invullijst!$A$11:$M$226,4,FALSE))","v":"vr"},202,{"$f":"IF(VLOOKUP($L21,invullijst!$A$11:$M$185,2,FALSE)=\"\",\"\",VLOOKUP($L21,invullijst!$A$11:$M$185,2,FALSE))","v":"Arco van Kuijk"},null,{"$f":"IF(VLOOKUP($L21,invullijst!$A$11:$M$185,7,FALSE)=0,\"\",VLOOKUP($L21,invullijst!$A$11:$M$185,7,FALSE))","v":81}]
["DIVERSE / INHAAL",{"$nulls":7},"DIVERSE / INHAAL",{"$nulls":5},{"$f":"SUM(O18:O21)","v":308}]
[]
["OPGELEGD (Jeugd <16 en 65+)"]
[1,{"$f":"IF($G$3=\"k\",IF(VLOOKUP($D25,invullijst!$A$11:$M$185,11,FALSE)=0,\" \",VLOOKUP($D25,invullijst!$A$11:$M$185,11,FALSE)),\"\")","v":""},{"$f":"IF(VLOOKUP(D25,invullijst!A$11:F$226,4,FALSE)=\"\",\"\",VLOOKUP(D25,invullijst!A$11:D$226,4,FALSE))","v":"65+"},516,{"$f":"IF(VLOOKUP($D25,invullijst!$A$11:$M$185,2,FALSE)=\"\",\"\",VLOOKUP($D25,invullijst!$A$11:$M$185,2,FALSE))","v":"Henry Bergakker disp"},null,{"$f":"IF(VLOOKUP($D25,invullijst!$A$11:$M$185,7,FALSE)=0,\"\",VLOOKUP($D25,invullijst!$A$11:$M$185,7,FALSE))","v":92},null,1,{"$f":"IF($O$3=\"k\",IF(VLOOKUP($L25,invullijst!$A$11:$M$185,11,FALSE)=0,\" \",VLOOKUP($L25,invullijst!$A$11:$M$185,11,FALSE)),\"\")","v":""},{"$f":"IF(VLOOKUP($L25,invullijst!$A$11:$M$226,4,FALSE)=\"\",\"\",VLOOKUP($L25,invullijst!$A$11:$M$226,4,FALSE))","v":"65+"},218,{"$f":"IF(VLOOKUP($L25,invullijst!$A$11:$M$185,2,FALSE)=\"\",\"\",VLOOKUP($L25,invullijst!$A$11:$M$185,2,FALSE))","v":"Jacob van de Werken"},null,{"$f":"IF(VLOOKUP($L25,invullijst!$A$11:$M$185,7,FALSE)=0,\"\",VLOOKUP($L25,invullijst!$A$11:$M$185,7,FALSE))","v":97}]
[2,{"$f":"IF($G$3=\"k\",IF(VLOOKUP($D26,invullijst!$A$11:$M$185,11,FALSE)=0,\" \",VLOOKUP($D26,invullijst!$A$11:$M$185,11,FALSE)),\"\")","v":""},{"$f":"IF(VLOOKUP(D26,invullijst!A$11:F$226,4,FALSE)=\"\",\"\",VLOOKUP(D26,invullijst!A$11:D$226,4,FALSE))","v":"65+"},509,{"$f":"IF(VLOOKUP($D26,invullijst!$A$11:$M$185,2,FALSE)=\"\",\"\",VLOOKUP($D26,invullijst!$A$11:$M$185,2,FALSE))","v":"Adwan de Pinth"},null,{"$f":"IF(VLOOKUP($D26,invullijst!$A$11:$M$185,7,FALSE)=0,\"\",VLOOKUP($D26,invullijst!$A$11:$M$185,7,FALSE))","v":94},null,2,{"$f":"IF($O$3=\"k\",IF(VLOOKUP($L26,invullijst!$A$11:$M$185,11,FALSE)=0,\" \",VLOOKUP($L26,invullijst!$A$11:$M$185,11,FALSE)),\"\")","v":""},{"$f":"IF(VLOOKUP($L26,invullijst!$A$11:$M$226,4,FALSE)=\"\",\"\",VLOOKUP($L26,invullijst!$A$11:$M$226,4,FALSE))","v":"65+"},220,{"$f":"IF(VLOOKUP($L26,invullijst!$A$11:$M$185,2,FALSE)=\"\",\"\",VLOOKUP($L26,invullijst!$A$11:$M$185,2,FALSE))","v":"Kees Vos"},null,{"$f":"IF(VLOOKUP($L26,invullijst!$A$11:$M$185,7,FALSE)=0,\"\",VLOOKUP($L26,invullijst!$A$11:$M$185,7,FALSE))","v":93}]
[3,{"$f":"IF($G$3=\"k\",IF(VLOOKUP($D27,invullijst!$A$11:$M$185,11,FALSE)=0,\" \",VLOOKUP($D27,invullijst!$A$11:$M$185,11,FALSE)),\"\")","v":""},{"$f":"IF(VLOOKUP(D27,invullijst!A$11:F$226,4,FALSE)=\"\",\"\",VLOOKUP(D27,invullijst!A$11:D$226,4,FALSE))","v":"65+"},515,{"$f":"IF(VLOOKUP($D27,invullijst!$A$11:$M$185,2,FALSE)=\"\",\"\",VLOOKUP($D27,invullijst!$A$11:$M$185,2,FALSE))","v":"Ilona Bergakker disp"},null,{"$f":"IF(VLOOKUP($D27,invullijst!$A$11:$M$185,7,FALSE)=0,\"\",VLOOKUP($D27,invullijst!$A$11:$M$185,7,FALSE))","v":87},null,3,{"$f":"IF($O$3=\"k\",IF(VLOOKUP($L27,invullijst!$A$11:$M$185,11,FALSE)=0,\" \",VLOOKUP($L27,invullijst!$A$11:$M$185,11,FALSE)),\"\")","v":""},{"$f":"IF(VLOOKUP($L27,invullijst!$A$11:$M$226,4,FALSE)=\"\",\"\",VLOOKUP($L27,invullijst!$A$11:$M$226,4,FALSE))","v":"65+"},219,{"$f":"IF(VLOOKUP($L27,invullijst!$A$11:$M$185,2,FALSE)=\"\",\"\",VLOOKUP($L27,invullijst!$A$11:$M$185,2,FALSE))","v":"Frans de Bont"},null,{"$f":"IF(VLOOKUP($L27,invullijst!$A$11:$M$185,7,FALSE)=0,\"\",VLOOKUP($L27,invullijst!$A$11:$M$185,7,FALSE))","v":93}]
["Totaal korps opgelegd A1",{"$nulls":5},{"$f":"SUM(G25:G27)","v":273},null,"Totaal korps opgelegd A1",{"$nulls":5},{"$f":"SUM(O25:O27)","v":283}]
[]
[1,{"$f":"IF($G$3=\"k\",IF(VLOOKUP($D30,invullijst!$A$11:$M$185,11,FALSE)=0,\" \",VLOOKUP($D30,invullijst!$A$11:$M$185,11,FALSE)),\"\")","v":""},{"$f":"IF(VLOOKUP(D30,invullijst!A$11:F$226,4,FALSE)=\"\",\"\",VLOOKUP(D30,invullijst!A$11:D$226,4,FALSE))","v":"65+"},518,{"$f":"IF(VLOOKUP($D30,invullijst!$A$11:$M$185,2,FALSE)=\"\",\"\",VLOOKUP($D30,invullijst!$A$11:$M$185,2,FALSE))","v":"Ton Stanz"},null,{"$f":"IF(VLOOKUP($D30,invullijst!$A$11:$M$185,7,FALSE)=0,\"\",VLOOKUP($D30,invullijst!$A$11:$M$185,7,FALSE))","v":84},null,1,{"$f":"IF($O$3=\"k\",IF(VLOOKUP($L30,invullijst!$A$11:$M$185,11,FALSE)=0,\" \",VLOOKUP($L30,invullijst!$A$11:$M$185,11,FALSE)),\"\")","v":""},{"$f":"IF(VLOOKUP($L30,invullijst!$A$11:$M$226,4,FALSE)=\"\",\"\",VLOOKUP($L30,invullijst!$A$11:$M$226,4,FALSE))","v":"65+"},214,{"$f":"IF(VLOOKUP($L30,invullijst!$A$11:$M$185,2,FALSE)=\"\",\"\",VLOOKUP($L30,invullijst!$A$11:$M$185,2,FALSE))","v":"Andre de Vaan"},null,{"$f":"IF(VLOOKUP($L30,invullijst!$A$11:$M$185,7,FALSE)=0,\"\",VLOOKUP($L30,invullijst!$A$11:$M$185,7,FALSE))","v":86}]
[2,{"$f":"IF($G$3=\"k\",IF(VLOOKUP($D31,invullijst!$A$11:$M$185,11,FALSE)=0,\" \",VLOOKUP($D31,invullijst!$A$11:$M$185,11,FALSE)),\"\")","v":""},{"$f":"IF(VLOOKUP(D31,invullijst!A$11:F$226,4,FALSE)=\"\",\"\",VLOOKUP(D31,invullijst!A$11:D$226,4,FALSE))","v":0},null,{"$f":"IF(VLOOKUP($D31,invullijst!$A$11:$M$185,2,FALSE)=\"\",\"\",VLOOKUP($D31,invullijst!$A$11:$M$185,2,FALSE))","v":0},null,{"$f":"IF(VLOOKUP($D31,invullijst!$A$11:$M$185,7,FALSE)=0,\"\",VLOOKUP($D31,invullijst!$A$11:$M$185,7,FALSE))","v":""},null,2,{"$f":"IF($O$3=\"k\",IF(VLOOKUP($L31,invullijst!$A$11:$M$185,11,FALSE)=0,\" \",VLOOKUP($L31,invullijst!$A$11:$M$185,11,FALSE)),\"\")","v":""},{"$f":"IF(VLOOKUP($L31,invullijst!$A$11:$M$226,4,FALSE)=\"\",\"\",VLOOKUP($L31,invullijst!$A$11:$M$226,4,FALSE))","v":"65+"},212,{"$f":"IF(VLOOKUP($L31,invullijst!$A$11:$M$185,2,FALSE)=\"\",\"\",VLOOKUP($L31,invullijst!$A$11:$M$185,2,FALSE))","v":"René Duquesnoy"},null,{"$f":"IF(VLOOKUP($L31,invullijst!$A$11:$M$185,7,FALSE)=0,\"\",VLOOKUP($L31,invullijst!$A$11:$M$185,7,FALSE))","v":80}]
[3,{"$f":"IF($G$3=\"k\",IF(VLOOKUP($D32,invullijst!$A$11:$M$185,11,FALSE)=0,\" \",VLOOKUP($D32,invullijst!$A$11:$M$185,11,FALSE)),\"\")","v":""},{"$f":"IF(VLOOKUP(D32,invullijst!A$11:F$226,4,FALSE)=\"\",\"\",VLOOKUP(D32,invullijst!A$11:D$226,4,FALSE))","v":0},null,{"$f":"IF(VLOOKUP($D32,invullijst!$A$11:$M$185,2,FALSE)=\"\",\"\",VLOOKUP($D32,invullijst!$A$11:$M$185,2,FALSE))","v":0},null,{"$f":"IF(VLOOKUP($D32,invullijst!$A$11:$M$185,7,FALSE)=0,\"\",VLOOKUP($D32,invullijst!$A$11:$M$185,7,FALSE))","v":""},null,3,{"$f":"IF($O$3=\"k\",IF(VLOOKUP($L32,invullijst!$A$11:$M$185,11,FALSE)=0,\" \",VLOOKUP($L32,invullijst!$A$11:$M$185,11,FALSE)),\"\")","v":""},{"$f":"IF(VLOOKUP($L32,invullijst!$A$11:$M$226,4,FALSE)=\"\",\"\",VLOOKUP($L32,invullijst!$A$11:$M$226,4,FALSE))","v":"65+"},211,{"$f":"IF(VLOOKUP($L32,invullijst!$A$11:$M$185,2,FALSE)=\"\",\"\",VLOOKUP($L32,invullijst!$A$11:$M$185,2,FALSE))","v":"Ad van den houdt"},null,{"$f":"IF(VLOOKUP($L32,invullijst!$A$11:$M$185,7,FALSE)=0,\"\",VLOOKUP($L32,invullijst!$A$11:$M$185,7,FALSE))","v":91}]
["Totaal korps opgelegd A2",{"$nulls":5},{"$f":"SUM(G30:G32)","v":84},null,"Totaal korps opgelegd A2",{"$nulls":5},{"$f":"SUM(O30:O32)","v":257}]
[]
[1,{"$f":"IF($G$3=\"k\",IF(VLOOKUP($D35,invullijst!$A$11:$M$185,11,FALSE)=0,\" \",VLOOKUP($D35,invullijst!$A$11:$M$185,11,FALSE)),\"\")","v":""},{"$f":"IF(VLOOKUP(D35,invullijst!A$11:F$226,4,FALSE)=\"\",\"\",VLOOKUP(D35,invullijst!A$11:D$226,4,FALSE))","v":0},null,{"$f":"IF(VLOOKUP($D35,invullijst!$A$11:$M$185,2,FALSE)=\"\",\"\",VLOOKUP($D35,invullijst!$A$11:$M$185,2,FALSE))","v":0},null,{"$f":"IF(VLOOKUP($D35,invullijst!$A$11:$M$185,7,FALSE)=0,\"\",VLOOKUP($D35,invullijst!$A$11:$M$185,7,FALSE))","v":""},null,1,{"$f":"IF($O$3=\"k\",IF(VLOOKUP($L35,invullijst!$A$11:$M$185,11,FALSE)=0,\" \",VLOOKUP($L35,invullijst!$A$11:$M$185,11,FALSE)),\"\")","v":""},{"$f":"IF(VLOOKUP($L35,invullijst!$A$11:$M$226,4,FALSE)=\"\",\"\",VLOOKUP($L35,invullijst!$A$11:$M$226,4,FALSE))","v":"J"},221,{"$f":"IF(VLOOKUP($L35,invullijst!$A$11:$M$185,2,FALSE)=\"\",\"\",VLOOKUP($L35,invullijst!$A$11:$M$185,2,FALSE))","v":"Mees Huijben"},null,{"$f":"IF(VLOOKUP($L35,invullijst!$A$11:$M$185,7,FALSE)=0,\"\",VLOOKUP($L35,invullijst!$A$11:$M$185,7,FALSE))","v":79}]
[2,{"$f":"IF($G$3=\"k\",IF(VLOOKUP($D36,invullijst!$A$11:$M$185,11,FALSE)=0,\" \",VLOOKUP($D36,invullijst!$A$11:$M$185,11,FALSE)),\"\")","v":""},{"$f":"IF(VLOOKUP(D36,invullijst!A$11:F$226,4,FALSE)=\"\",\"\",VLOOKUP(D36,invullijst!A$11:D$226,4,FALSE))","v":0},null,{"$f":"IF(VLOOKUP($D36,invullijst!$A$11:$M$185,2,FALSE)=\"\",\"\",VLOOKUP($D36,invullijst!$A$11:$M$185,2,FALSE))","v":0},null,{"$f":"IF(VLOOKUP($D36,invullijst!$A$11:$M$185,7,FALSE)=0,\"\",VLOOKUP($D36,invullijst!$A$11:$M$185,7,FALSE))","v":""},null,2,{"$f":"IF($O$3=\"k\",IF(VLOOKUP($L36,invullijst!$A$11:$M$185,11,FALSE)=0,\" \",VLOOKUP($L36,invullijst!$A$11:$M$185,11,FALSE)),\"\")","v":""},{"$f":"IF(VLOOKUP($L36,invullijst!$A$11:$M$226,4,FALSE)=\"\",\"\",VLOOKUP($L36,invullijst!$A$11:$M$226,4,FALSE))","v":"vr"},223,{"$f":"IF(VLOOKUP($L36,invullijst!$A$11:$M$185,2,FALSE)=\"\",\"\",VLOOKUP($L36,invullijst!$A$11:$M$185,2,FALSE))","v":"Jänis Jakobsons"},null,{"$f":"IF(VLOOKUP($L36,invullijst!$A$11:$M$185,7,FALSE)=0,\"\",VLOOKUP($L36,invullijst!$A$11:$M$185,7,FALSE))","v":81}]
[3,{"$f":"IF($G$3=\"k\",IF(VLOOKUP($D37,invullijst!$A$11:$M$185,11,FALSE)=0,\" \",VLOOKUP($D37,invullijst!$A$11:$M$185,11,FALSE)),\"\")","v":""},{"$f":"IF(VLOOKUP(D37,invullijst!A$11:F$226,4,FALSE)=\"\",\"\",VLOOKUP(D37,invullijst!A$11:D$226,4,FALSE))","v":0},null,{"$f":"IF(VLOOKUP($D37,invullijst!$A$11:$M$185,2,FALSE)=\"\",\"\",VLOOKUP($D37,invullijst!$A$11:$M$185,2,FALSE))","v":0},null,{"$f":"IF(VLOOKUP($D37,invullijst!$A$11:$M$185,7,FALSE)=0,\"\",VLOOKUP($D37,invullijst!$A$11:$M$185,7,FALSE))","v":""},null,3,{"$f":"IF($O$3=\"k\",IF(VLOOKUP($L37,invullijst!$A$11:$M$185,11,FALSE)=0,\" \",VLOOKUP($L37,invullijst!$A$11:$M$185,11,FALSE)),\"\")","v":""},{"$f":"IF(VLOOKUP($L37,invullijst!$A$11:$M$226,4,FALSE)=\"\",\"\",VLOOKUP($L37,invullijst!$A$11:$M$226,4,FALSE))","v":0},null,{"$f":"IF(VLOOKUP($L37,invullijst!$A$11:$M$185,2,FALSE)=\"\",\"\",VLOOKUP($L37,invullijst!$A$11:$M$185,2,FALSE))","v":0},null,{"$f":"IF(VLOOKUP($L37,invullijst!$A$11:$M$185,7,FALSE)=0,\"\",VLOOKUP($L37,invullijst!$A$11:$M$185,7,FALSE))","v":""}]
["Totaal korps opgelegd A3",{"$nulls":5},{"$f":"SUM(G35:G37)","v":0},null,"Totaal korps opgelegd A3"]

{"sheet":"wedstrijd 3A","index":9,"n_rows":38,"n_cols":15,"rows_kept":38,"merged":[[0,0,0,4],[0,5,0,7],[0,8,0,14],[1,0,1,11],[1,12,1,14],[2,1,2,5],[2,9,2,13],[4,0,4,14],[5,4,5,5],[5,12,5,13],[6,4,6,5],[6,12,6,13],[7,4,7,5],[7,12,7,13],[8,4,8,5],[8,12,8,13],[9,0,9,5],[9,8,9,13],[11,4,11,5],[11,12,11,13],[12,4,12,5],[12,12,12,13],[13,4,13,5],[13,12,13,13],[14,4,14,5],[14,12,14,13],[15,0,15,5],[15,8,15,13],[17,4,17,5],[17,12,17,13],[18,4,18,5],[18,12,18,13],[19,4,19,5],[19,12,19,13],[20,4,20,5],[20,12,20,13],[21,0,21,5],[21,8,21,13],[23,0,23,14],[24,4,24,5],[24,12,24,13],[25,4,25,5],[25,12,25,13],[26,4,26,5],[26,12,26,13],[27,0,27,5],[27,8,27,13],[29,4,29,5],[29,12,29,13],[30,4,30,5],[30,12,30,13],[31,4,31,5],[31,12,31,13],[32,0,32,5],[32,8,32,13],[34,4,34,5],[34,12,34,13],[35,4,35,5],[35,12,35,13],[36,4,36,5],[36,12,36,13],[37,0,37,5],[37,8,37,13]]}
[{"$f":"invullijst!F1","v":"Organistatie"},{"$nulls":4},{"$f":"invullijst!H2","v":"2024 - 2025"},null,null,{"$f":"invullijst!F3","v":"O.L.V. Schuts Elshout"}]
["Datum: ",{"$nulls":11},"2025-02-02"]
[2,{"$f":"IF(VLOOKUP(A3,invullijst!A1:F5,2,FALSE)=\"\",\"\",VLOOKUP(A3,invullijst!A1:F5,2,FALSE))","v":"St. Crispinus & Crispinianus Besoijen"},{"$nulls":4},"K",null,3,{"$f":"IF(VLOOKUP(I3,invullijst!A1:C5,2,FALSE)=\"\",\"\",VLOOKUP(I3,invullijst!A1:C5,2,FALSE))","v":"O.L.V. Schuts Elshout"},{"$nulls":4},"K"]
[]
["vrijehand"]
[1,{"$f":"IF($G$3=\"k\",IF(VLOOKUP($D6,invullijst!$A$11:$M$185,11,FALSE)=0,\" \",VLOOKUP($D6,invullijst!$A$11:$M$185,11,FALSE)),\"\")","v":40},{"$f":"IF(VLOOKUP(D6,invullijst!A$11:F$226,4,FALSE)=\"\",\"\",VLOOKUP(D6,invullijst!A$11:D$226,4,FALSE))","v":"vr"},210,{"$f":"IF(VLOOKUP($D6,invullijst!$A$11:$M$185,2,FALSE)=\"\",\"\",VLOOKUP($D6,invullijst!$A$11:$M$185,2,FALSE))","v":"Sander Oome"},null,{"$f":"IF(VLOOKUP($D6,invullijst!$A$11:$M$185,8,FALSE)=0,\"\",VLOOKUP($D6,invullijst!$A$11:$M$185,8,FALSE))","v":90},null,1,{"$f":"IF($O$3=\"k\",IF(VLOOKUP($L6,invullijst!$A$11:$M$185,11,FALSE)=0,\" \",VLOOKUP($L6,invullijst!$A$11:$M$185,11,FALSE)),\"\")","v":40},{"$f":"IF(VLOOKUP($L6,invullijst!$A$11:$M$226,4,FALSE)=\"\",\"\",VLOOKUP($L6,invullijst!$A$11:$M$226,4,FALSE))","v":"vr"},302,{"$f":"IF(VLOOKUP($L6,invullijst!$A$11:$M$185,2,FALSE)=\"\",\"\",VLOOKUP($L6,invullijst!$A$11:$M$185,2,FALSE))","v":"Freek de Jong"},null,{"$f":"IF(VLOOKUP($L6,invullijst!$A$11:$M$185,8,FALSE)=0,\"\",VLOOKUP($L6,invullijst!$A$11:$M$185,8,FALSE))","v":80}]
[2,{"$f":"IF($G$3=\"k\",IF(VLOOKUP($D7,invullijst!$A$11:$M$185,11,FALSE)=0,\" \",VLOOKUP($D7,invullijst!$A$11:$M$185,11,FALSE)),\"\")","v":45},{"$f":"IF(VLOOKUP(D7,invullijst!A$11:F$226,4,FALSE)=\"\",\"\",VLOOKUP(D7,invullijst!A$11:D$226,4,FALSE))","v":"vr"},216,{"$f":"IF(VLOOKUP($D7,invullijst!$A$11:$M$185,2,FALSE)=\"\",\"\",VLOOKUP($D7,invullijst!$A$11:$M$185,2,FALSE))","v":"Pieter Laghuwitz"},null,{"$f":"IF(VLOOKUP($D7,invullijst!$A$11:$M$185,8,FALSE)=0,\"\",VLOOKUP($D7,invullijst!$A$11:$M$185,8,FALSE))","v":86},null,2,{"$f":"IF($O$3=\"k\",IF(VLOOKUP($L7,invullijst!$A$11:$M$185,11,FALSE)=0,\" \",VLOOKUP($L7,invullijst!$A$11:$M$185,11,FALSE)),\"\")","v":42},{"$f":"IF(VLOOKUP($L7,invullijst!$A$11:$M$226,4,FALSE)=\"\",\"\",VLOOKUP($L7,invullijst!$A$11:$M$226,4,FALSE))","v":"vr"},305,{"$f":"IF(VLOOKUP($L7,invullijst!$A$11:$M$185,2,FALSE)=\"\",\"\",VLOOKUP($L7,invullijst!$A$11:$M$185,2,FALSE))","v":"Johan Klerx"},null,{"$f":"IF(VLOOKUP($L7,invullijst!$A$11:$M$185,8,FALSE)=0,\"\",VLOOKUP($L7,invullijst!$A$11:$M$185,8,FALSE))","v":86}]
[3,{"$f":"IF($G$3=\"k\",IF(VLOOKUP($D8,invullijst!$A$11:$M$185,11,FALSE)=0,\" \",VLOOKUP($D8,invullijst!$A$11:$M$185,11,FALSE)),\"\")","v":39},{"$f":"IF(VLOOKUP(D8,invullijst!A$11:F$226,4,FALSE)=\"\",\"\",VLOOKUP(D8,invullijst!A$11:D$226,4,FALSE))","v":"vr"},204,{"$f":"IF(VLOOKUP($D8,invullijst!$A$11:$M$185,2,FALSE)=\"\",\"\",VLOOKUP($D8,invullijst!$A$11:$M$185,2,FALSE))","v":"Harry de Louw"},null,{"$f":"IF(VLOOKUP($D8,invullijst!$A$11:$M$185,8,FALSE)=0,\"\",VLOOKUP($D8,invullijst!$A$11:$M$185,8,FALSE))","v":80},null,3,{"$f":"IF($O$3=\"k\",IF(VLOOKUP($L8,invullijst!$A$11:$M$185,11,FALSE)=0,\" \",VLOOKUP($L8,invullijst!$A$11:$M$185,11,FALSE)),\"\")","v":39},{"$f":"IF(VLOOKUP($L8,invullijst!$A$11:$M$226,4,FALSE)=\"\",\"\",VLOOKUP($L8,invullijst!$A$11:$M$226,4,FALSE))","v":"vr"},306,{"$f":"IF(VLOOKUP($L8,invullijst!$A$11:$M$185,2,FALSE)=\"\",\"\",VLOOKUP($L8,invullijst!$A$11:$M$185,2,FALSE))","v":"Ron Groot"},null,{"$f":"IF(VLOOKUP($L8,invullijst!$A$11:$M$185,8,FALSE)=0,\"\",VLOOKUP($L8,invullijst!$A$11:$M$185,8,FALSE))","v":89}]
[4,{"$f":"IF($G$3=\"k\",IF(VLOOKUP($D9,invullijst!$A$11:$M$185,11,FALSE)=0,\" \",VLOOKUP($D9,invullijst!$A$11:$M$185,11,FALSE)),\"\")","v":42},{"$f":"IF(VLOOKUP(D9,invullijst!A$11:F$226,4,FALSE)=\"\",\"\",VLOOKUP(D9,invullijst!A$11:D$226,4,FALSE))","v":"vr"},207,{"$f":"IF(VLOOKUP($D9,invullijst!$A$11:$M$185,2,FALSE)=\"\",\"\",VLOOKUP($D9,invullijst!$A$11:$M$185,2,FALSE))","v":"Max de Louw"},null,{"$f":"IF(VLOOKUP($D9,invullijst!$A$11:$M$185,8,FALSE)=0,\"\",VLOOKUP($D9,invullijst!$A$11:$M$185,8,FALSE))","v":92},null,4,{"$f":"IF($O$3=\"k\",IF(VLOOKUP($L9,invullijst!$A$11:$M$185,11,FALSE)=0,\" \",VLOOKUP($L9,invullijst!$A$11:$M$185,11,FALSE)),\"\")","v":43},{"$f":"IF(VLOOKUP($L9,invullijst!$A$11:$M$226,4,FALSE)=\"\",\"\",VLOOKUP($L9,invullijst!$A$11:$M$226,4,FALSE))","v":"vr"},304,{"$f":"IF(VLOOKUP($L9,invullijst!$A$11:$M$185,2,FALSE)=\"\",\"\",VLOOKUP($L9,invullijst!$A$11:$M$185,2,FALSE))","v":"Henk Bruurmijn "},null,{"$f":"IF(VLOOKUP($L9,invullijst!$A$11:$M$185,8,FALSE)=0,\"\",VLOOKUP($L9,invullijst!$A$11:$M$185,8,FALSE))","v":78}]
["Totaal A korps",{"$nulls":5},{"$f":"SUM(G6:G9)","v":348},null,"Totaal A korps",{"$nulls":5},{"$f":"SUM(O6:O9)","v":333}]
[]
[1,{"$f":"IF($G$3=\"k\",IF(VLOOKUP($D12,invullijst!$A$11:$M$185,11,FALSE)=0,\" \",VLOOKUP($D12,invullijst!$A$11:$M$185,11,FALSE)),\"\")","v":37},{"$f":"IF(VLOOKUP(D12,invullijst!A$11:F$226,4,FALSE)=\"\",\"\",VLOOKUP(D12,invullijst!A$11:D$226,4,FALSE))","v":"vr"},203,{"$f":"IF(VLOOKUP($D12,invullijst!$A$11:$M$185,2,FALSE)=\"\",\"\",VLOOKUP($D12,invullijst!$A$11:$M$185,2,FALSE))","v":"Frank van den Houdt"},null,{"$f":"IF(VLOOKUP($D12,invullijst!$A$11:$M$185,8,FALSE)=0,\"\",VLOOKUP($D12,invullijst!$A$11:$M$185,8,FALSE))","v":79},null,1,{"$f":"IF($O$3=\"k\",IF(VLOOKUP($L12,invullijst!$A$11:$M$185,11,FALSE)=0,\" \",VLOOKUP($L12,invullijst!$A$11:$M$185,11,FALSE)),\"\")","v":" "},{"$f":"IF(VLOOKUP($L12,invullijst!$A$11:$M$226,4,FALSE)=\"\",\"\",VLOOKUP($L12,invullijst!$A$11:$M$226,4,FALSE))","v":0},null,{"$f":"IF(VLOOKUP($L12,invullijst!$A$11:$M$185,2,FALSE)=\"\",\"\",VLOOKUP($L12,invullijst!$A$11:$M$185,2,FALSE))","v":0},null,{"$f":"IF(VLOOKUP($L12,invullijst!$A$11:$M$185,8,FALSE)=0,\"\",VLOOKUP($L12,invullijst!$A$11:$M$185,8,FALSE))","v":""}]
[2,{"$f":"IF($G$3=\"k\",IF(VLOOKUP($D13,invullijst!$A$11:$M$185,11,FALSE)=0,\" \",VLOOKUP($D13,invullijst!$A$11:$M$185,11,FALSE)),\"\")","v":42},{"$f":"IF(VLOOKUP(D13,invullijst!A$11:F$226,4,FALSE)=\"\",\"\",VLOOKUP(D13,invullijst!A$11:D$226,4,FALSE))","v":"vr"},205,{"$f":"IF(VLOOKUP($D13,invullijst!$A$11:$M$185,2,FALSE)=\"\",\"\",VLOOKUP($D13,invullijst!$A$11:$M$185,2,FALSE))","v":"Jos v/d Snepscheut"},null,{"$f":"IF(VLOOKUP($D13,invullijst!$A$11:$M$185,8,FALSE)=0,\"\",VLOOKUP($D13,invullijst!$A$11:$M$185,8,FALSE))","v":73},null,2,{"$f":"IF($O$3=\"k\",IF(VLOOKUP($L13,invullijst!$A$11:$M$185,11,FALSE)=0,\" \",VLOOKUP($L13,invullijst!$A$11:$M$185,11,FALSE)),\"\")","v":" "},{"$f":"IF(VLOOKUP($L13,invullijst!$A$11:$M$226,4,FALSE)=\"\",\"\",VLOOKUP($L13,invullijst!$A$11:$M$226,4,FALSE))","v":0},null,{"$f":"IF(VLOOKUP($L13,invullijst!$A$11:$M$185,2,FALSE)=\"\",\"\",VLOOKUP($L13,invullijst!$A$11:$M$185,2,FALSE))","v":0},null,{"$f":"IF(VLOOKUP($L13,invullijst!$A$11:$M$185,8,FALSE)=0,\"\",VLOOKUP($L13,invullijst!$A$11:$M$185,8,FALSE))","v":""}]
[3,{"$f":"IF($G$3=\"k\",IF(VLOOKUP($D14,invullijst!$A$11:$M$185,11,FALSE)=0,\" \",VLOOKUP($D14,invullijst!$A$11:$M$185,11,FALSE)),\"\")","v":39},{"$f":"IF(VLOOKUP(D14,invullijst!A$11:F$226,4,FALSE)=\"\",\"\",VLOOKUP(D14,invullijst!A$11:D$226,4,FALSE))","v":"vr"},209,{"$f":"IF(VLOOKUP($D14,invullijst!$A$11:$M$185,2,FALSE)=\"\",\"\",VLOOKUP($D14,invullijst!$A$11:$M$185,2,FALSE))","v":"René van Kuijk"},null,{"$f":"IF(VLOOKUP($D14,invullijst!$A$11:$M$185,8,FALSE)=0,\"\",VLOOKUP($D14,invullijst!$A$11:$M$185,8,FALSE))","v":83},null,3,{"$f":"IF($O$3=\"k\",IF(VLOOKUP($L14,invullijst!$A$11:$M$185,11,FALSE)=0,\" \",VLOOKUP($L14,invullijst!$A$11:$M$185,11,FALSE)),\"\")","v":" "},{"$f":"IF(VLOOKUP($L14,invullijst!$A$11:$M$226,4,FALSE)=\"\",\"\",VLOOKUP($L14,invullijst!$A$11:$M$226,4,FALSE))","v":0},null,{"$f":"IF(VLOOKUP($L14,invullijst!$A$11:$M$185,2,FALSE)=\"\",\"\",VLOOKUP($L14,invullijst!$A$11:$M$185,2,FALSE))","v":0},null,{"$f":"IF(VLOOKUP($L14,invullijst!$A$11:$M$185,8,FALSE)=0,\"\",VLOOKUP($L14,invullijst!$A$11:$M$185,8,FALSE))","v":""}]
[4,{"$f":"IF($G$3=\"k\",IF(VLOOKUP($D15,invullijst!$A$11:$M$185,11,FALSE)=0,\" \",VLOOKUP($D15,invullijst!$A$11:$M$185,11,FALSE)),\"\")","v":41},{"$f":"IF(VLOOKUP(D15,invullijst!A$11:F$226,4,FALSE)=\"\",\"\",VLOOKUP(D15,invullijst!A$11:D$226,4,FALSE))","v":"vr"},206,{"$f":"IF(VLOOKUP($D15,invullijst!$A$11:$M$185,2,FALSE)=\"\",\"\",VLOOKUP($D15,invullijst!$A$11:$M$185,2,FALSE))","v":"Kees van Hulten"},null,{"$f":"IF(VLOOKUP($D15,invullijst!$A$11:$M$185,8,FALSE)=0,\"\",VLOOKUP($D15,invullijst!$A$11:$M$185,8,FALSE))","v":78},null,4,{"$f":"IF($O$3=\"k\",IF(VLOOKUP($L15,invullijst!$A$11:$M$185,11,FALSE)=0,\" \",VLOOKUP($L15,invullijst!$A$11:$M$185,11,FALSE)),\"\")","v":" "},{"$f":"IF(VLOOKUP($L15,invullijst!$A$11:$M$226,4,FALSE)=\"\",\"\",VLOOKUP($L15,invullijst!$A$11:$M$226,4,FALSE))","v":0},null,{"$f":"IF(VLOOKUP($L15,invullijst!$A$11:$M$185,2,FALSE)=\"\",\"\",VLOOKUP($L15,invullijst!$A$11:$M$185,2,FALSE))","v":0},null,{"$f":"IF(VLOOKUP($L15,invullijst!$A$11:$M$185,8,FALSE)=0,\"\",VLOOKUP($L15,invullijst!$A$11:$M$185,8,FALSE))","v":""}]
["Totaal B1 korps",{"$nulls":5},{"$f":"SUM(G12:G15)","v":313},null,"Totaal B1 korps",{"$nulls":5},{"$f":"SUM(O12:O15)","v":0}]
[]
[1,{"$f":"IF($G$3=\"k\",IF(VLOOKUP($D18,invullijst!$A$11:$M$185,11,FALSE)=0,\" \",VLOOKUP($D18,invullijst!$A$11:$M$185,11,FALSE)),\"\")","v":35},{"$f":"IF(VLOOKUP(D18,invullijst!A$11:F$226,4,FALSE)=\"\",\"\",VLOOKUP(D18,invullijst!A$11:D$226,4,FALSE))","v":"vr"},217,{"$f":"IF(VLOOKUP($D18,invullijst!$A$11:$M$185,2,FALSE)=\"\",\"\",VLOOKUP($D18,invullijst!$A$11:$M$185,2,FALSE))","v":"Hans Laghuwitz"},null,{"$f":"IF(VLOOKUP($D18,invullijst!$A$11:$M$185,8,FALSE)=0,\"\",VLOOKUP($D18,invullijst!$A$11:$M$185,8,FALSE))","v":79},null,1,{"$f":"IF($O$3=\"k\",IF(VLOOKUP($L18,invullijst!$A$11:$M$185,11,FALSE)=0,\" \",VLOOKUP($L18,invullijst!$A$11:$M$185,11,FALSE)),\"\")","v":" "},{"$f":"IF(VLOOKUP($L18,invullijst!$A$11:$M$226,4,FALSE)=\"\",\"\",VLOOKUP($L18,invullijst!$A$11:$M$226,4,FALSE))","v":0},null,{"$f":"IF(VLOOKUP($L18,invullijst!$A$11:$M$185,2,FALSE)=\"\",\"\",VLOOKUP($L18,invullijst!$A$11:$M$185,2,FALSE))","v":0},null,{"$f":"IF(VLOOKUP($L18,invullijst!$A$11:$M$185,8,FALSE)=0,\"\",VLOOKUP($L18,invullijst!$A$11:$M$185,8,FALSE))","v":""}]
[2,{"$f":"IF($G$3=\"k\",IF(VLOOKUP($D19,invullijst!$A$11:$M$185,11,FALSE)=0,\" \",VLOOKUP($D19,invullijst!$A$11:$M$185,11,FALSE)),\"\")","v":41},{"$f":"IF(VLOOKUP(D19,invullijst!A$11:F$226,4,FALSE)=\"\",\"\",VLOOKUP(D19,invullijst!A$11:D$226,4,FALSE))","v":"vr"},208,{"$f":"IF(VLOOKUP($D19,invullijst!$A$11:$M$185,2,FALSE)=\"\",\"\",VLOOKUP($D19,invullijst!$A$11:$M$185,2,FALSE))","v":"Erin van Hulten"},null,{"$f":"IF(VLOOKUP($D19,invullijst!$A$11:$M$185,8,FALSE)=0,\"\",VLOOKUP($D19,invullijst!$A$11:$M$185,8,FALSE))","v":87},null,2,{"$f":"IF($O$3=\"k\",IF(VLOOKUP($L19,invullijst!$A$11:$M$185,11,FALSE)=0,\" \",VLOOKUP($L19,invullijst!$A$11:$M$185,11,FALSE)),\"\")","v":" "},{"$f":"IF(VLOOKUP($L19,invullijst!$A$11:$M$226,4,FALSE)=\"\",\"\",VLOOKUP($L19,invullijst!$A$11:$M$226,4,FALSE))","v":0},null,{"$f":"IF(VLOOKUP($L19,invullijst!$A$11:$M$185,2,FALSE)=\"\",\"\",VLOOKUP($L19,invullijst!$A$11:$M$185,2,FALSE))","v":0},null,{"$f":"IF(VLOOKUP($L19,invullijst!$A$11:$M$185,8,FALSE)=0,\"\",VLOOKUP($L19,invullijst!$A$11:$M$185,8,FALSE))","v":""}]
[3,{"$f":"IF($G$3=\"k\",IF(VLOOKUP($D20,invullijst!$A$11:$M$185,11,FALSE)=0,\" \",VLOOKUP($D20,invullijst!$A$11:$M$185,11,FALSE)),\"\")","v":35},{"$f":"IF(VLOOKUP(D20,invullijst!A$11:F$226,4,FALSE)=\"\",\"\",VLOOKUP(D20,invullijst!A$11:D$226,4,FALSE))","v":"vr"},213,{"$f":"IF(VLOOKUP($D20,invullijst!$A$11:$M$185,2,FALSE)=\"\",\"\",VLOOKUP($D20,invullijst!$A$11:$M$185,2,FALSE))","v":"Roland van Delft"},null,{"$f":"IF(VLOOKUP($D20,invullijst!$A$11:$M$185,8,FALSE)=0,\"\",VLOOKUP($D20,invullijst!$A$11:$M$185,8,FALSE))","v":69},null,3,{"$f":"IF($O$3=\"k\",IF(VLOOKUP($L20,invullijst!$A$11:$M$185,11,FALSE)=0,\" \",VLOOKUP($L20,invullijst!$A$11:$M$185,11,FALSE)),\"\")","v":" "},{"$f":"IF(VLOOKUP($L20,invullijst!$A$11:$M$226,4,FALSE)=\"\",\"\",VLOOKUP($L20,invullijst!$A$11:$M$226,4,FALSE))","v":0},null,{"$f":"IF(VLOOKUP($L20,invullijst!$A$11:$M$185,2,FALSE)=\"\",\"\",VLOOKUP($L20,invullijst!$A$11:$M$185,2,FALSE))","v":0},null,{"$f":"IF(VLOOKUP($L20,invullijst!$A$11:$M$185,8,FALSE)=0,\"\",VLOOKUP($L20,invullijst!$A$11:$M$185,8,FALSE))","v":""}]
[4,{"$f":"IF($G$3=\"k\",IF(VLOOKUP($D21,invullijst!$A$11:$M$185,11,FALSE)=0,\" \",VLOOKUP($D21,invullijst!$A$11:$M$185,11,FALSE)),\"\")","v":27},{"$f":"IF(VLOOKUP(D21,invullijst!A$11:F$226,4,FALSE)=\"\",\"\",VLOOKUP(D21,invullijst!A$11:D$226,4,FALSE))","v":"vr"},223,{"$f":"IF(VLOOKUP($D21,invullijst!$A$11:$M$185,2,FALSE)=\"\",\"\",VLOOKUP($D21,invullijst!$A$11:$M$185,2,FALSE))","v":"Jänis Jakobsons"},null,{"$f":"IF(VLOOKUP($D21,invullijst!$A$11:$M$185,8,FALSE)=0,\"\",VLOOKUP($D21,invullijst!$A$11:$M$185,8,FALSE))","v":84},null,4,{"$f":"IF($O$3=\"k\",IF(VLOOKUP($L21,invullijst!$A$11:$M$185,11,FALSE)=0,\" \",VLOOKUP($L21,invullijst!$A$11:$M$185,11,FALSE)),\"\")","v":" "},{"$f":"IF(VLOOKUP($L21,invullijst!$A$11:$M$226,4,FALSE)=\"\",\"\",VLOOKUP($L21,invullijst!$A$11:$M$226,4,FALSE))","v":0},null,{"$f":"IF(VLOOKUP($L21,invullijst!$A$11:$M$185,2,FALSE)=\"\",\"\",VLOOKUP($L21,invullijst!$A$11:$M$185,2,FALSE))","v":0},null,{"$f":"IF(VLOOKUP($L21,invullijst!$A$11:$M$185,8,FALSE)=0,\"\",VLOOKUP($L21,invullijst!$A$11:$M$185,8,FALSE))","v":""}]
["DIVERSEN / INHAAL",{"$nulls":5},{"$f":"SUM(G18:G21)","v":319},null,"DIVERSEN / INHAAL"]
[]
["OPGELEGD (Jeugd <16 en 65+)"]
[1,{"$f":"IF($G$3=\"k\",IF(VLOOKUP($D25,invullijst!$A$11:$M$185,11,FALSE)=0,\" \",VLOOKUP($D25,invullijst!$A$11:$M$185,11,FALSE)),\"\")","v":46},{"$f":"IF(VLOOKUP(D25,invullijst!A$11:F$226,4,FALSE)=\"\",\"\",VLOOKUP(D25,invullijst!A$11:D$226,4,FALSE))","v":"65+"},218,{"$f":"IF(VLOOKUP($D25,invullijst!$A$11:$M$185,2,FALSE)=\"\",\"\",VLOOKUP($D25,invullijst!$A$11:$M$185,2,FALSE))","v":"Jacob van de Werken"},null,{"$f":"IF(VLOOKUP($D25,invullijst!$A$11:$M$185,8,FALSE)=0,\"\",VLOOKUP($D25,invullijst!$A$11:$M$185,8,FALSE))","v":94},null,1,{"$f":"IF($O$3=\"k\",IF(VLOOKUP($L25,invullijst!$A$11:$M$185,11,FALSE)=0,\" \",VLOOKUP($L25,invullijst!$A$11:$M$185,11,FALSE)),\"\")","v":45},{"$f":"IF(VLOOKUP($L25,invullijst!$A$11:$M$226,4,FALSE)=\"\",\"\",VLOOKUP($L25,invullijst!$A$11:$M$226,4,FALSE))","v":"65+"},310,{"$f":"IF(VLOOKUP($L25,invullijst!$A$11:$M$185,2,FALSE)=\"\",\"\",VLOOKUP($L25,invullijst!$A$11:$M$185,2,FALSE))","v":"Tiny Boom"},null,{"$f":"IF(VLOOKUP($L25,invullijst!$A$11:$M$185,8,FALSE)=0,\"\",VLOOKUP($L25,invullijst!$A$11:$M$185,8,FALSE))","v":91}]
[2,{"$f":"IF($G$3=\"k\",IF(VLOOKUP($D26,invullijst!$A$11:$M$185,11,FALSE)=0,\" \",VLOOKUP($D26,invullijst!$A$11:$M$185,11,FALSE)),\"\")","v":46},{"$f":"IF(VLOOKUP(D26,invullijst!A$11:F$226,4,FALSE)=\"\",\"\",VLOOKUP(D26,invullijst!A$11:D$226,4,FALSE))","v":"65+"},220,{"$f":"IF(VLOOKUP($D26,invullijst!$A$11:$M$185,2,FALSE)=\"\",\"\",VLOOKUP($D26,invullijst!$A$11:$M$185,2,FALSE))","v":"Kees Vos"},null,{"$f":"IF(VLOOKUP($D26,invullijst!$A$11:$M$185,8,FALSE)=0,\"\",VLOOKUP($D26,invullijst!$A$11:$M$185,8,FALSE))","v":91},null,2,{"$f":"IF($O$3=\"k\",IF(VLOOKUP($L26,invullijst!$A$11:$M$185,11,FALSE)=0,\" \",VLOOKUP($L26,invullijst!$A$11:$M$185,11,FALSE)),\"\")","v":44},{"$f":"IF(VLOOKUP($L26,invullijst!$A$11:$M$226,4,FALSE)=\"\",\"\",VLOOKUP($L26,invullijst!$A$11:$M$226,4,FALSE))","v":"J"},312,{"$f":"IF(VLOOKUP($L26,invullijst!$A$11:$M$185,2,FALSE)=\"\",\"\",VLOOKUP($L26,invullijst!$A$11:$M$185,2,FALSE))","v":"Floor de Jong"},null,{"$f":"IF(VLOOKUP($L26,invullijst!$A$11:$M$185,8,FALSE)=0,\"\",VLOOKUP($L26,invullijst!$A$11:$M$185,8,FALSE))","v":92}]
[3,{"$f":"IF($G$3=\"k\",IF(VLOOKUP($D27,invullijst!$A$11:$M$185,11,FALSE)=0,\" \",VLOOKUP($D27,invullijst!$A$11:$M$185,11,FALSE)),\"\")","v":46},{"$f":"IF(VLOOKUP(D27,invullijst!A$11:F$226,4,FALSE)=\"\",\"\",VLOOKUP(D27,invullijst!A$11:D$226,4,FALSE))","v":"65+"},219,{"$f":"IF(VLOOKUP($D27,invullijst!$A$11:$M$185,2,FALSE)=\"\",\"\",VLOOKUP($D27,invullijst!$A$11:$M$185,2,FALSE))","v":"Frans de Bont"},null,{"$f":"IF(VLOOKUP($D27,invullijst!$A$11:$M$185,8,FALSE)=0,\"\",VLOOKUP($D27,invullijst!$A$11:$M$185,8,FALSE))","v":94},null,3,{"$f":"IF($O$3=\"k\",IF(VLOOKUP($L27,invullijst!$A$11:$M$185,11,FALSE)=0,\" \",VLOOKUP($L27,invullijst!$A$11:$M$185,11,FALSE)),\"\")","v":39},{"$f":"IF(VLOOKUP($L27,invullijst!$A$11:$M$226,4,FALSE)=\"\",\"\",VLOOKUP($L27,invullijst!$A$11:$M$226,4,FALSE))","v":"65+"},309,{"$f":"IF(VLOOKUP($L27,invullijst!$A$11:$M$185,2,FALSE)=\"\",\"\",VLOOKUP($L27,invullijst!$A$11:$M$185,2,FALSE))","v":"René de Jong"},null,{"$f":"IF(VLOOKUP($L27,invullijst!$A$11:$M$185,8,FALSE)=0,\"\",VLOOKUP($L27,invullijst!$A$11:$M$185,8,FALSE))","v":88}]
["Totaal korps opgelegd A1",{"$nulls":5},{"$f":"SUM(G25:G27)","v":279},null,"Totaal korps opgelegd A1",{"$nulls":5},{"$f":"SUM(O25:O27)","v":271}]
[]
[1,{"$f":"IF($G$3=\"k\",IF(VLOOKUP($D30,invullijst!$A$11:$M$185,11,FALSE)=0,\" \",VLOOKUP($D30,invullijst!$A$11:$M$185,11,FALSE)),\"\")","v":44},{"$f":"IF(VLOOKUP(D30,invullijst!A$11:F$226,4,FALSE)=\"\",\"\",VLOOKUP(D30,invullijst!A$11:D$226,4,FALSE))","v":"65+"},214,{"$f":"IF(VLOOKUP($D30,invullijst!$A$11:$M$185,2,FALSE)=\"\",\"\",VLOOKUP($D30,invullijst!$A$11:$M$185,2,FALSE))","v":"Andre de Vaan"},null,{"$f":"IF(VLOOKUP($D30,invullijst!$A$11:$M$185,8,FALSE)=0,\"\",VLOOKUP($D30,invullijst!$A$11:$M$185,8,FALSE))","v":89},null,1,{"$f":"IF($O$3=\"k\",IF(VLOOKUP($L30,invullijst!$A$11:$M$185,11,FALSE)=0,\" \",VLOOKUP($L30,invullijst!$A$11:$M$185,11,FALSE)),\"\")","v":45},{"$f":"IF(VLOOKUP($L30,invullijst!$A$11:$M$226,4,FALSE)=\"\",\"\",VLOOKUP($L30,invullijst!$A$11:$M$226,4,FALSE))","v":"65+"},301,{"$f":"IF(VLOOKUP($L30,invullijst!$A$11:$M$185,2,FALSE)=\"\",\"\",VLOOKUP($L30,invullijst!$A$11:$M$185,2,FALSE))","v":"Arjen van Assem disp"},null,{"$f":"IF(VLOOKUP($L30,invullijst!$A$11:$M$185,8,FALSE)=0,\"\",VLOOKUP($L30,invullijst!$A$11:$M$185,8,FALSE))","v":89}]
[2,{"$f":"IF($G$3=\"k\",IF(VLOOKUP($D31,invullijst!$A$11:$M$185,11,FALSE)=0,\" \",VLOOKUP($D31,invullijst!$A$11:$M$185,11,FALSE)),\"\")","v":46},{"$f":"IF(VLOOKUP(D31,invullijst!A$11:F$226,4,FALSE)=\"\",\"\",VLOOKUP(D31,invullijst!A$11:D$226,4,FALSE))","v":"65+"},211,{"$f":"IF(VLOOKUP($D31,invullijst!$A$11:$M$185,2,FALSE)=\"\",\"\",VLOOKUP($D31,invullijst!$A$11:$M$185,2,FALSE))","v":"Ad van den houdt"},null,{"$f":"IF(VLOOKUP($D31,invullijst!$A$11:$M$185,8,FALSE)=0,\"\",VLOOKUP($D31,invullijst!$A$11:$M$185,8,FALSE))","v":89},null,2,{"$f":"IF($O$3=\"k\",IF(VLOOKUP($L31,invullijst!$A$11:$M$185,11,FALSE)=0,\" \",VLOOKUP($L31,invullijst!$A$11:$M$185,11,FALSE)),\"\")","v":" "},{"$f":"IF(VLOOKUP($L31,invullijst!$A$11:$M$226,4,FALSE)=\"\",\"\",VLOOKUP($L31,invullijst!$A$11:$M$226,4,FALSE))","v":0},null,{"$f":"IF(VLOOKUP($L31,invullijst!$A$11:$M$185,2,FALSE)=\"\",\"\",VLOOKUP($L31,invullijst!$A$11:$M$185,2,FALSE))","v":0},null,{"$f":"IF(VLOOKUP($L31,invullijst!$A$11:$M$185,8,FALSE)=0,\"\",VLOOKUP($L31,invullijst!$A$11:$M$185,8,FALSE))","v":""}]
[3,{"$f":"IF($G$3=\"k\",IF(VLOOKUP($D32,invullijst!$A$11:$M$185,11,FALSE)=0,\" \",VLOOKUP($D32,invullijst!$A$11:$M$185,11,FALSE)),\"\")","v":45},{"$f":"IF(VLOOKUP(D32,invullijst!A$11:F$226,4,FALSE)=\"\",\"\",VLOOKUP(D32,invullijst!A$11:D$226,4,FALSE))","v":"65+"},212,{"$f":"IF(VLOOKUP($D32,invullijst!$A$11:$M$185,2,FALSE)=\"\",\"\",VLOOKUP($D32,invullijst!$A$11:$M$185,2,FALSE))","v":"René Duquesnoy"},null,{"$f":"IF(VLOOKUP($D32,invullijst!$A$11:$M$185,8,FALSE)=0,\"\",VLOOKUP($D32,invullijst!$A$11:$M$185,8,FALSE))","v":89},null,3,{"$f":"IF($O$3=\"k\",IF(VLOOKUP($L32,invullijst!$A$11:$M$185,11,FALSE)=0,\" \",VLOOKUP($L32,invullijst!$A$11:$M$185,11,FALSE)),\"\")","v":" "},{"$f":"IF(VLOOKUP($L32,invullijst!$A$11:$M$226,4,FALSE)=\"\",\"\",VLOOKUP($L32,invullijst!$A$11:$M$226,4,FALSE))","v":0},null,{"$f":"IF(VLOOKUP($L32,invullijst!$A$11:$M$185,2,FALSE)=\"\",\"\",VLOOKUP($L32,invullijst!$A$11:$M$185,2,FALSE))","v":0},null,{"$f":"IF(VLOOKUP($L32,invullijst!$A$11:$M$185,8,FALSE)=0,\"\",VLOOKUP($L32,invullijst!$A$11:$M$185,8,FALSE))","v":""}]
["Totaal korps opgelegd A2",{"$nulls":5},{"$f":"SUM(G30:G32)","v":267},null,"Totaal korps opgelegd A2",{"$nulls":5},{"$f":"SUM(O30:O32)","v":89}]
[]
[1,{"$f":"IF($G$3=\"k\",IF(VLOOKUP($D35,invullijst!$A$11:$M$185,11,FALSE)=0,\" \",VLOOKUP($D35,invullijst!$A$11:$M$185,11,FALSE)),\"\")","v":36},{"$f":"IF(VLOOKUP(D35,invullijst!A$11:F$226,4,FALSE)=\"\",\"\",VLOOKUP(D35,invullijst!A$11:D$226,4,FALSE))","v":"J"},221,{"$f":"IF(VLOOKUP($D35,invullijst!$A$11:$M$185,2,FALSE)=\"\",\"\",VLOOKUP($D35,invullijst!$A$11:$M$185,2,FALSE))","v":"Mees Huijben"},null,{"$f":"IF(VLOOKUP($D35,invullijst!$A$11:$M$185,8,FALSE)=0,\"\",VLOOKUP($D35,invullijst!$A$11:$M$185,8,FALSE))","v":74},null,1,{"$f":"IF($O$3=\"k\",IF(VLOOKUP($L35,invullijst!$A$11:$M$185,11,FALSE)=0,\" \",VLOOKUP($L35,invullijst!$A$11:$M$185,11,FALSE)),\"\")","v":" "},{"$f":"IF(VLOOKUP($L35,invullijst!$A$11:$M$226,4,FALSE)=\"\",\"\",VLOOKUP($L35,invullijst!$A$11:$M$226,4,FALSE))","v":0},null,{"$f":"IF(VLOOKUP($L35,invullijst!$A$11:$M$185,2,FALSE)=\"\",\"\",VLOOKUP($L35,invullijst!$A$11:$M$185,2,FALSE))","v":0},null,{"$f":"IF(VLOOKUP($L35,invullijst!$A$11:$M$185,8,FALSE)=0,\"\",VLOOKUP($L35,invullijst!$A$11:$M$185,8,FALSE))","v":""}]
[2,{"$f":"IF($G$3=\"k\",IF(VLOOKUP($D36,invullijst!$A$11:$M$185,11,FALSE)=0,\" \",VLOOKUP($D36,invullijst!$A$11:$M$185,11,FALSE)),\"\")","v":31},{"$f":"IF(VLOOKUP(D36,invullijst!A$11:F$226,4,FALSE)=\"\",\"\",VLOOKUP(D36,invullijst!A$11:D$226,4,FALSE))","v":"vr"},202,{"$f":"IF(VLOOKUP($D36,invullijst!$A$11:$M$185,2,FALSE)=\"\",\"\",VLOOKUP($D36,invullijst!$A$11:$M$185,2,FALSE))","v":"Arco van Kuijk"},null,{"$f":"IF(VLOOKUP($D36,invullijst!$A$11:$M$185,8,FALSE)=0,\"\",VLOOKUP($D36,invullijst!$A$11:$M$185,8,FALSE))","v":81},null,2,{"$f":"IF($O$3=\"k\",IF(VLOOKUP($L36,invullijst!$A$11:$M$185,11,FALSE)=0,\" \",VLOOKUP($L36,invullijst!$A$11:$M$185,11,FALSE)),\"\")","v":" "},{"$f":"IF(VLOOKUP($L36,invullijst!$A$11:$M$226,4,FALSE)=\"\",\"\",VLOOKUP($L36,invullijst!$A$11:$M$226,4,FALSE))","v":0},null,{"$f":"IF(VLOOKUP($L36,invullijst!$A$11:$M$185,2,FALSE)=\"\",\"\",VLOOKUP($L36,invullijst!$A$11:$M$185,2,FALSE))","v":0},null,{"$f":"IF(VLOOKUP($L36,invullijst!$A$11:$M$185,8,FALSE)=0,\"\",VLOOKUP($L36,invullijst!$A$11:$M$185,8,FALSE))","v":""}]
[3,{"$f":"IF($G$3=\"k\",IF(VLOOKUP($D37,invullijst!$A$11:$M$185,11,FALSE)=0,\" \",VLOOKUP($D37,invullijst!$A$11:$M$185,11,FALSE)),\"\")","v":41},"inh",206,{"$f":"IF(VLOOKUP($D37,invullijst!$A$11:$M$185,2,FALSE)=\"\",\"\",VLOOKUP($D37,invullijst!$A$11:$M$185,2,FALSE))","v":"Kees van Hulten"},null,{"$f":"IF(VLOOKUP($D37,invullijst!$A$11:$M$185,8,FALSE)=0,\"\",VLOOKUP($D37,invullijst!$A$11:$M$185,8,FALSE))","v":78},null,3,{"$f":"IF($O$3=\"k\",IF(VLOOKUP($L37,invullijst!$A$11:$M$185,11,FALSE)=0,\" \",VLOOKUP($L37,invullijst!$A$11:$M$185,11,FALSE)),\"\")","v":" "},{"$f":"IF(VLOOKUP($L37,invullijst!$A$11:$M$226,4,FALSE)=\"\",\"\",VLOOKUP($L37,invullijst!$A$11:$M$226,4,FALSE))","v":0},null,{"$f":"IF(VLOOKUP($L37,invullijst!$A$11:$M$185,2,FALSE)=\"\",\"\",VLOOKUP($L37,invullijst!$A$11:$M$185,2,FALSE))","v":0},null,{"$f":"IF(VLOOKUP($L37,invullijst!$A$11:$M$185,8,FALSE)=0,\"\",VLOOKUP($L37,invullijst!$A$11:$M$185,8,FALSE))","v":""}]
["Totaal korps opgelegd A3",{"$nulls":5},{"$f":"G35","v":74},null,"Totaal korps opgelegd A3",{"$nulls":5},{"$f":"SUM(O35:O37)","v":0}]

{"sheet":"wedstrijd 3B","index":10,"n_rows":38,"n_cols":15,"rows_kept":38,"merged":[[0,0,0,4],[0,5,0,7],[0,8,0,14],[1,0,1,11],[1,12,1,14],[2,1,2,5],[2,9,2,13],[4,0,4,14],[5,4,5,5],[5,12,5,13],[6,4,6,5],[6,12,6,13],[7,4,7,5],[7,12,7,13],[8,4,8,5],[8,12,8,13],[9,0,9,5],[9,8,9,13],[11,4,11,5],[11,12,11,13],[12,4,12,5],[12,12,12,13],[13,4,13,5],[13,12,13,13],[14,4,14,5],[14,12,14,13],[15,0,15,5],[15,8,15,13],[17,4,17,5],[17,12,17,13],[18,4,18,5],[18,12,18,13],[19,4,19,5],[19,12,19,13],[20,4,20,5],[20,12,20,13],[21,0,21,5],[21,8,21,13],[23,0,23,14],[24,4,24,5],[24,12,24,13],[25,4,25,5],[25,12,25,13],[26,4,26,5],[26,12,26,13],[27,0,27,5],[27,8,27,13],[29,4,29,5],[29,12,29,13],[30,4,30,5],[30,12,30,13],[31,4,31,5],[31,12,31,13],[32,0,32,5],[32,8,32,13],[34,4,34,5],[34,12,34,13],[35,4,35,5],[35,12,35,13],[36,4,36,5],[36,12,36,13],[37,0,37,5],[37,8,37,13]]}
[{"$f":"invullijst!F1","v":"Organistatie"},{"$nulls":4},{"$f":"invullijst!H2","v":"2024 - 2025"},null,null,{"$f":"invullijst!F3","v":"O.L.V. Schuts Elshout"}]
["Datum: ",{"$nulls":11},"2025-02-02"]
[4,{"$f":"IF(VLOOKUP(A3,invullijst!A1:F5,2,FALSE)=\"\",\"\",VLOOKUP(A3,invullijst!A1:F5,2,FALSE))","v":"Sint Ambrosius Haarsteeg"},{"$nulls":6},1,{"$f":"IF(VLOOKUP(I3,invullijst!A1:C5,2,FALSE)=\"\",\"\",VLOOKUP(I3,invullijst!A1:C5,2,FALSE))","v":"Sint Ambrosius Baardwijk"}]
[]
["vrijehand"]
[1,{"$f":"IF($G$3=\"k\",IF(VLOOKUP($D6,invullijst!$A$11:$M$185,11,FALSE)=0,\" \",VLOOKUP($D6,invullijst!$A$11:$M$185,11,FALSE)),\"\")","v":""},{"$f":"IF(VLOOKUP(D6,invullijst!A$11:F$226,4,FALSE)=\"\",\"\",VLOOKUP(D6,invullijst!A$11:D$226,4,FALSE))","v":"vr"},406,{"$f":"IF(VLOOKUP($D6,invullijst!$A$11:$M$185,2,FALSE)=\"\",\"\",VLOOKUP($D6,invullijst!$A$11:$M$185,2,FALSE))","v":"Jeroen van Oss"},null,{"$f":"IF(VLOOKUP($D6,invullijst!$A$11:$M$185,8,FALSE)=0,\"\",VLOOKUP($D6,invullijst!$A$11:$M$185,8,FALSE))","v":86},null,1,{"$f":"IF($O$3=\"k\",IF(VLOOKUP($L6,invullijst!$A$11:$M$185,11,FALSE)=0,\" \",VLOOKUP($L6,invullijst!$A$11:$M$185,11,FALSE)),\"\")","v":""},{"$f":"IF(VLOOKUP($L6,invullijst!$A$11:$M$226,4,FALSE)=\"\",\"\",VLOOKUP($L6,invullijst!$A$11:$M$226,4,FALSE))","v":"vr"},105,{"$f":"IF(VLOOKUP($L6,invullijst!$A$11:$M$185,2,FALSE)=\"\",\"\",VLOOKUP($L6,invullijst!$A$11:$M$185,2,FALSE))","v":"René Klijn"},null,{"$f":"IF(VLOOKUP($L6,invullijst!$A$11:$M$185,8,FALSE)=0,\"\",VLOOKUP($L6,invullijst!$A$11:$M$185,8,FALSE))","v":80}]
[2,{"$f":"IF($G$3=\"k\",IF(VLOOKUP($D7,invullijst!$A$11:$M$185,11,FALSE)=0,\" \",VLOOKUP($D7,invullijst!$A$11:$M$185,11,FALSE)),\"\")","v":""},{"$f":"IF(VLOOKUP(D7,invullijst!A$11:F$226,4,FALSE)=\"\",\"\",VLOOKUP(D7,invullijst!A$11:D$226,4,FALSE))","v":"vr"},408,{"$f":"IF(VLOOKUP($D7,invullijst!$A$11:$M$185,2,FALSE)=\"\",\"\",VLOOKUP($D7,invullijst!$A$11:$M$185,2,FALSE))","v":"Rudy van Falier"},null,{"$f":"IF(VLOOKUP($D7,invullijst!$A$11:$M$185,8,FALSE)=0,\"\",VLOOKUP($D7,invullijst!$A$11:$M$185,8,FALSE))","v":84},null,2,{"$f":"IF($O$3=\"k\",IF(VLOOKUP($L7,invullijst!$A$11:$M$185,11,FALSE)=0,\" \",VLOOKUP($L7,invullijst!$A$11:$M$185,11,FALSE)),\"\")","v":""},{"$f":"IF(VLOOKUP($L7,invullijst!$A$11:$M$226,4,FALSE)=\"\",\"\",VLOOKUP($L7,invullijst!$A$11:$M$226,4,FALSE))","v":"vr"},106,{"$f":"IF(VLOOKUP($L7,invullijst!$A$11:$M$185,2,FALSE)=\"\",\"\",VLOOKUP($L7,invullijst!$A$11:$M$185,2,FALSE))","v":"René Pullens"},null,{"$f":"IF(VLOOKUP($L7,invullijst!$A$11:$M$185,8,FALSE)=0,\"\",VLOOKUP($L7,invullijst!$A$11:$M$185,8,FALSE))","v":82}]
[3,{"$f":"IF($G$3=\"k\",IF(VLOOKUP($D8,invullijst!$A$11:$M$185,11,FALSE)=0,\" \",VLOOKUP($D8,invullijst!$A$11:$M$185,11,FALSE)),\"\")","v":""},{"$f":"IF(VLOOKUP(D8,invullijst!A$11:F$226,4,FALSE)=\"\",\"\",VLOOKUP(D8,invullijst!A$11:D$226,4,FALSE))","v":"vr"},410,{"$f":"IF(VLOOKUP($D8,invullijst!$A$11:$M$185,2,FALSE)=\"\",\"\",VLOOKUP($D8,invullijst!$A$11:$M$185,2,FALSE))","v":"Tonnie Koks"},null,{"$f":"IF(VLOOKUP($D8,invullijst!$A$11:$M$185,8,FALSE)=0,\"\",VLOOKUP($D8,invullijst!$A$11:$M$185,8,FALSE))","v":88},null,3,{"$f":"IF($O$3=\"k\",IF(VLOOKUP($L8,invullijst!$A$11:$M$185,11,FALSE)=0,\" \",VLOOKUP($L8,invullijst!$A$11:$M$185,11,FALSE)),\"\")","v":""},{"$f":"IF(VLOOKUP($L8,invullijst!$A$11:$M$226,4,FALSE)=\"\",\"\",VLOOKUP($L8,invullijst!$A$11:$M$226,4,FALSE))","v":"vr"},108,{"$f":"IF(VLOOKUP($L8,invullijst!$A$11:$M$185,2,FALSE)=\"\",\"\",VLOOKUP($L8,invullijst!$A$11:$M$185,2,FALSE))","v":"Bram Pullens"},null,{"$f":"IF(VLOOKUP($L8,invullijst!$A$11:$M$185,8,FALSE)=0,\"\",VLOOKUP($L8,invullijst!$A$11:$M$185,8,FALSE))","v":78}]
[4,{"$f":"IF($G$3=\"k\",IF(VLOOKUP($D9,invullijst!$A$11:$M$185,11,FALSE)=0,\" \",VLOOKUP($D9,invullijst!$A$11:$M$185,11,FALSE)),\"\")","v":""},{"$f":"IF(VLOOKUP(D9,invullijst!A$11:F$226,4,FALSE)=\"\",\"\",VLOOKUP(D9,invullijst!A$11:D$226,4,FALSE))","v":"vr"},402,{"$f":"IF(VLOOKUP($D9,invullijst!$A$11:$M$185,2,FALSE)=\"\",\"\",VLOOKUP($D9,invullijst!$A$11:$M$185,2,FALSE))","v":"Daniëlle v/d Lee"},null,{"$f":"IF(VLOOKUP($D9,invullijst!$A$11:$M$185,8,FALSE)=0,\"\",VLOOKUP($D9,invullijst!$A$11:$M$185,8,FALSE))","v":80},null,4,{"$f":"IF($O$3=\"k\",IF(VLOOKUP($L9,invullijst!$A$11:$M$185,11,FALSE)=0,\" \",VLOOKUP($L9,invullijst!$A$11:$M$185,11,FALSE)),\"\")","v":""},{"$f":"IF(VLOOKUP($L9,invullijst!$A$11:$M$226,4,FALSE)=\"\",\"\",VLOOKUP($L9,invullijst!$A$11:$M$226,4,FALSE))","v":"vr"},109,{"$f":"IF(VLOOKUP($L9,invullijst!$A$11:$M$185,2,FALSE)=\"\",\"\",VLOOKUP($L9,invullijst!$A$11:$M$185,2,FALSE))","v":"Gijs Pullens"},null,{"$f":"IF(VLOOKUP($L9,invullijst!$A$11:$M$185,8,FALSE)=0,\"\",VLOOKUP($L9,invullijst!$A$11:$M$185,8,FALSE))","v":83}]
["Totaal A korps",{"$nulls":5},{"$f":"SUM(G6:G9)","v":338},null,"Totaal A korps",{"$nulls":5},{"$f":"SUM(O6:O9)","v":323}]
[]
[1,{"$f":"IF($G$3=\"k\",IF(VLOOKUP($D12,invullijst!$A$11:$M$185,11,FALSE)=0,\" \",VLOOKUP($D12,invullijst!$A$11:$M$185,11,FALSE)),\"\")","v":""},{"$f":"IF(VLOOKUP(D12,invullijst!A$11:F$226,4,FALSE)=\"\",\"\",VLOOKUP(D12,invullijst!A$11:D$226,4,FALSE))","v":"vr"},411,{"$f":"IF(VLOOKUP($D12,invullijst!$A$11:$M$185,2,FALSE)=\"\",\"\",VLOOKUP($D12,invullijst!$A$11:$M$185,2,FALSE))","v":"Wilma v/d Lee"},null,{"$f":"IF(VLOOKUP($D12,invullijst!$A$11:$M$185,8,FALSE)=0,\"\",VLOOKUP($D12,invullijst!$A$11:$M$185,8,FALSE))","v":53},null,1,{"$f":"IF($O$3=\"k\",IF(VLOOKUP($L12,invullijst!$A$11:$M$185,11,FALSE)=0,\" \",VLOOKUP($L12,invullijst!$A$11:$M$185,11,FALSE)),\"\")","v":""},{"$f":"IF(VLOOKUP($L12,invullijst!$A$11:$M$226,4,FALSE)=\"\",\"\",VLOOKUP($L12,invullijst!$A$11:$M$226,4,FALSE))","v":"vr"},102,{"$f":"IF(VLOOKUP($L12,invullijst!$A$11:$M$185,2,FALSE)=\"\",\"\",VLOOKUP($L12,invullijst!$A$11:$M$185,2,FALSE))","v":"John de Jong"},null,{"$f":"IF(VLOOKUP($L12,invullijst!$A$11:$M$185,8,FALSE)=0,\"\",VLOOKUP($L12,invullijst!$A$11:$M$185,8,FALSE))","v":63}]
[2,{"$f":"IF($G$3=\"k\",IF(VLOOKUP($D13,invullijst!$A$11:$M$185,11,FALSE)=0,\" \",VLOOKUP($D13,invullijst!$A$11:$M$185,11,FALSE)),\"\")","v":""},{"$f":"IF(VLOOKUP(D13,invullijst!A$11:F$226,4,FALSE)=\"\",\"\",VLOOKUP(D13,invullijst!A$11:D$226,4,FALSE))","v":0},null,{"$f":"IF(VLOOKUP($D13,invullijst!$A$11:$M$185,2,FALSE)=\"\",\"\",VLOOKUP($D13,invullijst!$A$11:$M$185,2,FALSE))","v":0},null,{"$f":"IF(VLOOKUP($D13,invullijst!$A$11:$M$185,8,FALSE)=0,\"\",VLOOKUP($D13,invullijst!$A$11:$M$185,8,FALSE))","v":""},null,2,{"$f":"IF($O$3=\"k\",IF(VLOOKUP($L13,invullijst!$A$11:$M$185,11,FALSE)=0,\" \",VLOOKUP($L13,invullijst!$A$11:$M$185,11,FALSE)),\"\")","v":""},{"$f":"IF(VLOOKUP($L13,invullijst!$A$11:$M$226,4,FALSE)=\"\",\"\",VLOOKUP($L13,invullijst!$A$11:$M$226,4,FALSE))","v":"vr"},103,{"$f":"IF(VLOOKUP($L13,invullijst!$A$11:$M$185,2,FALSE)=\"\",\"\",VLOOKUP($L13,invullijst!$A$11:$M$185,2,FALSE))","v":"Norbert van Buul"},null,{"$f":"IF(VLOOKUP($L13,invullijst!$A$11:$M$185,8,FALSE)=0,\"\",VLOOKUP($L13,invullijst!$A$11:$M$185,8,FALSE))","v":65}]
[3,{"$f":"IF($G$3=\"k\",IF(VLOOKUP($D14,invullijst!$A$11:$M$185,11,FALSE)=0,\" \",VLOOKUP($D14,invullijst!$A$11:$M$185,11,FALSE)),\"\")","v":""},{"$f":"IF(VLOOKUP(D14,invullijst!A$11:F$226,4,FALSE)=\"\",\"\",VLOOKUP(D14,invullijst!A$11:D$226,4,FALSE))","v":0},null,{"$f":"IF(VLOOKUP($D14,invullijst!$A$11:$M$185,2,FALSE)=\"\",\"\",VLOOKUP($D14,invullijst!$A$11:$M$185,2,FALSE))","v":0},null,{"$f":"IF(VLOOKUP($D14,invullijst!$A$11:$M$185,8,FALSE)=0,\"\",VLOOKUP($D14,invullijst!$A$11:$M$185,8,FALSE))","v":""},null,3,{"$f":"IF($O$3=\"k\",IF(VLOOKUP($L14,invullijst!$A$11:$M$185,11,FALSE)=0,\" \",VLOOKUP($L14,invullijst!$A$11:$M$185,11,FALSE)),\"\")","v":""},{"$f":"IF(VLOOKUP($L14,invullijst!$A$11:$M$226,4,FALSE)=\"\",\"\",VLOOKUP($L14,invullijst!$A$11:$M$226,4,FALSE))","v":0},null,{"$f":"IF(VLOOKUP($L14,invullijst!$A$11:$M$185,2,FALSE)=\"\",\"\",VLOOKUP($L14,invullijst!$A$11:$M$185,2,FALSE))","v":0},null,{"$f":"IF(VLOOKUP($L14,invullijst!$A$11:$M$185,8,FALSE)=0,\"\",VLOOKUP($L14,invullijst!$A$11:$M$185,8,FALSE))","v":""}]
[4,{"$f":"IF($G$3=\"k\",IF(VLOOKUP($D15,invullijst!$A$11:$M$185,11,FALSE)=0,\" \",VLOOKUP($D15,invullijst!$A$11:$M$185,11,FALSE)),\"\")","v":""},{"$f":"IF(VLOOKUP(D15,invullijst!A$11:F$226,4,FALSE)=\"\",\"\",VLOOKUP(D15,invullijst!A$11:D$226,4,FALSE))","v":0},null,{"$f":"IF(VLOOKUP($D15,invullijst!$A$11:$M$185,2,FALSE)=\"\",\"\",VLOOKUP($D15,invullijst!$A$11:$M$185,2,FALSE))","v":0},null,{"$f":"IF(VLOOKUP($D15,invullijst!$A$11:$M$185,8,FALSE)=0,\"\",VLOOKUP($D15,invullijst!$A$11:$M$185,8,FALSE))","v":""},null,4,{"$f":"IF($O$3=\"k\",IF(VLOOKUP($L15,invullijst!$A$11:$M$185,11,FALSE)=0,\" \",VLOOKUP($L15,invullijst!$A$11:$M$185,11,FALSE)),\"\")","v":""},{"$f":"IF(VLOOKUP($L15,invullijst!$A$11:$M$226,4,FALSE)=\"\",\"\",VLOOKUP($L15,invullijst!$A$11:$M$226,4,FALSE))","v":0},null,{"$f":"IF(VLOOKUP($L15,invullijst!$A$11:$M$185,2,FALSE)=\"\",\"\",VLOOKUP($L15,invullijst!$A$11:$M$185,2,FALSE))","v":0},null,{"$f":"IF(VLOOKUP($L15,invullijst!$A$11:$M$185,8,FALSE)=0,\"\",VLOOKUP($L15,invullijst!$A$11:$M$185,8,FALSE))","v":""}]
["Totaal B1 korps",{"$nulls":5},{"$f":"SUM(G12:G15)","v":53},null,"Totaal B1 korps",{"$nulls":5},{"$f":"SUM(O12:O15)","v":128}]
[]
[1,{"$f":"IF($G$3=\"k\",IF(VLOOKUP($D18,invullijst!$A$11:$M$185,11,FALSE)=0,\" \",VLOOKUP($D18,invullijst!$A$11:$M$185,11,FALSE)),\"\")","v":""},{"$f":"IF(VLOOKUP(D18,invullijst!A$11:F$226,4,FALSE)=\"\",\"\",VLOOKUP(D18,invullijst!A$11:D$226,4,FALSE))","v":0},null,{"$f":"IF(VLOOKUP($D18,invullijst!$A$11:$M$185,2,FALSE)=\"\",\"\",VLOOKUP($D18,invullijst!$A$11:$M$185,2,FALSE))","v":0},null,{"$f":"IF(VLOOKUP($D18,invullijst!$A$11:$M$185,8,FALSE)=0,\"\",VLOOKUP($D18,invullijst!$A$11:$M$185,8,FALSE))","v":""},null,1,{"$f":"IF($O$3=\"k\",IF(VLOOKUP($L18,invullijst!$A$11:$M$185,11,FALSE)=0,\" \",VLOOKUP($L18,invullijst!$A$11:$M$185,11,FALSE)),\"\")","v":""},{"$f":"IF(VLOOKUP($L18,invullijst!$A$11:$M$226,4,FALSE)=\"\",\"\",VLOOKUP($L18,invullijst!$A$11:$M$226,4,FALSE))","v":0},null,{"$f":"IF(VLOOKUP($L18,invullijst!$A$11:$M$185,2,FALSE)=\"\",\"\",VLOOKUP($L18,invullijst!$A$11:$M$185,2,FALSE))","v":0},null,{"$f":"IF(VLOOKUP($L18,invullijst!$A$11:$M$185,8,FALSE)=0,\"\",VLOOKUP($L18,invullijst!$A$11:$M$185,8,FALSE))","v":""}]
[2,{"$f":"IF($G$3=\"k\",IF(VLOOKUP($D19,invullijst!$A$11:$M$185,11,FALSE)=0,\" \",VLOOKUP($D19,invullijst!$A$11:$M$185,11,FALSE)),\"\")","v":""},{"$f":"IF(VLOOKUP(D19,invullijst!A$11:F$226,4,FALSE)=\"\",\"\",VLOOKUP(D19,invullijst!A$11:D$226,4,FALSE))","v":0},null,{"$f":"IF(VLOOKUP($D19,invullijst!$A$11:$M$185,2,FALSE)=\"\",\"\",VLOOKUP($D19,invullijst!$A$11:$M$185,2,FALSE))","v":0},null,{"$f":"IF(VLOOKUP($D19,invullijst!$A$11:$M$185,8,FALSE)=0,\"\",VLOOKUP($D19,invullijst!$A$11:$M$185,8,FALSE))","v":""},null,2,{"$f":"IF($O$3=\"k\",IF(VLOOKUP($L19,invullijst!$A$11:$M$185,11,FALSE)=0,\" \",VLOOKUP($L19,invullijst!$A$11:$M$185,11,FALSE)),\"\")","v":""},{"$f":"IF(VLOOKUP($L19,invullijst!$A$11:$M$226,4,FALSE)=\"\",\"\",VLOOKUP($L19,invullijst!$A$11:$M$226,4,FALSE))","v":0},null,{"$f":"IF(VLOOKUP($L19,invullijst!$A$11:$M$185,2,FALSE)=\"\",\"\",VLOOKUP($L19,invullijst!$A$11:$M$185,2,FALSE))","v":0},null,{"$f":"IF(VLOOKUP($L19,invullijst!$A$11:$M$185,8,FALSE)=0,\"\",VLOOKUP($L19,invullijst!$A$11:$M$185,8,FALSE))","v":""}]
[3,{"$f":"IF($G$3=\"k\",IF(VLOOKUP($D20,invullijst!$A$11:$M$185,11,FALSE)=0,\" \",VLOOKUP($D20,invullijst!$A$11:$M$185,11,FALSE)),\"\")","v":""},{"$f":"IF(VLOOKUP(D20,invullijst!A$11:F$226,4,FALSE)=\"\",\"\",VLOOKUP(D20,invullijst!A$11:D$226,4,FALSE))","v":0},null,{"$f":"IF(VLOOKUP($D20,invullijst!$A$11:$M$185,2,FALSE)=\"\",\"\",VLOOKUP($D20,invullijst!$A$11:$M$185,2,FALSE))","v":0},null,{"$f":"IF(VLOOKUP($D20,invullijst!$A$11:$M$185,8,FALSE)=0,\"\",VLOOKUP($D20,invullijst!$A$11:$M$185,8,FALSE))","v":""},null,3,{"$f":"IF($O$3=\"k\",IF(VLOOKUP($L20,invullijst!$A$11:$M$185,11,FALSE)=0,\" \",VLOOKUP($L20,invullijst!$A$11:$M$185,11,FALSE)),\"\")","v":""},{"$f":"IF(VLOOKUP($L20,invullijst!$A$11:$M$226,4,FALSE)=\"\",\"\",VLOOKUP($L20,invullijst!$A$11:$M$226,4,FALSE))","v":0},null,{"$f":"IF(VLOOKUP($L20,invullijst!$A$11:$M$185,2,FALSE)=\"\",\"\",VLOOKUP($L20,invullijst!$A$11:$M$185,2,FALSE))","v":0},null,{"$f":"IF(VLOOKUP($L20,invullijst!$A$11:$M$185,8,FALSE)=0,\"\",VLOOKUP($L20,invullijst!$A$11:$M$185,8,FALSE))","v":""}]
[4,"inh",{"$f":"IF(VLOOKUP(D21,invullijst!A$11:F$226,4,FALSE)=\"\",\"\",VLOOKUP(D21,invullijst!A$11:D$226,4,FALSE))","v":"vr"},406,{"$f":"IF(VLOOKUP($D21,invullijst!$A$11:$M$185,2,FALSE)=\"\",\"\",VLOOKUP($D21,invullijst!$A$11:$M$185,2,FALSE))","v":"Jeroen van Oss"},null,82,null,4,{"$f":"IF($O$3=\"k\",IF(VLOOKUP($L21,invullijst!$A$11:$M$185,11,FALSE)=0,\" \",VLOOKUP($L21,invullijst!$A$11:$M$185,11,FALSE)),\"\")","v":""},{"$f":"IF(VLOOKUP($L21,invullijst!$A$11:$M$226,4,FALSE)=\"\",\"\",VLOOKUP($L21,invullijst!$A$11:$M$226,4,FALSE))","v":0},null,{"$f":"IF(VLOOKUP($L21,invullijst!$A$11:$M$185,2,FALSE)=\"\",\"\",VLOOKUP($L21,invullijst!$A$11:$M$185,2,FALSE))","v":0},null,{"$f":"IF(VLOOKUP($L21,invullijst!$A$11:$M$185,8,FALSE)=0,\"\",VLOOKUP($L21,invullijst!$A$11:$M$185,8,FALSE))","v":""}]
["DIVERSEN / INHAAL",{"$nulls":7},"DIVERSEN / INHAAL"]
[]
["OPGELEGD (Jeugd <16 en 65+)"]
[1,{"$f":"IF($G$3=\"k\",IF(VLOOKUP($D25,invullijst!$A$11:$M$185,11,FALSE)=0,\" \",VLOOKUP($D25,invullijst!$A$11:$M$185,11,FALSE)),\"\")","v":""},{"$f":"IF(VLOOKUP(D25,invullijst!A$11:F$226,4,FALSE)=\"\",\"\",VLOOKUP(D25,invullijst!A$11:D$226,4,FALSE))","v":"65+"},405,{"$f":"IF(VLOOKUP($D25,invullijst!$A$11:$M$185,2,FALSE)=\"\",\"\",VLOOKUP($D25,invullijst!$A$11:$M$185,2,FALSE))","v":"Jan de Vaan"},null,{"$f":"IF(VLOOKUP($D25,invullijst!$A$11:$M$185,8,FALSE)=0,\"\",VLOOKUP($D25,invullijst!$A$11:$M$185,8,FALSE))","v":97},null,1,{"$f":"IF($O$3=\"k\",IF(VLOOKUP($L25,invullijst!$A$11:$M$185,11,FALSE)=0,\" \",VLOOKUP($L25,invullijst!$A$11:$M$185,11,FALSE)),\"\")","v":""},{"$f":"IF(VLOOKUP($L25,invullijst!$A$11:$M$226,4,FALSE)=\"\",\"\",VLOOKUP($L25,invullijst!$A$11:$M$226,4,FALSE))","v":"65+"},107,{"$f":"IF(VLOOKUP($L25,invullijst!$A$11:$M$185,2,FALSE)=\"\",\"\",VLOOKUP($L25,invullijst!$A$11:$M$185,2,FALSE))","v":"Cees Coppens"},null,{"$f":"IF(VLOOKUP($L25,invullijst!$A$11:$M$185,8,FALSE)=0,\"\",VLOOKUP($L25,invullijst!$A$11:$M$185,8,FALSE))","v":80}]
[2,{"$f":"IF($G$3=\"k\",IF(VLOOKUP($D26,invullijst!$A$11:$M$185,11,FALSE)=0,\" \",VLOOKUP($D26,invullijst!$A$11:$M$185,11,FALSE)),\"\")","v":""},{"$f":"IF(VLOOKUP(D26,invullijst!A$11:F$226,4,FALSE)=\"\",\"\",VLOOKUP(D26,invullijst!A$11:D$226,4,FALSE))","v":"65+"},401,{"$f":"IF(VLOOKUP($D26,invullijst!$A$11:$M$185,2,FALSE)=\"\",\"\",VLOOKUP($D26,invullijst!$A$11:$M$185,2,FALSE))","v":"Frans van Beurden"},null,{"$f":"IF(VLOOKUP($D26,invullijst!$A$11:$M$185,8,FALSE)=0,\"\",VLOOKUP($D26,invullijst!$A$11:$M$185,8,FALSE))","v":98},null,2,{"$f":"IF($O$3=\"k\",IF(VLOOKUP($L26,invullijst!$A$11:$M$185,11,FALSE)=0,\" \",VLOOKUP($L26,invullijst!$A$11:$M$185,11,FALSE)),\"\")","v":""},{"$f":"IF(VLOOKUP($L26,invullijst!$A$11:$M$226,4,FALSE)=\"\",\"\",VLOOKUP($L26,invullijst!$A$11:$M$226,4,FALSE))","v":"65+"},104,{"$f":"IF(VLOOKUP($L26,invullijst!$A$11:$M$185,2,FALSE)=\"\",\"\",VLOOKUP($L26,invullijst!$A$11:$M$185,2,FALSE))","v":"Peter Brekelmans"},null,{"$f":"IF(VLOOKUP($L26,invullijst!$A$11:$M$185,8,FALSE)=0,\"\",VLOOKUP($L26,invullijst!$A$11:$M$185,8,FALSE))","v":73}]
[3,{"$f":"IF($G$3=\"k\",IF(VLOOKUP($D27,invullijst!$A$11:$M$185,11,FALSE)=0,\" \",VLOOKUP($D27,invullijst!$A$11:$M$185,11,FALSE)),\"\")","v":""},{"$f":"IF(VLOOKUP(D27,invullijst!A$11:F$226,4,FALSE)=\"\",\"\",VLOOKUP(D27,invullijst!A$11:D$226,4,FALSE))","v":"65+"},404,{"$f":"IF(VLOOKUP($D27,invullijst!$A$11:$M$185,2,FALSE)=\"\",\"\",VLOOKUP($D27,invullijst!$A$11:$M$185,2,FALSE))","v":"Gerard van Beurden"},null,{"$f":"IF(VLOOKUP($D27,invullijst!$A$11:$M$185,8,FALSE)=0,\"\",VLOOKUP($D27,invullijst!$A$11:$M$185,8,FALSE))","v":98},null,3,{"$f":"IF($O$3=\"k\",IF(VLOOKUP($L27,invullijst!$A$11:$M$185,11,FALSE)=0,\" \",VLOOKUP($L27,invullijst!$A$11:$M$185,11,FALSE)),\"\")","v":""},{"$f":"IF(VLOOKUP($L27,invullijst!$A$11:$M$226,4,FALSE)=\"\",\"\",VLOOKUP($L27,invullijst!$A$11:$M$226,4,FALSE))","v":0},null,{"$f":"IF(VLOOKUP($L27,invullijst!$A$11:$M$185,2,FALSE)=\"\",\"\",VLOOKUP($L27,invullijst!$A$11:$M$185,2,FALSE))","v":0},null,{"$f":"IF(VLOOKUP($L27,invullijst!$A$11:$M$185,8,FALSE)=0,\"\",VLOOKUP($L27,invullijst!$A$11:$M$185,8,FALSE))","v":""}]
["Totaal korps opgelegd A1",{"$nulls":5},{"$f":"SUM(G25:G27)","v":293},null,"Totaal korps opgelegd A1",{"$nulls":5},{"$f":"SUM(O25:O27)","v":153}]
[]
[1,{"$f":"IF($G$3=\"k\",IF(VLOOKUP($D30,invullijst!$A$11:$M$185,11,FALSE)=0,\" \",VLOOKUP($D30,invullijst!$A$11:$M$185,11,FALSE)),\"\")","v":""},{"$f":"IF(VLOOKUP(D30,invullijst!A$11:F$226,4,FALSE)=\"\",\"\",VLOOKUP(D30,invullijst!A$11:D$226,4,FALSE))","v":"65+"},413,{"$f":"IF(VLOOKUP($D30,invullijst!$A$11:$M$185,2,FALSE)=\"\",\"\",VLOOKUP($D30,invullijst!$A$11:$M$185,2,FALSE))","v":"Frans Mommersteeg"},null,{"$f":"IF(VLOOKUP($D30,invullijst!$A$11:$M$185,8,FALSE)=0,\"\",VLOOKUP($D30,invullijst!$A$11:$M$185,8,FALSE))","v":96},null,1,{"$f":"IF($O$3=\"k\",IF(VLOOKUP($L30,invullijst!$A$11:$M$185,11,FALSE)=0,\" \",VLOOKUP($L30,invullijst!$A$11:$M$185,11,FALSE)),\"\")","v":""},{"$f":"IF(VLOOKUP($L30,invullijst!$A$11:$M$226,4,FALSE)=\"\",\"\",VLOOKUP($L30,invullijst!$A$11:$M$226,4,FALSE))","v":0},null,{"$f":"IF(VLOOKUP($L30,invullijst!$A$11:$M$185,2,FALSE)=\"\",\"\",VLOOKUP($L30,invullijst!$A$11:$M$185,2,FALSE))","v":0},null,{"$f":"IF(VLOOKUP($L30,invullijst!$A$11:$M$185,8,FALSE)=0,\"\",VLOOKUP($L30,invullijst!$A$11:$M$185,8,FALSE))","v":""}]
[2,{"$f":"IF($G$3=\"k\",IF(VLOOKUP($D31,invullijst!$A$11:$M$185,11,FALSE)=0,\" \",VLOOKUP($D31,invullijst!$A$11:$M$185,11,FALSE)),\"\")","v":""},{"$f":"IF(VLOOKUP(D31,invullijst!A$11:F$226,4,FALSE)=\"\",\"\",VLOOKUP(D31,invullijst!A$11:D$226,4,FALSE))","v":"65+"},415,{"$f":"IF(VLOOKUP($D31,invullijst!$A$11:$M$185,2,FALSE)=\"\",\"\",VLOOKUP($D31,invullijst!$A$11:$M$185,2,FALSE))","v":"Wim de Gouw"},null,{"$f":"IF(VLOOKUP($D31,invullijst!$A$11:$M$185,8,FALSE)=0,\"\",VLOOKUP($D31,invullijst!$A$11:$M$185,8,FALSE))","v":95},null,2,{"$f":"IF($O$3=\"k\",IF(VLOOKUP($L31,invullijst!$A$11:$M$185,11,FALSE)=0,\" \",VLOOKUP($L31,invullijst!$A$11:$M$185,11,FALSE)),\"\")","v":""},{"$f":"IF(VLOOKUP($L31,invullijst!$A$11:$M$226,4,FALSE)=\"\",\"\",VLOOKUP($L31,invullijst!$A$11:$M$226,4,FALSE))","v":0},null,{"$f":"IF(VLOOKUP($L31,invullijst!$A$11:$M$185,2,FALSE)=\"\",\"\",VLOOKUP($L31,invullijst!$A$11:$M$185,2,FALSE))","v":0},null,{"$f":"IF(VLOOKUP($L31,invullijst!$A$11:$M$185,8,FALSE)=0,\"\",VLOOKUP($L31,invullijst!$A$11:$M$185,8,FALSE))","v":""}]
[3,{"$f":"IF($G$3=\"k\",IF(VLOOKUP($D32,invullijst!$A$11:$M$185,11,FALSE)=0,\" \",VLOOKUP($D32,invullijst!$A$11:$M$185,11,FALSE)),\"\")","v":""},{"$f":"IF(VLOOKUP(D32,invullijst!A$11:F$226,4,FALSE)=\"\",\"\",VLOOKUP(D32,invullijst!A$11:D$226,4,FALSE))","v":"65+"},403,{"$f":"IF(VLOOKUP($D32,invullijst!$A$11:$M$185,2,FALSE)=\"\",\"\",VLOOKUP($D32,invullijst!$A$11:$M$185,2,FALSE))","v":"Dorien de Kort"},null,{"$f":"IF(VLOOKUP($D32,invullijst!$A$11:$M$185,8,FALSE)=0,\"\",VLOOKUP($D32,invullijst!$A$11:$M$185,8,FALSE))","v":95},null,3,{"$f":"IF($O$3=\"k\",IF(VLOOKUP($L32,invullijst!$A$11:$M$185,11,FALSE)=0,\" \",VLOOKUP($L32,invullijst!$A$11:$M$185,11,FALSE)),\"\")","v":""},{"$f":"IF(VLOOKUP($L32,invullijst!$A$11:$M$226,4,FALSE)=\"\",\"\",VLOOKUP($L32,invullijst!$A$11:$M$226,4,FALSE))","v":0},null,{"$f":"IF(VLOOKUP($L32,invullijst!$A$11:$M$185,2,FALSE)=\"\",\"\",VLOOKUP($L32,invullijst!$A$11:$M$185,2,FALSE))","v":0},null,{"$f":"IF(VLOOKUP($L32,invullijst!$A$11:$M$185,8,FALSE)=0,\"\",VLOOKUP($L32,invullijst!$A$11:$M$185,8,FALSE))","v":""}]
["Totaal korps opgelegd A2",{"$nulls":5},{"$f":"SUM(G30:G32)","v":286},null,"Totaal korps opgelegd A2",{"$nulls":5},{"$f":"SUM(O30:O32)","v":0}]
[]
[1,{"$f":"IF($G$3=\"k\",IF(VLOOKUP($D35,invullijst!$A$11:$M$185,11,FALSE)=0,\" \",VLOOKUP($D35,invullijst!$A$11:$M$185,11,FALSE)),\"\")","v":""},{"$f":"IF(VLOOKUP(D35,invullijst!A$11:F$226,4,FALSE)=\"\",\"\",VLOOKUP(D35,invullijst!A$11:D$226,4,FALSE))","v":"65+"},412,{"$f":"IF(VLOOKUP($D35,invullijst!$A$11:$M$185,2,FALSE)=\"\",\"\",VLOOKUP($D35,invullijst!$A$11:$M$185,2,FALSE))","v":"Francien v/d Wiel"},null,{"$f":"IF(VLOOKUP($D35,invullijst!$A$11:$M$185,8,FALSE)=0,\"\",VLOOKUP($D35,invullijst!$A$11:$M$185,8,FALSE))","v":96},null,1,{"$f":"IF($O$3=\"k\",IF(VLOOKUP($L35,invullijst!$A$11:$M$185,11,FALSE)=0,\" \",VLOOKUP($L35,invullijst!$A$11:$M$185,11,FALSE)),\"\")","v":""},{"$f":"IF(VLOOKUP($L35,invullijst!$A$11:$M$226,4,FALSE)=\"\",\"\",VLOOKUP($L35,invullijst!$A$11:$M$226,4,FALSE))","v":0},null,{"$f":"IF(VLOOKUP($L35,invullijst!$A$11:$M$185,2,FALSE)=\"\",\"\",VLOOKUP($L35,invullijst!$A$11:$M$185,2,FALSE))","v":0},null,{"$f":"IF(VLOOKUP($L35,invullijst!$A$11:$M$185,8,FALSE)=0,\"\",VLOOKUP($L35,invullijst!$A$11:$M$185,8,FALSE))","v":""}]
[2,{"$f":"IF($G$3=\"k\",IF(VLOOKUP($D36,invullijst!$A$11:$M$185,11,FALSE)=0,\" \",VLOOKUP($D36,invullijst!$A$11:$M$185,11,FALSE)),\"\")","v":""},{"$f":"IF(VLOOKUP(D36,invullijst!A$11:F$226,4,FALSE)=\"\",\"\",VLOOKUP(D36,invullijst!A$11:D$226,4,FALSE))","v":0},null,{"$f":"IF(VLOOKUP($D36,invullijst!$A$11:$M$185,2,FALSE)=\"\",\"\",VLOOKUP($D36,invullijst!$A$11:$M$185,2,FALSE))","v":0},null,{"$f":"IF(VLOOKUP($D36,invullijst!$A$11:$M$185,8,FALSE)=0,\"\",VLOOKUP($D36,invullijst!$A$11:$M$185,8,FALSE))","v":""},null,2,{"$f":"IF($O$3=\"k\",IF(VLOOKUP($L36,invullijst!$A$11:$M$185,11,FALSE)=0,\" \",VLOOKUP($L36,invullijst!$A$11:$M$185,11,FALSE)),\"\")","v":""},{"$f":"IF(VLOOKUP($L36,invullijst!$A$11:$M$226,4,FALSE)=\"\",\"\",VLOOKUP($L36,invullijst!$A$11:$M$226,4,FALSE))","v":0},null,{"$f":"IF(VLOOKUP($L36,invullijst!$A$11:$M$185,2,FALSE)=\"\",\"\",VLOOKUP($L36,invullijst!$A$11:$M$185,2,FALSE))","v":0},null,{"$f":"IF(VLOOKUP($L36,invullijst!$A$11:$M$185,8,FALSE)=0,\"\",VLOOKUP($L36,invullijst!$A$11:$M$185,8,FALSE))","v":""}]
[3,{"$f":"IF($G$3=\"k\",IF(VLOOKUP($D37,invullijst!$A$11:$M$185,11,FALSE)=0,\" \",VLOOKUP($D37,invullijst!$A$11:$M$185,11,FALSE)),\"\")","v":""},{"$f":"IF(VLOOKUP(D37,invullijst!A$11:F$226,4,FALSE)=\"\",\"\",VLOOKUP(D37,invullijst!A$11:D$226,4,FALSE))","v":0},null,{"$f":"IF(VLOOKUP($D37,invullijst!$A$11:$M$185,2,FALSE)=\"\",\"\",VLOOKUP($D37,invullijst!$A$11:$M$185,2,FALSE))","v":0},null,{"$f":"IF(VLOOKUP($D37,invullijst!$A$11:$M$185,8,FALSE)=0,\"\",VLOOKUP($D37,invullijst!$A$11:$M$185,8,FALSE))","v":""},null,3,{"$f":"IF($O$3=\"k\",IF(VLOOKUP($L37,invullijst!$A$11:$M$185,11,FALSE)=0,\" \",VLOOKUP($L37,invullijst!$A$11:$M$185,11,FALSE)),\"\")","v":""},{"$f":"IF(VLOOKUP($L37,invullijst!$A$11:$M$226,4,FALSE)=\"\",\"\",VLOOKUP($L37,invullijst!$A$11:$M$226,4,FALSE))","v":0},null,{"$f":"IF(VLOOKUP($L37,invullijst!$A$11:$M$185,2,FALSE)=\"\",\"\",VLOOKUP($L37,invullijst!$A$11:$M$185,2,FALSE))","v":0},null,{"$f":"IF(VLOOKUP($L37,invullijst!$A$11:$M$185,8,FALSE)=0,\"\",VLOOKUP($L37,invullijst!$A$11:$M$185,8,FALSE))","v":""}]
["Totaal korps opgelegd A3",{"$nulls":5},{"$f":"SUM(G35:G37)","v":96},null,"Totaal korps opgelegd A3",{"$nulls":5},{"$f":"SUM(O35:O37)","v":0}]

{"sheet":"wedstrijd 4A","index":11,"n_rows":38,"n_cols":15,"rows_kept":38,"merged":[[0,0,0,4],[0,5,0,7],[0,8,0,14],[1,0,1,11],[1,12,1,14],[2,1,2,5],[2,9,2,13],[4,0,4,14],[5,4,5,5],[5,12,5,13],[6,4,6,5],[6,12,6,13],[7,4,7,5],[7,12,7,13],[8,4,8,5],[8,12,8,13],[9,0,9,5],[9,8,9,13],[11,4,11,5],[11,12,11,13],[12,4,12,5],[12,12,12,13],[13,4,13,5],[13,12,13,13],[14,4,14,5],[14,12,14,13],[15,0,15,5],[15,8,15,13],[17,4,17,5],[17,12,17,13],[18,4,18,5],[18,12,18,13],[19,4,19,5],[19,12,19,13],[20,4,20,5],[20,12,20,13],[21,0,21,5],[21,8,21,13],[23,0,23,14],[24,4,24,5],[24,12,24,13],[25,4,25,5],[25,12,25,13],[26,4,26,5],[26,12,26,13],[27,0,27,5],[27,8,27,13],[29,4,29,5],[29,12,29,13],[30,4,30,5],[30,12,30,13],[31,4,31,5],[31,12,31,13],[32,0,32,5],[32,8,32,13],[34,4,34,5],[34,12,34,13],[35,4,35,5],[35,12,35,13],[36,4,36,5],[36,12,36,13],[37,0,37,5],[37,8,37,13]]}
[{"$f":"invullijst!F1","v":"Organistatie"},{"$nulls":4},{"$f":"invullijst!H2","v":"2024 - 2025"},null,null,{"$f":"invullijst!F3","v":"O.L.V. Schuts Elshout"}]
["Datum: ",{"$nulls":11},"2025-02-23"]
[4,{"$f":"IF(VLOOKUP(A3,invullijst!A1:F5,2,FALSE)=\"\",\"\",VLOOKUP(A3,invullijst!A1:F5,2,FALSE))","v":"Sint Ambrosius Haarsteeg"},{"$nulls":4},"k",null,3,{"$f":"IF(VLOOKUP(I3,invullijst!A1:C5,2,FALSE)=\"\",\"\",VLOOKUP(I3,invullijst!A1:C5,2,FALSE))","v":"O.L.V. Schuts Elshout"}]
[]
["vrijehand"]
[1,{"$f":"IF($G$3=\"k\",IF(VLOOKUP($D6,invullijst!$A$11:$M$185,11,FALSE)=0,\" \",VLOOKUP($D6,invullijst!$A$11:$M$185,11,FALSE)),\"\")","v":43},{"$f":"IF(VLOOKUP(D6,invullijst!A$11:F$226,4,FALSE)=\"\",\"\",VLOOKUP(D6,invullijst!A$11:D$226,4,FALSE))","v":"vr"},402,{"$f":"IF(VLOOKUP($D6,invullijst!$A$11:$M$185,2,FALSE)=\"\",\"\",VLOOKUP($D6,invullijst!$A$11:$M$185,2,FALSE))","v":"Daniëlle v/d Lee"},null,{"$f":"IF(VLOOKUP($D6,invullijst!$A$11:$M$185,9,FALSE)=0,\"\",VLOOKUP($D6,invullijst!$A$11:$M$185,9,FALSE))","v":84},null,1,{"$f":"IF($O$3=\"k\",IF(VLOOKUP($L6,invullijst!$A$11:$M$185,11,FALSE)=0,\" \",VLOOKUP($L6,invullijst!$A$11:$M$185,11,FALSE)),\"\")","v":""},{"$f":"IF(VLOOKUP($L6,invullijst!$A$11:$M$226,4,FALSE)=\"\",\"\",VLOOKUP($L6,invullijst!$A$11:$M$226,4,FALSE))","v":"vr"},302,{"$f":"IF(VLOOKUP($L6,invullijst!$A$11:$M$185,2,FALSE)=\"\",\"\",VLOOKUP($L6,invullijst!$A$11:$M$185,2,FALSE))","v":"Freek de Jong"},null,{"$f":"IF(VLOOKUP($L6,invullijst!$A$11:$M$185,9,FALSE)=0,\"\",VLOOKUP($L6,invullijst!$A$11:$M$185,9,FALSE))","v":88}]
[2,{"$f":"IF($G$3=\"k\",IF(VLOOKUP($D7,invullijst!$A$11:$M$185,11,FALSE)=0,\" \",VLOOKUP($D7,invullijst!$A$11:$M$185,11,FALSE)),\"\")","v":40},{"$f":"IF(VLOOKUP(D7,invullijst!A$11:F$226,4,FALSE)=\"\",\"\",VLOOKUP(D7,invullijst!A$11:D$226,4,FALSE))","v":"vr"},410,{"$f":"IF(VLOOKUP($D7,invullijst!$A$11:$M$185,2,FALSE)=\"\",\"\",VLOOKUP($D7,invullijst!$A$11:$M$185,2,FALSE))","v":"Tonnie Koks"},null,{"$f":"IF(VLOOKUP($D7,invullijst!$A$11:$M$185,9,FALSE)=0,\"\",VLOOKUP($D7,invullijst!$A$11:$M$185,9,FALSE))","v":83},null,2,{"$f":"IF($O$3=\"k\",IF(VLOOKUP($L7,invullijst!$A$11:$M$185,11,FALSE)=0,\" \",VLOOKUP($L7,invullijst!$A$11:$M$185,11,FALSE)),\"\")","v":""},{"$f":"IF(VLOOKUP($L7,invullijst!$A$11:$M$226,4,FALSE)=\"\",\"\",VLOOKUP($L7,invullijst!$A$11:$M$226,4,FALSE))","v":"vr"},305,{"$f":"IF(VLOOKUP($L7,invullijst!$A$11:$M$185,2,FALSE)=\"\",\"\",VLOOKUP($L7,invullijst!$A$11:$M$185,2,FALSE))","v":"Johan Klerx"},null,{"$f":"IF(VLOOKUP($L7,invullijst!$A$11:$M$185,9,FALSE)=0,\"\",VLOOKUP($L7,invullijst!$A$11:$M$185,9,FALSE))","v":84}]
[3,{"$f":"IF($G$3=\"k\",IF(VLOOKUP($D8,invullijst!$A$11:$M$185,11,FALSE)=0,\" \",VLOOKUP($D8,invullijst!$A$11:$M$185,11,FALSE)),\"\")","v":38},{"$f":"IF(VLOOKUP(D8,invullijst!A$11:F$226,4,FALSE)=\"\",\"\",VLOOKUP(D8,invullijst!A$11:D$226,4,FALSE))","v":"vr"},408,{"$f":"IF(VLOOKUP($D8,invullijst!$A$11:$M$185,2,FALSE)=\"\",\"\",VLOOKUP($D8,invullijst!$A$11:$M$185,2,FALSE))","v":"Rudy van Falier"},null,{"$f":"IF(VLOOKUP($D8,invullijst!$A$11:$M$185,9,FALSE)=0,\"\",VLOOKUP($D8,invullijst!$A$11:$M$185,9,FALSE))","v":82},null,3,{"$f":"IF($O$3=\"k\",IF(VLOOKUP($L8,invullijst!$A$11:$M$185,11,FALSE)=0,\" \",VLOOKUP($L8,invullijst!$A$11:$M$185,11,FALSE)),\"\")","v":""},{"$f":"IF(VLOOKUP($L8,invullijst!$A$11:$M$226,4,FALSE)=\"\",\"\",VLOOKUP($L8,invullijst!$A$11:$M$226,4,FALSE))","v":"vr"},304,{"$f":"IF(VLOOKUP($L8,invullijst!$A$11:$M$185,2,FALSE)=\"\",\"\",VLOOKUP($L8,invullijst!$A$11:$M$185,2,FALSE))","v":"Henk Bruurmijn "},null,{"$f":"IF(VLOOKUP($L8,invullijst!$A$11:$M$185,9,FALSE)=0,\"\",VLOOKUP($L8,invullijst!$A$11:$M$185,9,FALSE))","v":82}]
[4,{"$f":"IF($G$3=\"k\",IF(VLOOKUP($D9,invullijst!$A$11:$M$185,11,FALSE)=0,\" \",VLOOKUP($D9,invullijst!$A$11:$M$185,11,FALSE)),\"\")","v":40},{"$f":"IF(VLOOKUP(D9,invullijst!A$11:F$226,4,FALSE)=\"\",\"\",VLOOKUP(D9,invullijst!A$11:D$226,4,FALSE))","v":"vr"},406,{"$f":"IF(VLOOKUP($D9,invullijst!$A$11:$M$185,2,FALSE)=\"\",\"\",VLOOKUP($D9,invullijst!$A$11:$M$185,2,FALSE))","v":"Jeroen van Oss"},null,{"$f":"IF(VLOOKUP($D9,invullijst!$A$11:$M$185,9,FALSE)=0,\"\",VLOOKUP($D9,invullijst!$A$11:$M$185,9,FALSE))","v":78},null,4,{"$f":"IF($O$3=\"k\",IF(VLOOKUP($L9,invullijst!$A$11:$M$185,11,FALSE)=0,\" \",VLOOKUP($L9,invullijst!$A$11:$M$185,11,FALSE)),\"\")","v":""},{"$f":"IF(VLOOKUP($L9,invullijst!$A$11:$M$226,4,FALSE)=\"\",\"\",VLOOKUP($L9,invullijst!$A$11:$M$226,4,FALSE))","v":"vr"},306,{"$f":"IF(VLOOKUP($L9,invullijst!$A$11:$M$185,2,FALSE)=\"\",\"\",VLOOKUP($L9,invullijst!$A$11:$M$185,2,FALSE))","v":"Ron Groot"},null,{"$f":"IF(VLOOKUP($L9,invullijst!$A$11:$M$185,9,FALSE)=0,\"\",VLOOKUP($L9,invullijst!$A$11:$M$185,9,FALSE))","v":82}]
["Totaal A korps",{"$nulls":5},{"$f":"SUM(G6:G9)","v":327},null,"Totaal A korps",{"$nulls":5},{"$f":"SUM(O6:O9)","v":336}]
[]
[1,{"$f":"IF($G$3=\"k\",IF(VLOOKUP($D12,invullijst!$A$11:$M$185,11,FALSE)=0,\" \",VLOOKUP($D12,invullijst!$A$11:$M$185,11,FALSE)),\"\")","v":32},{"$f":"IF(VLOOKUP(D12,invullijst!A$11:F$226,4,FALSE)=\"\",\"\",VLOOKUP(D12,invullijst!A$11:D$226,4,FALSE))","v":"vr"},411,{"$f":"IF(VLOOKUP($D12,invullijst!$A$11:$M$185,2,FALSE)=\"\",\"\",VLOOKUP($D12,invullijst!$A$11:$M$185,2,FALSE))","v":"Wilma v/d Lee"},null,{"$f":"IF(VLOOKUP($D12,invullijst!$A$11:$M$185,9,FALSE)=0,\"\",VLOOKUP($D12,invullijst!$A$11:$M$185,9,FALSE))","v":76},null,1,{"$f":"IF($O$3=\"k\",IF(VLOOKUP($L12,invullijst!$A$11:$M$185,11,FALSE)=0,\" \",VLOOKUP($L12,invullijst!$A$11:$M$185,11,FALSE)),\"\")","v":""},{"$f":"IF(VLOOKUP($L12,invullijst!$A$11:$M$226,4,FALSE)=\"\",\"\",VLOOKUP($L12,invullijst!$A$11:$M$226,4,FALSE))","v":0},null,{"$f":"IF(VLOOKUP($L12,invullijst!$A$11:$M$185,2,FALSE)=\"\",\"\",VLOOKUP($L12,invullijst!$A$11:$M$185,2,FALSE))","v":0},null,{"$f":"IF(VLOOKUP($L12,invullijst!$A$11:$M$185,9,FALSE)=0,\"\",VLOOKUP($L12,invullijst!$A$11:$M$185,9,FALSE))","v":""}]
[2,{"$f":"IF($G$3=\"k\",IF(VLOOKUP($D13,invullijst!$A$11:$M$185,11,FALSE)=0,\" \",VLOOKUP($D13,invullijst!$A$11:$M$185,11,FALSE)),\"\")","v":" "},{"$f":"IF(VLOOKUP(D13,invullijst!A$11:F$226,4,FALSE)=\"\",\"\",VLOOKUP(D13,invullijst!A$11:D$226,4,FALSE))","v":0},null,{"$f":"IF(VLOOKUP($D13,invullijst!$A$11:$M$185,2,FALSE)=\"\",\"\",VLOOKUP($D13,invullijst!$A$11:$M$185,2,FALSE))","v":0},null,{"$f":"IF(VLOOKUP($D13,invullijst!$A$11:$M$185,9,FALSE)=0,\"\",VLOOKUP($D13,invullijst!$A$11:$M$185,9,FALSE))","v":""},null,2,{"$f":"IF($O$3=\"k\",IF(VLOOKUP($L13,invullijst!$A$11:$M$185,11,FALSE)=0,\" \",VLOOKUP($L13,invullijst!$A$11:$M$185,11,FALSE)),\"\")","v":""},{"$f":"IF(VLOOKUP($L13,invullijst!$A$11:$M$226,4,FALSE)=\"\",\"\",VLOOKUP($L13,invullijst!$A$11:$M$226,4,FALSE))","v":0},null,{"$f":"IF(VLOOKUP($L13,invullijst!$A$11:$M$185,2,FALSE)=\"\",\"\",VLOOKUP($L13,invullijst!$A$11:$M$185,2,FALSE))","v":0},null,{"$f":"IF(VLOOKUP($L13,invullijst!$A$11:$M$185,9,FALSE)=0,\"\",VLOOKUP($L13,invullijst!$A$11:$M$185,9,FALSE))","v":""}]
[3,{"$f":"IF($G$3=\"k\",IF(VLOOKUP($D14,invullijst!$A$11:$M$185,11,FALSE)=0,\" \",VLOOKUP($D14,invullijst!$A$11:$M$185,11,FALSE)),\"\")","v":" "},{"$f":"IF(VLOOKUP(D14,invullijst!A$11:F$226,4,FALSE)=\"\",\"\",VLOOKUP(D14,invullijst!A$11:D$226,4,FALSE))","v":0},null,{"$f":"IF(VLOOKUP($D14,invullijst!$A$11:$M$185,2,FALSE)=\"\",\"\",VLOOKUP($D14,invullijst!$A$11:$M$185,2,FALSE))","v":0},null,{"$f":"IF(VLOOKUP($D14,invullijst!$A$11:$M$185,9,FALSE)=0,\"\",VLOOKUP($D14,invullijst!$A$11:$M$185,9,FALSE))","v":""},null,3,{"$f":"IF($O$3=\"k\",IF(VLOOKUP($L14,invullijst!$A$11:$M$185,11,FALSE)=0,\" \",VLOOKUP($L14,invullijst!$A$11:$M$185,11,FALSE)),\"\")","v":""},{"$f":"IF(VLOOKUP($L14,invullijst!$A$11:$M$226,4,FALSE)=\"\",\"\",VLOOKUP($L14,invullijst!$A$11:$M$226,4,FALSE))","v":0},null,{"$f":"IF(VLOOKUP($L14,invullijst!$A$11:$M$185,2,FALSE)=\"\",\"\",VLOOKUP($L14,invullijst!$A$11:$M$185,2,FALSE))","v":0},null,{"$f":"IF(VLOOKUP($L14,invullijst!$A$11:$M$185,9,FALSE)=0,\"\",VLOOKUP($L14,invullijst!$A$11:$M$185,9,FALSE))","v":""}]
[4,{"$f":"IF($G$3=\"k\",IF(VLOOKUP($D15,invullijst!$A$11:$M$185,11,FALSE)=0,\" \",VLOOKUP($D15,invullijst!$A$11:$M$185,11,FALSE)),\"\")","v":" "},{"$f":"IF(VLOOKUP(D15,invullijst!A$11:F$226,4,FALSE)=\"\",\"\",VLOOKUP(D15,invullijst!A$11:D$226,4,FALSE))","v":0},null,{"$f":"IF(VLOOKUP($D15,invullijst!$A$11:$M$185,2,FALSE)=\"\",\"\",VLOOKUP($D15,invullijst!$A$11:$M$185,2,FALSE))","v":0},null,{"$f":"IF(VLOOKUP($D15,invullijst!$A$11:$M$185,9,FALSE)=0,\"\",VLOOKUP($D15,invullijst!$A$11:$M$185,9,FALSE))","v":""},null,4,{"$f":"IF($O$3=\"k\",IF(VLOOKUP($L15,invullijst!$A$11:$M$185,11,FALSE)=0,\" \",VLOOKUP($L15,invullijst!$A$11:$M$185,11,FALSE)),\"\")","v":""},{"$f":"IF(VLOOKUP($L15,invullijst!$A$11:$M$226,4,FALSE)=\"\",\"\",VLOOKUP($L15,invullijst!$A$11:$M$226,4,FALSE))","v":0},null,{"$f":"IF(VLOOKUP($L15,invullijst!$A$11:$M$185,2,FALSE)=\"\",\"\",VLOOKUP($L15,invullijst!$A$11:$M$185,2,FALSE))","v":0},null,{"$f":"IF(VLOOKUP($L15,invullijst!$A$11:$M$185,9,FALSE)=0,\"\",VLOOKUP($L15,invullijst!$A$11:$M$185,9,FALSE))","v":""}]
["Totaal B1 korps",{"$nulls":5},{"$f":"SUM(G12:G15)","v":76},null,"Totaal B1 korps",{"$nulls":5},{"$f":"SUM(O12:O15)","v":0}]
[]
[1,{"$f":"IF($G$3=\"k\",IF(VLOOKUP($D18,invullijst!$A$11:$M$185,11,FALSE)=0,\" \",VLOOKUP($D18,invullijst!$A$11:$M$185,11,FALSE)),\"\")","v":" "},{"$f":"IF(VLOOKUP(D18,invullijst!A$11:F$226,4,FALSE)=\"\",\"\",VLOOKUP(D18,invullijst!A$11:D$226,4,FALSE))","v":0},null,{"$f":"IF(VLOOKUP($D18,invullijst!$A$11:$M$185,2,FALSE)=\"\",\"\",VLOOKUP($D18,invullijst!$A$11:$M$185,2,FALSE))","v":0},null,{"$f":"IF(VLOOKUP($D18,invullijst!$A$11:$M$185,9,FALSE)=0,\"\",VLOOKUP($D18,invullijst!$A$11:$M$185,9,FALSE))","v":""},null,1,{"$f":"IF($O$3=\"k\",IF(VLOOKUP($L18,invullijst!$A$11:$M$185,11,FALSE)=0,\" \",VLOOKUP($L18,invullijst!$A$11:$M$185,11,FALSE)),\"\")","v":""},{"$f":"IF(VLOOKUP($L18,invullijst!$A$11:$M$226,4,FALSE)=\"\",\"\",VLOOKUP($L18,invullijst!$A$11:$M$226,4,FALSE))","v":0},null,{"$f":"IF(VLOOKUP($L18,invullijst!$A$11:$M$185,2,FALSE)=\"\",\"\",VLOOKUP($L18,invullijst!$A$11:$M$185,2,FALSE))","v":0},null,{"$f":"IF(VLOOKUP($L18,invullijst!$A$11:$M$185,9,FALSE)=0,\"\",VLOOKUP($L18,invullijst!$A$11:$M$185,9,FALSE))","v":""}]
[2,{"$f":"IF($G$3=\"k\",IF(VLOOKUP($D19,invullijst!$A$11:$M$185,11,FALSE)=0,\" \",VLOOKUP($D19,invullijst!$A$11:$M$185,11,FALSE)),\"\")","v":" "},{"$f":"IF(VLOOKUP(D19,invullijst!A$11:F$226,4,FALSE)=\"\",\"\",VLOOKUP(D19,invullijst!A$11:D$226,4,FALSE))","v":0},null,{"$f":"IF(VLOOKUP($D19,invullijst!$A$11:$M$185,2,FALSE)=\"\",\"\",VLOOKUP($D19,invullijst!$A$11:$M$185,2,FALSE))","v":0},null,{"$f":"IF(VLOOKUP($D19,invullijst!$A$11:$M$185,9,FALSE)=0,\"\",VLOOKUP($D19,invullijst!$A$11:$M$185,9,FALSE))","v":""},null,2,{"$f":"IF($O$3=\"k\",IF(VLOOKUP($L19,invullijst!$A$11:$M$185,11,FALSE)=0,\" \",VLOOKUP($L19,invullijst!$A$11:$M$185,11,FALSE)),\"\")","v":""},{"$f":"IF(VLOOKUP($L19,invullijst!$A$11:$M$226,4,FALSE)=\"\",\"\",VLOOKUP($L19,invullijst!$A$11:$M$226,4,FALSE))","v":0},null,{"$f":"IF(VLOOKUP($L19,invullijst!$A$11:$M$185,2,FALSE)=\"\",\"\",VLOOKUP($L19,invullijst!$A$11:$M$185,2,FALSE))","v":0},null,{"$f":"IF(VLOOKUP($L19,invullijst!$A$11:$M$185,9,FALSE)=0,\"\",VLOOKUP($L19,invullijst!$A$11:$M$185,9,FALSE))","v":""}]
[3,{"$f":"IF($G$3=\"k\",IF(VLOOKUP($D20,invullijst!$A$11:$M$185,11,FALSE)=0,\" \",VLOOKUP($D20,invullijst!$A$11:$M$185,11,FALSE)),\"\")","v":" "},{"$f":"IF(VLOOKUP(D20,invullijst!A$11:F$226,4,FALSE)=\"\",\"\",VLOOKUP(D20,invullijst!A$11:D$226,4,FALSE))","v":0},null,{"$f":"IF(VLOOKUP($D20,invullijst!$A$11:$M$185,2,FALSE)=\"\",\"\",VLOOKUP($D20,invullijst!$A$11:$M$185,2,FALSE))","v":0},null,{"$f":"IF(VLOOKUP($D20,invullijst!$A$11:$M$185,9,FALSE)=0,\"\",VLOOKUP($D20,invullijst!$A$11:$M$185,9,FALSE))","v":""},null,3,{"$f":"IF($O$3=\"k\",IF(VLOOKUP($L20,invullijst!$A$11:$M$185,11,FALSE)=0,\" \",VLOOKUP($L20,invullijst!$A$11:$M$185,11,FALSE)),\"\")","v":""},{"$f":"IF(VLOOKUP($L20,invullijst!$A$11:$M$226,4,FALSE)=\"\",\"\",VLOOKUP($L20,invullijst!$A$11:$M$226,4,FALSE))","v":0},null,{"$f":"IF(VLOOKUP($L20,invullijst!$A$11:$M$185,2,FALSE)=\"\",\"\",VLOOKUP($L20,invullijst!$A$11:$M$185,2,FALSE))","v":0},null,{"$f":"IF(VLOOKUP($L20,invullijst!$A$11:$M$185,9,FALSE)=0,\"\",VLOOKUP($L20,invullijst!$A$11:$M$185,9,FALSE))","v":""}]
[4,{"$f":"IF($G$3=\"k\",IF(VLOOKUP($D21,invullijst!$A$11:$M$185,11,FALSE)=0,\" \",VLOOKUP($D21,invullijst!$A$11:$M$185,11,FALSE)),\"\")","v":" "},{"$f":"IF(VLOOKUP(D21,invullijst!A$11:F$226,4,FALSE)=\"\",\"\",VLOOKUP(D21,invullijst!A$11:D$226,4,FALSE))","v":0},null,{"$f":"IF(VLOOKUP($D21,invullijst!$A$11:$M$185,2,FALSE)=\"\",\"\",VLOOKUP($D21,invullijst!$A$11:$M$185,2,FALSE))","v":0},null,{"$f":"IF(VLOOKUP($D21,invullijst!$A$11:$M$185,9,FALSE)=0,\"\",VLOOKUP($D21,invullijst!$A$11:$M$185,9,FALSE))","v":""},null,4,{"$f":"IF($O$3=\"k\",IF(VLOOKUP($L21,invullijst!$A$11:$M$185,11,FALSE)=0,\" \",VLOOKUP($L21,invullijst!$A$11:$M$185,11,FALSE)),\"\")","v":""},{"$f":"IF(VLOOKUP($L21,invullijst!$A$11:$M$226,4,FALSE)=\"\",\"\",VLOOKUP($L21,invullijst!$A$11:$M$226,4,FALSE))","v":0},null,{"$f":"IF(VLOOKUP($L21,invullijst!$A$11:$M$185,2,FALSE)=\"\",\"\",VLOOKUP($L21,invullijst!$A$11:$M$185,2,FALSE))","v":0},null,{"$f":"IF(VLOOKUP($L21,invullijst!$A$11:$M$185,9,FALSE)=0,\"\",VLOOKUP($L21,invullijst!$A$11:$M$185,9,FALSE))","v":""}]
["DIVERSEN / INHAAL",{"$nulls":7},"DIVERSEN / INHAAL"]
[]
["OPGELEGD (Jeugd <16 en 65+)"]
[1,{"$f":"IF($G$3=\"k\",IF(VLOOKUP($D25,invullijst!$A$11:$M$185,11,FALSE)=0,\" \",VLOOKUP($D25,invullijst!$A$11:$M$185,11,FALSE)),\"\")","v":48},{"$f":"IF(VLOOKUP(D25,invullijst!A$11:F$226,4,FALSE)=\"\",\"\",VLOOKUP(D25,invullijst!A$11:D$226,4,FALSE))","v":"65+"},401,{"$f":"IF(VLOOKUP($D25,invullijst!$A$11:$M$185,2,FALSE)=\"\",\"\",VLOOKUP($D25,invullijst!$A$11:$M$185,2,FALSE))","v":"Frans van Beurden"},null,{"$f":"IF(VLOOKUP($D25,invullijst!$A$11:$M$185,9,FALSE)=0,\"\",VLOOKUP($D25,invullijst!$A$11:$M$185,9,FALSE))","v":98},null,1,{"$f":"IF($O$3=\"k\",IF(VLOOKUP($L25,invullijst!$A$11:$M$185,11,FALSE)=0,\" \",VLOOKUP($L25,invullijst!$A$11:$M$185,11,FALSE)),\"\")","v":""},{"$f":"IF(VLOOKUP($L25,invullijst!$A$11:$M$226,4,FALSE)=\"\",\"\",VLOOKUP($L25,invullijst!$A$11:$M$226,4,FALSE))","v":"65+"},307,{"$f":"IF(VLOOKUP($L25,invullijst!$A$11:$M$185,2,FALSE)=\"\",\"\",VLOOKUP($L25,invullijst!$A$11:$M$185,2,FALSE))","v":"Bert van Engelen"},null,{"$f":"IF(VLOOKUP($L25,invullijst!$A$11:$M$185,9,FALSE)=0,\"\",VLOOKUP($L25,invullijst!$A$11:$M$185,9,FALSE))","v":94}]
[2,{"$f":"IF($G$3=\"k\",IF(VLOOKUP($D26,invullijst!$A$11:$M$185,11,FALSE)=0,\" \",VLOOKUP($D26,invullijst!$A$11:$M$185,11,FALSE)),\"\")","v":48},{"$f":"IF(VLOOKUP(D26,invullijst!A$11:F$226,4,FALSE)=\"\",\"\",VLOOKUP(D26,invullijst!A$11:D$226,4,FALSE))","v":"65+"},405,{"$f":"IF(VLOOKUP($D26,invullijst!$A$11:$M$185,2,FALSE)=\"\",\"\",VLOOKUP($D26,invullijst!$A$11:$M$185,2,FALSE))","v":"Jan de Vaan"},null,{"$f":"IF(VLOOKUP($D26,invullijst!$A$11:$M$185,9,FALSE)=0,\"\",VLOOKUP($D26,invullijst!$A$11:$M$185,9,FALSE))","v":96},null,2,{"$f":"IF($O$3=\"k\",IF(VLOOKUP($L26,invullijst!$A$11:$M$185,11,FALSE)=0,\" \",VLOOKUP($L26,invullijst!$A$11:$M$185,11,FALSE)),\"\")","v":""},{"$f":"IF(VLOOKUP($L26,invullijst!$A$11:$M$226,4,FALSE)=\"\",\"\",VLOOKUP($L26,invullijst!$A$11:$M$226,4,FALSE))","v":"65+"},309,{"$f":"IF(VLOOKUP($L26,invullijst!$A$11:$M$185,2,FALSE)=\"\",\"\",VLOOKUP($L26,invullijst!$A$11:$M$185,2,FALSE))","v":"René de Jong"},null,{"$f":"IF(VLOOKUP($L26,invullijst!$A$11:$M$185,9,FALSE)=0,\"\",VLOOKUP($L26,invullijst!$A$11:$M$185,9,FALSE))","v":88}]
[3,{"$f":"IF($G$3=\"k\",IF(VLOOKUP($D27,invullijst!$A$11:$M$185,11,FALSE)=0,\" \",VLOOKUP($D27,invullijst!$A$11:$M$185,11,FALSE)),\"\")","v":49},{"$f":"IF(VLOOKUP(D27,invullijst!A$11:F$226,4,FALSE)=\"\",\"\",VLOOKUP(D27,invullijst!A$11:D$226,4,FALSE))","v":"65+"},404,{"$f":"IF(VLOOKUP($D27,invullijst!$A$11:$M$185,2,FALSE)=\"\",\"\",VLOOKUP($D27,invullijst!$A$11:$M$185,2,FALSE))","v":"Gerard van Beurden"},null,{"$f":"IF(VLOOKUP($D27,invullijst!$A$11:$M$185,9,FALSE)=0,\"\",VLOOKUP($D27,invullijst!$A$11:$M$185,9,FALSE))","v":96},null,3,{"$f":"IF($O$3=\"k\",IF(VLOOKUP($L27,invullijst!$A$11:$M$185,11,FALSE)=0,\" \",VLOOKUP($L27,invullijst!$A$11:$M$185,11,FALSE)),\"\")","v":""},{"$f":"IF(VLOOKUP($L27,invullijst!$A$11:$M$226,4,FALSE)=\"\",\"\",VLOOKUP($L27,invullijst!$A$11:$M$226,4,FALSE))","v":"65+"},301,{"$f":"IF(VLOOKUP($L27,invullijst!$A$11:$M$185,2,FALSE)=\"\",\"\",VLOOKUP($L27,invullijst!$A$11:$M$185,2,FALSE))","v":"Arjen van Assem disp"},null,{"$f":"IF(VLOOKUP($L27,invullijst!$A$11:$M$185,9,FALSE)=0,\"\",VLOOKUP($L27,invullijst!$A$11:$M$185,9,FALSE))","v":92}]
["Totaal korps opgelegd A1",{"$nulls":5},{"$f":"SUM(G25:G27)","v":290},null,"Totaal korps opgelegd A1",{"$nulls":5},{"$f":"SUM(O25:O27)","v":274}]
[]
[1,{"$f":"IF($G$3=\"k\",IF(VLOOKUP($D30,invullijst!$A$11:$M$185,11,FALSE)=0,\" \",VLOOKUP($D30,invullijst!$A$11:$M$185,11,FALSE)),\"\")","v":47},{"$f":"IF(VLOOKUP(D30,invullijst!A$11:F$226,4,FALSE)=\"\",\"\",VLOOKUP(D30,invullijst!A$11:D$226,4,FALSE))","v":"65+"},413,{"$f":"IF(VLOOKUP($D30,invullijst!$A$11:$M$185,2,FALSE)=\"\",\"\",VLOOKUP($D30,invullijst!$A$11:$M$185,2,FALSE))","v":"Frans Mommersteeg"},null,{"$f":"IF(VLOOKUP($D30,invullijst!$A$11:$M$185,9,FALSE)=0,\"\",VLOOKUP($D30,invullijst!$A$11:$M$185,9,FALSE))","v":94},null,1,{"$f":"IF($O$3=\"k\",IF(VLOOKUP($L30,invullijst!$A$11:$M$185,11,FALSE)=0,\" \",VLOOKUP($L30,invullijst!$A$11:$M$185,11,FALSE)),\"\")","v":""},{"$f":"IF(VLOOKUP($L30,invullijst!$A$11:$M$226,4,FALSE)=\"\",\"\",VLOOKUP($L30,invullijst!$A$11:$M$226,4,FALSE))","v":"65+"},310,{"$f":"IF(VLOOKUP($L30,invullijst!$A$11:$M$185,2,FALSE)=\"\",\"\",VLOOKUP($L30,invullijst!$A$11:$M$185,2,FALSE))","v":"Tiny Boom"}]
[2,{"$f":"IF($G$3=\"k\",IF(VLOOKUP($D31,invullijst!$A$11:$M$185,11,FALSE)=0,\" \",VLOOKUP($D31,invullijst!$A$11:$M$185,11,FALSE)),\"\")","v":49},{"$f":"IF(VLOOKUP(D31,invullijst!A$11:F$226,4,FALSE)=\"\",\"\",VLOOKUP(D31,invullijst!A$11:D$226,4,FALSE))","v":"65+"},403,{"$f":"IF(VLOOKUP($D31,invullijst!$A$11:$M$185,2,FALSE)=\"\",\"\",VLOOKUP($D31,invullijst!$A$11:$M$185,2,FALSE))","v":"Dorien de Kort"},null,{"$f":"IF(VLOOKUP($D31,invullijst!$A$11:$M$185,9,FALSE)=0,\"\",VLOOKUP($D31,invullijst!$A$11:$M$185,9,FALSE))","v":96},null,2,{"$f":"IF($O$3=\"k\",IF(VLOOKUP($L31,invullijst!$A$11:$M$185,11,FALSE)=0,\" \",VLOOKUP($L31,invullijst!$A$11:$M$185,11,FALSE)),\"\")","v":""},{"$f":"IF(VLOOKUP($L31,invullijst!$A$11:$M$226,4,FALSE)=\"\",\"\",VLOOKUP($L31,invullijst!$A$11:$M$226,4,FALSE))","v":0},null,{"$f":"IF(VLOOKUP($L31,invullijst!$A$11:$M$185,2,FALSE)=\"\",\"\",VLOOKUP($L31,invullijst!$A$11:$M$185,2,FALSE))","v":0},null,{"$f":"IF(VLOOKUP($L31,invullijst!$A$11:$M$185,9,FALSE)=0,\"\",VLOOKUP($L31,invullijst!$A$11:$M$185,9,FALSE))","v":""}]
[3,{"$f":"IF($G$3=\"k\",IF(VLOOKUP($D32,invullijst!$A$11:$M$185,11,FALSE)=0,\" \",VLOOKUP($D32,invullijst!$A$11:$M$185,11,FALSE)),\"\")","v":46},{"$f":"IF(VLOOKUP(D32,invullijst!A$11:F$226,4,FALSE)=\"\",\"\",VLOOKUP(D32,invullijst!A$11:D$226,4,FALSE))","v":"65+"},415,{"$f":"IF(VLOOKUP($D32,invullijst!$A$11:$M$185,2,FALSE)=\"\",\"\",VLOOKUP($D32,invullijst!$A$11:$M$185,2,FALSE))","v":"Wim de Gouw"},null,{"$f":"IF(VLOOKUP($D32,invullijst!$A$11:$M$185,9,FALSE)=0,\"\",VLOOKUP($D32,invullijst!$A$11:$M$185,9,FALSE))","v":96},null,3,{"$f":"IF($O$3=\"k\",IF(VLOOKUP($L32,invullijst!$A$11:$M$185,11,FALSE)=0,\" \",VLOOKUP($L32,invullijst!$A$11:$M$185,11,FALSE)),\"\")","v":""},{"$f":"IF(VLOOKUP($L32,invullijst!$A$11:$M$226,4,FALSE)=\"\",\"\",VLOOKUP($L32,invullijst!$A$11:$M$226,4,FALSE))","v":0},null,{"$f":"IF(VLOOKUP($L32,invullijst!$A$11:$M$185,2,FALSE)=\"\",\"\",VLOOKUP($L32,invullijst!$A$11:$M$185,2,FALSE))","v":0},null,{"$f":"IF(VLOOKUP($L32,invullijst!$A$11:$M$185,9,FALSE)=0,\"\",VLOOKUP($L32,invullijst!$A$11:$M$185,9,FALSE))","v":""}]
["Totaal korps opgelegd A2",{"$nulls":5},{"$f":"SUM(G30:G32)","v":286},null,"Totaal korps opgelegd A2",{"$nulls":5},{"$f":"SUM(O30:O32)","v":0}]
[]
[1,{"$f":"IF($G$3=\"k\",IF(VLOOKUP($D35,invullijst!$A$11:$M$185,11,FALSE)=0,\" \",VLOOKUP($D35,invullijst!$A$11:$M$185,11,FALSE)),\"\")","v":48},{"$f":"IF(VLOOKUP(D35,invullijst!A$11:F$226,4,FALSE)=\"\",\"\",VLOOKUP(D35,invullijst!A$11:D$226,4,FALSE))","v":"65+"},412,{"$f":"IF(VLOOKUP($D35,invullijst!$A$11:$M$185,2,FALSE)=\"\",\"\",VLOOKUP($D35,invullijst!$A$11:$M$185,2,FALSE))","v":"Francien v/d Wiel"},null,{"$f":"IF(VLOOKUP($D35,invullijst!$A$11:$M$185,9,FALSE)=0,\"\",VLOOKUP($D35,invullijst!$A$11:$M$185,9,FALSE))","v":96},null,1,{"$f":"IF($O$3=\"k\",IF(VLOOKUP($L35,invullijst!$A$11:$M$185,11,FALSE)=0,\" \",VLOOKUP($L35,invullijst!$A$11:$M$185,11,FALSE)),\"\")","v":""},{"$f":"IF(VLOOKUP($L35,invullijst!$A$11:$M$226,4,FALSE)=\"\",\"\",VLOOKUP($L35,invullijst!$A$11:$M$226,4,FALSE))","v":0},null,{"$f":"IF(VLOOKUP($L35,invullijst!$A$11:$M$185,2,FALSE)=\"\",\"\",VLOOKUP($L35,invullijst!$A$11:$M$185,2,FALSE))","v":0},null,{"$f":"IF(VLOOKUP($L35,invullijst!$A$11:$M$185,9,FALSE)=0,\"\",VLOOKUP($L35,invullijst!$A$11:$M$185,9,FALSE))","v":""}]
[2,{"$f":"IF($G$3=\"k\",IF(VLOOKUP($D36,invullijst!$A$11:$M$185,11,FALSE)=0,\" \",VLOOKUP($D36,invullijst!$A$11:$M$185,11,FALSE)),\"\")","v":" "},{"$f":"IF(VLOOKUP(D36,invullijst!A$11:F$226,4,FALSE)=\"\",\"\",VLOOKUP(D36,invullijst!A$11:D$226,4,FALSE))","v":0},null,{"$f":"IF(VLOOKUP($D36,invullijst!$A$11:$M$185,2,FALSE)=\"\",\"\",VLOOKUP($D36,invullijst!$A$11:$M$185,2,FALSE))","v":0},null,{"$f":"IF(VLOOKUP($D36,invullijst!$A$11:$M$185,9,FALSE)=0,\"\",VLOOKUP($D36,invullijst!$A$11:$M$185,9,FALSE))","v":""},null,2,{"$f":"IF($O$3=\"k\",IF(VLOOKUP($L36,invullijst!$A$11:$M$185,11,FALSE)=0,\" \",VLOOKUP($L36,invullijst!$A$11:$M$185,11,FALSE)),\"\")","v":""},{"$f":"IF(VLOOKUP($L36,invullijst!$A$11:$M$226,4,FALSE)=\"\",\"\",VLOOKUP($L36,invullijst!$A$11:$M$226,4,FALSE))","v":0},null,{"$f":"IF(VLOOKUP($L36,invullijst!$A$11:$M$185,2,FALSE)=\"\",\"\",VLOOKUP($L36,invullijst!$A$11:$M$185,2,FALSE))","v":0},null,{"$f":"IF(VLOOKUP($L36,invullijst!$A$11:$M$185,9,FALSE)=0,\"\",VLOOKUP($L36,invullijst!$A$11:$M$185,9,FALSE))","v":""}]
[3,{"$f":"IF($G$3=\"k\",IF(VLOOKUP($D37,invullijst!$A$11:$M$185,11,FALSE)=0,\" \",VLOOKUP($D37,invullijst!$A$11:$M$185,11,FALSE)),\"\")","v":" "},{"$f":"IF(VLOOKUP(D37,invullijst!A$11:F$226,4,FALSE)=\"\",\"\",VLOOKUP(D37,invullijst!A$11:D$226,4,FALSE))","v":0},null,{"$f":"IF(VLOOKUP($D37,invullijst!$A$11:$M$185,2,FALSE)=\"\",\"\",VLOOKUP($D37,invullijst!$A$11:$M$185,2,FALSE))","v":0},null,{"$f":"IF(VLOOKUP($D37,invullijst!$A$11:$M$185,9,FALSE)=0,\"\",VLOOKUP($D37,invullijst!$A$11:$M$185,9,FALSE))","v":""},null,3,{"$f":"IF($O$3=\"k\",IF(VLOOKUP($L37,invullijst!$A$11:$M$185,11,FALSE)=0,\" \",VLOOKUP($L37,invullijst!$A$11:$M$185,11,FALSE)),\"\")","v":""},{"$f":"IF(VLOOKUP($L37,invullijst!$A$11:$M$226,4,FALSE)=\"\",\"\",VLOOKUP($L37,invullijst!$A$11:$M$226,4,FALSE))","v":0},null,{"$f":"IF(VLOOKUP($L37,invullijst!$A$11:$M$185,2,FALSE)=\"\",\"\",VLOOKUP($L37,invullijst!$A$11:$M$185,2,FALSE))","v":0},null,{"$f":"IF(VLOOKUP($L37,invullijst!$A$11:$M$185,9,FALSE)=0,\"\",VLOOKUP($L37,invullijst!$A$11:$M$185,9,FALSE))","v":""}]
["Totaal korps opgelegd A3",{"$nulls":5},{"$f":"SUM(G35:G37)","v":96},null,"Totaal korps opgelegd A3",{"$nulls":5},{"$f":"SUM(O35:O37)","v":0}]

{"sheet":"wedstrijd 4B","index":12,"n_rows":38,"n_cols":15,"rows_kept":38,"merged":[[0,0,0,4],[0,5,0,7],[0,8,0,14],[1,0,1,11],[1,12,1,14],[2,1,2,5],[2,9,2,13],[4,0,4,14],[5,4,5,5],[5,12,5,13],[6,4,6,5],[6,12,6,13],[7,4,7,5],[7,12,7,13],[8,4,8,5],[8,12,8,13],[9,0,9,5],[9,8,9,13],[11,4,11,5],[11,12,11,13],[12,4,12,5],[12,12,12,13],[13,4,13,5],[13,12,13,13],[14,4,14,5],[14,12,14,13],[15,0,15,5],[15,8,15,13],[17,4,17,5],[17,12,17,13],[18,4,18,5],[18,12,18,13],[19,4,19,5],[19,12,19,13],[20,4,20,5],[20,12,20,13],[21,0,21,5],[21,8,21,13],[23,0,23,14],[24,4,24,5],[24,12,24,13],[25,4,25,5],[25,12,25,13],[26,4,26,5],[26,12,26,13],[27,0,27,5],[27,8,27,13],[29,4,29,5],[29,12,29,13],[30,4,30,5],[30,12,30,13],[31,4,31,5],[31,12,31,13],[32,0,32,5],[32,8,32,13],[34,4,34,5],[34,12,34,13],[35,4,35,5],[35,12,35,13],[36,4,36,5],[36,12,36,13],[37,0,37,5],[37,8,37,13]]}
[{"$f":"invullijst!F1","v":"Organistatie"},{"$nulls":4},{"$f":"invullijst!H2","v":"2024 - 2025"},null,null,{"$f":"invullijst!F3","v":"O.L.V. Schuts Elshout"}]
["Datum: ",{"$nulls":11},"2025-02-23"]
[1,{"$f":"IF(VLOOKUP(A3,invullijst!A1:F5,2,FALSE)=\"\",\"\",VLOOKUP(A3,invullijst!A1:F5,2,FALSE))","v":"Sint Ambrosius Baardwijk"},{"$nulls":4},"k",null,5,{"$f":"IF(VLOOKUP(I3,invullijst!A1:C5,2,FALSE)=\"\",\"\",VLOOKUP(I3,invullijst!A1:C5,2,FALSE))","v":"Sint Jan Baptist Kaatsheuvel"},{"$nulls":4},"k"]
[]
["vrijehand"]
[1,{"$f":"IF($G$3=\"k\",IF(VLOOKUP($D6,invullijst!$A$11:$M$185,11,FALSE)=0,\" \",VLOOKUP($D6,invullijst!$A$11:$M$185,11,FALSE)),\"\")","v":42},{"$f":"IF(VLOOKUP(D6,invullijst!A$11:F$226,4,FALSE)=\"\",\"\",VLOOKUP(D6,invullijst!A$11:D$226,4,FALSE))","v":"vr"},105,{"$f":"IF(VLOOKUP($D6,invullijst!$A$11:$M$185,2,FALSE)=\"\",\"\",VLOOKUP($D6,invullijst!$A$11:$M$185,2,FALSE))","v":"René Klijn"},null,{"$f":"IF(VLOOKUP($D6,invullijst!$A$11:$M$185,9,FALSE)=0,\"\",VLOOKUP($D6,invullijst!$A$11:$M$185,9,FALSE))","v":80},null,1,{"$f":"IF($O$3=\"k\",IF(VLOOKUP($L6,invullijst!$A$11:$M$185,11,FALSE)=0,\" \",VLOOKUP($L6,invullijst!$A$11:$M$185,11,FALSE)),\"\")","v":42},{"$f":"IF(VLOOKUP($L6,invullijst!$A$11:$M$226,4,FALSE)=\"\",\"\",VLOOKUP($L6,invullijst!$A$11:$M$226,4,FALSE))","v":"vr"},506,{"$f":"IF(VLOOKUP($L6,invullijst!$A$11:$M$185,2,FALSE)=\"\",\"\",VLOOKUP($L6,invullijst!$A$11:$M$185,2,FALSE))","v":"Maikel Monden"},null,{"$f":"IF(VLOOKUP($L6,invullijst!$A$11:$M$185,9,FALSE)=0,\"\",VLOOKUP($L6,invullijst!$A$11:$M$185,9,FALSE))","v":75}]
[2,{"$f":"IF($G$3=\"k\",IF(VLOOKUP($D7,invullijst!$A$11:$M$185,11,FALSE)=0,\" \",VLOOKUP($D7,invullijst!$A$11:$M$185,11,FALSE)),\"\")","v":41},{"$f":"IF(VLOOKUP(D7,invullijst!A$11:F$226,4,FALSE)=\"\",\"\",VLOOKUP(D7,invullijst!A$11:D$226,4,FALSE))","v":"vr"},106,{"$f":"IF(VLOOKUP($D7,invullijst!$A$11:$M$185,2,FALSE)=\"\",\"\",VLOOKUP($D7,invullijst!$A$11:$M$185,2,FALSE))","v":"René Pullens"},null,{"$f":"IF(VLOOKUP($D7,invullijst!$A$11:$M$185,9,FALSE)=0,\"\",VLOOKUP($D7,invullijst!$A$11:$M$185,9,FALSE))","v":77},null,2,{"$f":"IF($O$3=\"k\",IF(VLOOKUP($L7,invullijst!$A$11:$M$185,11,FALSE)=0,\" \",VLOOKUP($L7,invullijst!$A$11:$M$185,11,FALSE)),\"\")","v":41},{"$f":"IF(VLOOKUP($L7,invullijst!$A$11:$M$226,4,FALSE)=\"\",\"\",VLOOKUP($L7,invullijst!$A$11:$M$226,4,FALSE))","v":"vr"},501,{"$f":"IF(VLOOKUP($L7,invullijst!$A$11:$M$185,2,FALSE)=\"\",\"\",VLOOKUP($L7,invullijst!$A$11:$M$185,2,FALSE))","v":"Annette Vos"},null,{"$f":"IF(VLOOKUP($L7,invullijst!$A$11:$M$185,9,FALSE)=0,\"\",VLOOKUP($L7,invullijst!$A$11:$M$185,9,FALSE))","v":76}]
[3,{"$f":"IF($G$3=\"k\",IF(VLOOKUP($D8,invullijst!$A$11:$M$185,11,FALSE)=0,\" \",VLOOKUP($D8,invullijst!$A$11:$M$185,11,FALSE)),\"\")","v":35},{"$f":"IF(VLOOKUP(D8,invullijst!A$11:F$226,4,FALSE)=\"\",\"\",VLOOKUP(D8,invullijst!A$11:D$226,4,FALSE))","v":"vr"},108,{"$f":"IF(VLOOKUP($D8,invullijst!$A$11:$M$185,2,FALSE)=\"\",\"\",VLOOKUP($D8,invullijst!$A$11:$M$185,2,FALSE))","v":"Bram Pullens"},null,{"$f":"IF(VLOOKUP($D8,invullijst!$A$11:$M$185,9,FALSE)=0,\"\",VLOOKUP($D8,invullijst!$A$11:$M$185,9,FALSE))","v":84},null,3,{"$f":"IF($O$3=\"k\",IF(VLOOKUP($L8,invullijst!$A$11:$M$185,11,FALSE)=0,\" \",VLOOKUP($L8,invullijst!$A$11:$M$185,11,FALSE)),\"\")","v":31},{"$f":"IF(VLOOKUP($L8,invullijst!$A$11:$M$226,4,FALSE)=\"\",\"\",VLOOKUP($L8,invullijst!$A$11:$M$226,4,FALSE))","v":"vr"},513,{"$f":"IF(VLOOKUP($L8,invullijst!$A$11:$M$185,2,FALSE)=\"\",\"\",VLOOKUP($L8,invullijst!$A$11:$M$185,2,FALSE))","v":"Mark van Delft"},null,{"$f":"IF(VLOOKUP($L8,invullijst!$A$11:$M$185,9,FALSE)=0,\"\",VLOOKUP($L8,invullijst!$A$11:$M$185,9,FALSE))","v":80}]
[4,{"$f":"IF($G$3=\"k\",IF(VLOOKUP($D9,invullijst!$A$11:$M$185,11,FALSE)=0,\" \",VLOOKUP($D9,invullijst!$A$11:$M$185,11,FALSE)),\"\")","v":35},{"$f":"IF(VLOOKUP(D9,invullijst!A$11:F$226,4,FALSE)=\"\",\"\",VLOOKUP(D9,invullijst!A$11:D$226,4,FALSE))","v":"vr"},109,{"$f":"IF(VLOOKUP($D9,invullijst!$A$11:$M$185,2,FALSE)=\"\",\"\",VLOOKUP($D9,invullijst!$A$11:$M$185,2,FALSE))","v":"Gijs Pullens"},null,{"$f":"IF(VLOOKUP($D9,invullijst!$A$11:$M$185,9,FALSE)=0,\"\",VLOOKUP($D9,invullijst!$A$11:$M$185,9,FALSE))","v":75},null,4,{"$f":"IF($O$3=\"k\",IF(VLOOKUP($L9,invullijst!$A$11:$M$185,11,FALSE)=0,\" \",VLOOKUP($L9,invullijst!$A$11:$M$185,11,FALSE)),\"\")","v":34},{"$f":"IF(VLOOKUP($L9,invullijst!$A$11:$M$226,4,FALSE)=\"\",\"\",VLOOKUP($L9,invullijst!$A$11:$M$226,4,FALSE))","v":"vr"},508,{"$f":"IF(VLOOKUP($L9,invullijst!$A$11:$M$185,2,FALSE)=\"\",\"\",VLOOKUP($L9,invullijst!$A$11:$M$185,2,FALSE))","v":"Rowan Dobbelsteen"},null,{"$f":"IF(VLOOKUP($L9,invullijst!$A$11:$M$185,9,FALSE)=0,\"\",VLOOKUP($L9,invullijst!$A$11:$M$185,9,FALSE))","v":77}]
["Totaal A korps",{"$nulls":5},{"$f":"SUM(G6:G9)","v":316},null,"Totaal A korps",{"$nulls":5},{"$f":"SUM(O6:O9)","v":308}]
[]
[1,{"$f":"IF($G$3=\"k\",IF(VLOOKUP($D12,invullijst!$A$11:$M$185,11,FALSE)=0,\" \",VLOOKUP($D12,invullijst!$A$11:$M$185,11,FALSE)),\"\")","v":22},{"$f":"IF(VLOOKUP(D12,invullijst!A$11:F$226,4,FALSE)=\"\",\"\",VLOOKUP(D12,invullijst!A$11:D$226,4,FALSE))","v":"vr"},102,{"$f":"IF(VLOOKUP($D12,invullijst!$A$11:$M$185,2,FALSE)=\"\",\"\",VLOOKUP($D12,invullijst!$A$11:$M$185,2,FALSE))","v":"John de Jong"},null,{"$f":"IF(VLOOKUP($D12,invullijst!$A$11:$M$185,9,FALSE)=0,\"\",VLOOKUP($D12,invullijst!$A$11:$M$185,9,FALSE))","v":60},null,1,{"$f":"IF($O$3=\"k\",IF(VLOOKUP($L12,invullijst!$A$11:$M$185,11,FALSE)=0,\" \",VLOOKUP($L12,invullijst!$A$11:$M$185,11,FALSE)),\"\")","v":20},{"$f":"IF(VLOOKUP($L12,invullijst!$A$11:$M$226,4,FALSE)=\"\",\"\",VLOOKUP($L12,invullijst!$A$11:$M$226,4,FALSE))","v":"vr"},517,{"$f":"IF(VLOOKUP($L12,invullijst!$A$11:$M$185,2,FALSE)=\"\",\"\",VLOOKUP($L12,invullijst!$A$11:$M$185,2,FALSE))","v":"Diny Vos"},null,{"$f":"IF(VLOOKUP($L12,invullijst!$A$11:$M$185,9,FALSE)=0,\"\",VLOOKUP($L12,invullijst!$A$11:$M$185,9,FALSE))","v":59}]
[2,{"$f":"IF($G$3=\"k\",IF(VLOOKUP($D13,invullijst!$A$11:$M$185,11,FALSE)=0,\" \",VLOOKUP($D13,invullijst!$A$11:$M$185,11,FALSE)),\"\")","v":36},{"$f":"IF(VLOOKUP(D13,invullijst!A$11:F$226,4,FALSE)=\"\",\"\",VLOOKUP(D13,invullijst!A$11:D$226,4,FALSE))","v":"vr"},101,{"$f":"IF(VLOOKUP($D13,invullijst!$A$11:$M$185,2,FALSE)=\"\",\"\",VLOOKUP($D13,invullijst!$A$11:$M$185,2,FALSE))","v":"Antwan van Buul"},null,{"$f":"IF(VLOOKUP($D13,invullijst!$A$11:$M$185,9,FALSE)=0,\"\",VLOOKUP($D13,invullijst!$A$11:$M$185,9,FALSE))","v":60},null,2,{"$f":"IF($O$3=\"k\",IF(VLOOKUP($L13,invullijst!$A$11:$M$185,11,FALSE)=0,\" \",VLOOKUP($L13,invullijst!$A$11:$M$185,11,FALSE)),\"\")","v":35},{"$f":"IF(VLOOKUP($L13,invullijst!$A$11:$M$226,4,FALSE)=\"\",\"\",VLOOKUP($L13,invullijst!$A$11:$M$226,4,FALSE))","v":"vr"},512,{"$f":"IF(VLOOKUP($L13,invullijst!$A$11:$M$185,2,FALSE)=\"\",\"\",VLOOKUP($L13,invullijst!$A$11:$M$185,2,FALSE))","v":"Hans Bergakker"},null,{"$f":"IF(VLOOKUP($L13,invullijst!$A$11:$M$185,9,FALSE)=0,\"\",VLOOKUP($L13,invullijst!$A$11:$M$185,9,FALSE))","v":73}]
[3,{"$f":"IF($G$3=\"k\",IF(VLOOKUP($D14,invullijst!$A$11:$M$185,11,FALSE)=0,\" \",VLOOKUP($D14,invullijst!$A$11:$M$185,11,FALSE)),\"\")","v":28},{"$f":"IF(VLOOKUP(D14,invullijst!A$11:F$226,4,FALSE)=\"\",\"\",VLOOKUP(D14,invullijst!A$11:D$226,4,FALSE))","v":"vr"},103,{"$f":"IF(VLOOKUP($D14,invullijst!$A$11:$M$185,2,FALSE)=\"\",\"\",VLOOKUP($D14,invullijst!$A$11:$M$185,2,FALSE))","v":"Norbert van Buul"},null,{"$f":"IF(VLOOKUP($D14,invullijst!$A$11:$M$185,9,FALSE)=0,\"\",VLOOKUP($D14,invullijst!$A$11:$M$185,9,FALSE))","v":63},null,3,{"$f":"IF($O$3=\"k\",IF(VLOOKUP($L14,invullijst!$A$11:$M$185,11,FALSE)=0,\" \",VLOOKUP($L14,invullijst!$A$11:$M$185,11,FALSE)),\"\")","v":31},{"$f":"IF(VLOOKUP($L14,invullijst!$A$11:$M$226,4,FALSE)=\"\",\"\",VLOOKUP($L14,invullijst!$A$11:$M$226,4,FALSE))","v":"vr"},507,{"$f":"IF(VLOOKUP($L14,invullijst!$A$11:$M$185,2,FALSE)=\"\",\"\",VLOOKUP($L14,invullijst!$A$11:$M$185,2,FALSE))","v":"Michael Blaauwbroek"},null,{"$f":"IF(VLOOKUP($L14,invullijst!$A$11:$M$185,9,FALSE)=0,\"\",VLOOKUP($L14,invullijst!$A$11:$M$185,9,FALSE))","v":83}]
[4,{"$f":"IF($G$3=\"k\",IF(VLOOKUP($D15,invullijst!$A$11:$M$185,11,FALSE)=0,\" \",VLOOKUP($D15,invullijst!$A$11:$M$185,11,FALSE)),\"\")","v":" "},{"$f":"IF(VLOOKUP(D15,invullijst!A$11:F$226,4,FALSE)=\"\",\"\",VLOOKUP(D15,invullijst!A$11:D$226,4,FALSE))","v":0},null,{"$f":"IF(VLOOKUP($D15,invullijst!$A$11:$M$185,2,FALSE)=\"\",\"\",VLOOKUP($D15,invullijst!$A$11:$M$185,2,FALSE))","v":0},null,{"$f":"IF(VLOOKUP($D15,invullijst!$A$11:$M$185,9,FALSE)=0,\"\",VLOOKUP($D15,invullijst!$A$11:$M$185,9,FALSE))","v":""},null,4,{"$f":"IF($O$3=\"k\",IF(VLOOKUP($L15,invullijst!$A$11:$M$185,11,FALSE)=0,\" \",VLOOKUP($L15,invullijst!$A$11:$M$185,11,FALSE)),\"\")","v":" "},{"$f":"IF(VLOOKUP($L15,invullijst!$A$11:$M$226,4,FALSE)=\"\",\"\",VLOOKUP($L15,invullijst!$A$11:$M$226,4,FALSE))","v":0},null,{"$f":"IF(VLOOKUP($L15,invullijst!$A$11:$M$185,2,FALSE)=\"\",\"\",VLOOKUP($L15,invullijst!$A$11:$M$185,2,FALSE))","v":0},null,{"$f":"IF(VLOOKUP($L15,invullijst!$A$11:$M$185,9,FALSE)=0,\"\",VLOOKUP($L15,invullijst!$A$11:$M$185,9,FALSE))","v":""}]
["Totaal B1 korps",{"$nulls":5},{"$f":"SUM(G12:G15)","v":183},null,"Totaal B1 korps",{"$nulls":5},{"$f":"SUM(O12:O15)","v":215}]
[]
[1,{"$f":"IF($G$3=\"k\",IF(VLOOKUP($D18,invullijst!$A$11:$M$185,11,FALSE)=0,\" \",VLOOKUP($D18,invullijst!$A$11:$M$185,11,FALSE)),\"\")","v":" "},{"$f":"IF(VLOOKUP(D18,invullijst!A$11:F$226,4,FALSE)=\"\",\"\",VLOOKUP(D18,invullijst!A$11:D$226,4,FALSE))","v":0},null,{"$f":"IF(VLOOKUP($D18,invullijst!$A$11:$M$185,2,FALSE)=\"\",\"\",VLOOKUP($D18,invullijst!$A$11:$M$185,2,FALSE))","v":0},null,{"$f":"IF(VLOOKUP($D18,invullijst!$A$11:$M$185,9,FALSE)=0,\"\",VLOOKUP($D18,invullijst!$A$11:$M$185,9,FALSE))","v":""},null,1,{"$f":"IF($O$3=\"k\",IF(VLOOKUP($L18,invullijst!$A$11:$M$185,11,FALSE)=0,\" \",VLOOKUP($L18,invullijst!$A$11:$M$185,11,FALSE)),\"\")","v":" "},{"$f":"IF(VLOOKUP($L18,invullijst!$A$11:$M$226,4,FALSE)=\"\",\"\",VLOOKUP($L18,invullijst!$A$11:$M$226,4,FALSE))","v":0},null,{"$f":"IF(VLOOKUP($L18,invullijst!$A$11:$M$185,2,FALSE)=\"\",\"\",VLOOKUP($L18,invullijst!$A$11:$M$185,2,FALSE))","v":0},null,{"$f":"IF(VLOOKUP($L18,invullijst!$A$11:$M$185,9,FALSE)=0,\"\",VLOOKUP($L18,invullijst!$A$11:$M$185,9,FALSE))","v":""}]
[2,"inh",{"$f":"IF(VLOOKUP(D19,invullijst!A$11:F$226,4,FALSE)=\"\",\"\",VLOOKUP(D19,invullijst!A$11:D$226,4,FALSE))","v":"vr"},101,{"$f":"IF(VLOOKUP($D19,invullijst!$A$11:$M$185,2,FALSE)=\"\",\"\",VLOOKUP($D19,invullijst!$A$11:$M$185,2,FALSE))","v":"Antwan van Buul"},null,67,null,2,{"$f":"IF($O$3=\"k\",IF(VLOOKUP($L19,invullijst!$A$11:$M$185,11,FALSE)=0,\" \",VLOOKUP($L19,invullijst!$A$11:$M$185,11,FALSE)),\"\")","v":" "},{"$f":"IF(VLOOKUP($L19,invullijst!$A$11:$M$226,4,FALSE)=\"\",\"\",VLOOKUP($L19,invullijst!$A$11:$M$226,4,FALSE))","v":0},null,{"$f":"IF(VLOOKUP($L19,invullijst!$A$11:$M$185,2,FALSE)=\"\",\"\",VLOOKUP($L19,invullijst!$A$11:$M$185,2,FALSE))","v":0},null,{"$f":"IF(VLOOKUP($L19,invullijst!$A$11:$M$185,9,FALSE)=0,\"\",VLOOKUP($L19,invullijst!$A$11:$M$185,9,FALSE))","v":""}]
[3,{"$f":"IF($G$3=\"k\",IF(VLOOKUP($D20,invullijst!$A$11:$M$185,11,FALSE)=0,\" \",VLOOKUP($D20,invullijst!$A$11:$M$185,11,FALSE)),\"\")","v":" "},{"$f":"IF(VLOOKUP(D20,invullijst!A$11:F$226,4,FALSE)=\"\",\"\",VLOOKUP(D20,invullijst!A$11:D$226,4,FALSE))","v":0},null,{"$f":"IF(VLOOKUP($D20,invullijst!$A$11:$M$185,2,FALSE)=\"\",\"\",VLOOKUP($D20,invullijst!$A$11:$M$185,2,FALSE))","v":0},null,{"$f":"IF(VLOOKUP($D20,invullijst!$A$11:$M$185,9,FALSE)=0,\"\",VLOOKUP($D20,invullijst!$A$11:$M$185,9,FALSE))","v":""},null,3,{"$f":"IF($O$3=\"k\",IF(VLOOKUP($L20,invullijst!$A$11:$M$185,11,FALSE)=0,\" \",VLOOKUP($L20,invullijst!$A$11:$M$185,11,FALSE)),\"\")","v":" "},{"$f":"IF(VLOOKUP($L20,invullijst!$A$11:$M$226,4,FALSE)=\"\",\"\",VLOOKUP($L20,invullijst!$A$11:$M$226,4,FALSE))","v":0},null,{"$f":"IF(VLOOKUP($L20,invullijst!$A$11:$M$185,2,FALSE)=\"\",\"\",VLOOKUP($L20,invullijst!$A$11:$M$185,2,FALSE))","v":0},null,{"$f":"IF(VLOOKUP($L20,invullijst!$A$11:$M$185,9,FALSE)=0,\"\",VLOOKUP($L20,invullijst!$A$11:$M$185,9,FALSE))","v":""}]
[4,{"$f":"IF($G$3=\"k\",IF(VLOOKUP($D21,invullijst!$A$11:$M$185,11,FALSE)=0,\" \",VLOOKUP($D21,invullijst!$A$11:$M$185,11,FALSE)),\"\")","v":" "},{"$f":"IF(VLOOKUP(D21,invullijst!A$11:F$226,4,FALSE)=\"\",\"\",VLOOKUP(D21,invullijst!A$11:D$226,4,FALSE))","v":0},null,{"$f":"IF(VLOOKUP($D21,invullijst!$A$11:$M$185,2,FALSE)=\"\",\"\",VLOOKUP($D21,invullijst!$A$11:$M$185,2,FALSE))","v":0},null,{"$f":"IF(VLOOKUP($D21,invullijst!$A$11:$M$185,9,FALSE)=0,\"\",VLOOKUP($D21,invullijst!$A$11:$M$185,9,FALSE))","v":""},null,4,{"$f":"IF($O$3=\"k\",IF(VLOOKUP($L21,invullijst!$A$11:$M$185,11,FALSE)=0,\" \",VLOOKUP($L21,invullijst!$A$11:$M$185,11,FALSE)),\"\")","v":" "},{"$f":"IF(VLOOKUP($L21,invullijst!$A$11:$M$226,4,FALSE)=\"\",\"\",VLOOKUP($L21,invullijst!$A$11:$M$226,4,FALSE))","v":0},null,{"$f":"IF(VLOOKUP($L21,invullijst!$A$11:$M$185,2,FALSE)=\"\",\"\",VLOOKUP($L21,invullijst!$A$11:$M$185,2,FALSE))","v":0},null,{"$f":"IF(VLOOKUP($L21,invullijst!$A$11:$M$185,9,FALSE)=0,\"\",VLOOKUP($L21,invullijst!$A$11:$M$185,9,FALSE))","v":""}]
["DIVERSEN / INHAAL",{"$nulls":7},"DIVERSEN / INHAAL"]
[]
["OPGELEGD (Jeugd <16 en 65+)"]
[1,{"$f":"IF($G$3=\"k\",IF(VLOOKUP($D25,invullijst!$A$11:$M$185,11,FALSE)=0,\" \",VLOOKUP($D25,invullijst!$A$11:$M$185,11,FALSE)),\"\")","v":37},{"$f":"IF(VLOOKUP(D25,invullijst!A$11:F$226,4,FALSE)=\"\",\"\",VLOOKUP(D25,invullijst!A$11:D$226,4,FALSE))","v":"65+"},107,{"$f":"IF(VLOOKUP($D25,invullijst!$A$11:$M$185,2,FALSE)=\"\",\"\",VLOOKUP($D25,invullijst!$A$11:$M$185,2,FALSE))","v":"Cees Coppens"},null,{"$f":"IF(VLOOKUP($D25,invullijst!$A$11:$M$185,9,FALSE)=0,\"\",VLOOKUP($D25,invullijst!$A$11:$M$185,9,FALSE))","v":82},null,1,{"$f":"IF($O$3=\"k\",IF(VLOOKUP($L25,invullijst!$A$11:$M$185,11,FALSE)=0,\" \",VLOOKUP($L25,invullijst!$A$11:$M$185,11,FALSE)),\"\")","v":47},{"$f":"IF(VLOOKUP($L25,invullijst!$A$11:$M$226,4,FALSE)=\"\",\"\",VLOOKUP($L25,invullijst!$A$11:$M$226,4,FALSE))","v":"65+"},516,{"$f":"IF(VLOOKUP($L25,invullijst!$A$11:$M$185,2,FALSE)=\"\",\"\",VLOOKUP($L25,invullijst!$A$11:$M$185,2,FALSE))","v":"Henry Bergakker disp"},null,{"$f":"IF(VLOOKUP($L25,invullijst!$A$11:$M$185,9,FALSE)=0,\"\",VLOOKUP($L25,invullijst!$A$11:$M$185,9,FALSE))","v":90}]
[2,{"$f":"IF($G$3=\"k\",IF(VLOOKUP($D26,invullijst!$A$11:$M$185,11,FALSE)=0,\" \",VLOOKUP($D26,invullijst!$A$11:$M$185,11,FALSE)),\"\")","v":20},{"$f":"IF(VLOOKUP(D26,invullijst!A$11:F$226,4,FALSE)=\"\",\"\",VLOOKUP(D26,invullijst!A$11:D$226,4,FALSE))","v":"65+"},112,{"$f":"IF(VLOOKUP($D26,invullijst!$A$11:$M$185,2,FALSE)=\"\",\"\",VLOOKUP($D26,invullijst!$A$11:$M$185,2,FALSE))","v":"Toon van Buul"},null,{"$f":"IF(VLOOKUP($D26,invullijst!$A$11:$M$185,9,FALSE)=0,\"\",VLOOKUP($D26,invullijst!$A$11:$M$185,9,FALSE))","v":67},null,2,{"$f":"IF($O$3=\"k\",IF(VLOOKUP($L26,invullijst!$A$11:$M$185,11,FALSE)=0,\" \",VLOOKUP($L26,invullijst!$A$11:$M$185,11,FALSE)),\"\")","v":40},{"$f":"IF(VLOOKUP($L26,invullijst!$A$11:$M$226,4,FALSE)=\"\",\"\",VLOOKUP($L26,invullijst!$A$11:$M$226,4,FALSE))","v":"65+"},509,{"$f":"IF(VLOOKUP($L26,invullijst!$A$11:$M$185,2,FALSE)=\"\",\"\",VLOOKUP($L26,invullijst!$A$11:$M$185,2,FALSE))","v":"Adwan de Pinth"},null,{"$f":"IF(VLOOKUP($L26,invullijst!$A$11:$M$185,9,FALSE)=0,\"\",VLOOKUP($L26,invullijst!$A$11:$M$185,9,FALSE))","v":96}]
[3,{"$f":"IF($G$3=\"k\",IF(VLOOKUP($D27,invullijst!$A$11:$M$185,11,FALSE)=0,\" \",VLOOKUP($D27,invullijst!$A$11:$M$185,11,FALSE)),\"\")","v":37},{"$f":"IF(VLOOKUP(D27,invullijst!A$11:F$226,4,FALSE)=\"\",\"\",VLOOKUP(D27,invullijst!A$11:D$226,4,FALSE))","v":"65+"},104,{"$f":"IF(VLOOKUP($D27,invullijst!$A$11:$M$185,2,FALSE)=\"\",\"\",VLOOKUP($D27,invullijst!$A$11:$M$185,2,FALSE))","v":"Peter Brekelmans"},null,{"$f":"IF(VLOOKUP($D27,invullijst!$A$11:$M$185,9,FALSE)=0,\"\",VLOOKUP($D27,invullijst!$A$11:$M$185,9,FALSE))","v":84},null,3,{"$f":"IF($O$3=\"k\",IF(VLOOKUP($L27,invullijst!$A$11:$M$185,11,FALSE)=0,\" \",VLOOKUP($L27,invullijst!$A$11:$M$185,11,FALSE)),\"\")","v":44},{"$f":"IF(VLOOKUP($L27,invullijst!$A$11:$M$226,4,FALSE)=\"\",\"\",VLOOKUP($L27,invullijst!$A$11:$M$226,4,FALSE))","v":"65+"},515,{"$f":"IF(VLOOKUP($L27,invullijst!$A$11:$M$185,2,FALSE)=\"\",\"\",VLOOKUP($L27,invullijst!$A$11:$M$185,2,FALSE))","v":"Ilona Bergakker disp"},null,{"$f":"IF(VLOOKUP($L27,invullijst!$A$11:$M$185,9,FALSE)=0,\"\",VLOOKUP($L27,invullijst!$A$11:$M$185,9,FALSE))","v":85}]
["Totaal korps opgelegd A1",{"$nulls":5},{"$f":"SUM(G25:G27)","v":233},null,"Totaal korps opgelegd A1",{"$nulls":5},{"$f":"SUM(O25:O27)","v":271}]
[]
[1,{"$f":"IF($G$3=\"k\",IF(VLOOKUP($D30,invullijst!$A$11:$M$185,11,FALSE)=0,\" \",VLOOKUP($D30,invullijst!$A$11:$M$185,11,FALSE)),\"\")","v":" "},{"$f":"IF(VLOOKUP(D30,invullijst!A$11:F$226,4,FALSE)=\"\",\"\",VLOOKUP(D30,invullijst!A$11:D$226,4,FALSE))","v":0},null,{"$f":"IF(VLOOKUP($D30,invullijst!$A$11:$M$185,2,FALSE)=\"\",\"\",VLOOKUP($D30,invullijst!$A$11:$M$185,2,FALSE))","v":0},null,{"$f":"IF(VLOOKUP($D30,invullijst!$A$11:$M$185,9,FALSE)=0,\"\",VLOOKUP($D30,invullijst!$A$11:$M$185,9,FALSE))","v":""},null,1,{"$f":"IF($O$3=\"k\",IF(VLOOKUP($L30,invullijst!$A$11:$M$185,11,FALSE)=0,\" \",VLOOKUP($L30,invullijst!$A$11:$M$185,11,FALSE)),\"\")","v":" "},{"$f":"IF(VLOOKUP($L30,invullijst!$A$11:$M$226,4,FALSE)=\"\",\"\",VLOOKUP($L30,invullijst!$A$11:$M$226,4,FALSE))","v":0},null,{"$f":"IF(VLOOKUP($L30,invullijst!$A$11:$M$185,2,FALSE)=\"\",\"\",VLOOKUP($L30,invullijst!$A$11:$M$185,2,FALSE))","v":0},null,{"$f":"IF(VLOOKUP($L30,invullijst!$A$11:$M$185,9,FALSE)=0,\"\",VLOOKUP($L30,invullijst!$A$11:$M$185,9,FALSE))","v":""}]
[2,{"$f":"IF($G$3=\"k\",IF(VLOOKUP($D31,invullijst!$A$11:$M$185,11,FALSE)=0,\" \",VLOOKUP($D31,invullijst!$A$11:$M$185,11,FALSE)),\"\")","v":" "},{"$f":"IF(VLOOKUP(D31,invullijst!A$11:F$226,4,FALSE)=\"\",\"\",VLOOKUP(D31,invullijst!A$11:D$226,4,FALSE))","v":0},null,{"$f":"IF(VLOOKUP($D31,invullijst!$A$11:$M$185,2,FALSE)=\"\",\"\",VLOOKUP($D31,invullijst!$A$11:$M$185,2,FALSE))","v":0},null,{"$f":"IF(VLOOKUP($D31,invullijst!$A$11:$M$185,9,FALSE)=0,\"\",VLOOKUP($D31,invullijst!$A$11:$M$185,9,FALSE))","v":""},null,2,{"$f":"IF($O$3=\"k\",IF(VLOOKUP($L31,invullijst!$A$11:$M$185,11,FALSE)=0,\" \",VLOOKUP($L31,invullijst!$A$11:$M$185,11,FALSE)),\"\")","v":" "},{"$f":"IF(VLOOKUP($L31,invullijst!$A$11:$M$226,4,FALSE)=\"\",\"\",VLOOKUP($L31,invullijst!$A$11:$M$226,4,FALSE))","v":0},null,{"$f":"IF(VLOOKUP($L31,invullijst!$A$11:$M$185,2,FALSE)=\"\",\"\",VLOOKUP($L31,invullijst!$A$11:$M$185,2,FALSE))","v":0},null,{"$f":"IF(VLOOKUP($L31,invullijst!$A$11:$M$185,9,FALSE)=0,\"\",VLOOKUP($L31,invullijst!$A$11:$M$185,9,FALSE))","v":""}]
[3,{"$f":"IF($G$3=\"k\",IF(VLOOKUP($D32,invullijst!$A$11:$M$185,11,FALSE)=0,\" \",VLOOKUP($D32,invullijst!$A$11:$M$185,11,FALSE)),\"\")","v":" "},{"$f":"IF(VLOOKUP(D32,invullijst!A$11:F$226,4,FALSE)=\"\",\"\",VLOOKUP(D32,invullijst!A$11:D$226,4,FALSE))","v":0},null,{"$f":"IF(VLOOKUP($D32,invullijst!$A$11:$M$185,2,FALSE)=\"\",\"\",VLOOKUP($D32,invullijst!$A$11:$M$185,2,FALSE))","v":0},null,{"$f":"IF(VLOOKUP($D32,invullijst!$A$11:$M$185,9,FALSE)=0,\"\",VLOOKUP($D32,invullijst!$A$11:$M$185,9,FALSE))","v":""},null,3,{"$f":"IF($O$3=\"k\",IF(VLOOKUP($L32,invullijst!$A$11:$M$185,11,FALSE)=0,\" \",VLOOKUP($L32,invullijst!$A$11:$M$185,11,FALSE)),\"\")","v":" "},{"$f":"IF(VLOOKUP($L32,invullijst!$A$11:$M$226,4,FALSE)=\"\",\"\",VLOOKUP($L32,invullijst!$A$11:$M$226,4,FALSE))","v":0},null,{"$f":"IF(VLOOKUP($L32,invullijst!$A$11:$M$185,2,FALSE)=\"\",\"\",VLOOKUP($L32,invullijst!$A$11:$M$185,2,FALSE))","v":0},null,{"$f":"IF(VLOOKUP($L32,invullijst!$A$11:$M$185,9,FALSE)=0,\"\",VLOOKUP($L32,invullijst!$A$11:$M$185,9,FALSE))","v":""}]
["Totaal korps opgelegd A2",{"$nulls":5},{"$f":"SUM(G30:G32)","v":0},null,"Totaal korps opgelegd A2",{"$nulls":5},{"$f":"SUM(O30:O32)","v":0}]
[]
[1,{"$f":"IF($G$3=\"k\",IF(VLOOKUP($D35,invullijst!$A$11:$M$185,11,FALSE)=0,\" \",VLOOKUP($D35,invullijst!$A$11:$M$185,11,FALSE)),\"\")","v":" "},{"$f":"IF(VLOOKUP(D35,invullijst!A$11:F$226,4,FALSE)=\"\",\"\",VLOOKUP(D35,invullijst!A$11:D$226,4,FALSE))","v":0},null,{"$f":"IF(VLOOKUP($D35,invullijst!$A$11:$M$185,2,FALSE)=\"\",\"\",VLOOKUP($D35,invullijst!$A$11:$M$185,2,FALSE))","v":0},null,{"$f":"IF(VLOOKUP($D35,invullijst!$A$11:$M$185,9,FALSE)=0,\"\",VLOOKUP($D35,invullijst!$A$11:$M$185,9,FALSE))","v":""},null,1,{"$f":"IF($O$3=\"k\",IF(VLOOKUP($L35,invullijst!$A$11:$M$185,11,FALSE)=0,\" \",VLOOKUP($L35,invullijst!$A$11:$M$185,11,FALSE)),\"\")","v":" "},{"$f":"IF(VLOOKUP($L35,invullijst!$A$11:$M$226,4,FALSE)=\"\",\"\",VLOOKUP($L35,invullijst!$A$11:$M$226,4,FALSE))","v":0},null,{"$f":"IF(VLOOKUP($L35,invullijst!$A$11:$M$185,2,FALSE)=\"\",\"\",VLOOKUP($L35,invullijst!$A$11:$M$185,2,FALSE))","v":0},null,{"$f":"IF(VLOOKUP($L35,invullijst!$A$11:$M$185,9,FALSE)=0,\"\",VLOOKUP($L35,invullijst!$A$11:$M$185,9,FALSE))","v":""}]
[2,{"$f":"IF($G$3=\"k\",IF(VLOOKUP($D36,invullijst!$A$11:$M$185,11,FALSE)=0,\" \",VLOOKUP($D36,invullijst!$A$11:$M$185,11,FALSE)),\"\")","v":" "},{"$f":"IF(VLOOKUP(D36,invullijst!A$11:F$226,4,FALSE)=\"\",\"\",VLOOKUP(D36,invullijst!A$11:D$226,4,FALSE))","v":0},null,{"$f":"IF(VLOOKUP($D36,invullijst!$A$11:$M$185,2,FALSE)=\"\",\"\",VLOOKUP($D36,invullijst!$A$11:$M$185,2,FALSE))","v":0},null,{"$f":"IF(VLOOKUP($D36,invullijst!$A$11:$M$185,9,FALSE)=0,\"\",VLOOKUP($D36,invullijst!$A$11:$M$185,9,FALSE))","v":""},null,2,{"$f":"IF($O$3=\"k\",IF(VLOOKUP($L36,invullijst!$A$11:$M$185,11,FALSE)=0,\" \",VLOOKUP($L36,invullijst!$A$11:$M$185,11,FALSE)),\"\")","v":" "},{"$f":"IF(VLOOKUP($L36,invullijst!$A$11:$M$226,4,FALSE)=\"\",\"\",VLOOKUP($L36,invullijst!$A$11:$M$226,4,FALSE))","v":0},null,{"$f":"IF(VLOOKUP($L36,invullijst!$A$11:$M$185,2,FALSE)=\"\",\"\",VLOOKUP($L36,invullijst!$A$11:$M$185,2,FALSE))","v":0},null,{"$f":"IF(VLOOKUP($L36,invullijst!$A$11:$M$185,9,FALSE)=0,\"\",VLOOKUP($L36,invullijst!$A$11:$M$185,9,FALSE))","v":""}]
[3,{"$f":"IF($G$3=\"k\",IF(VLOOKUP($D37,invullijst!$A$11:$M$185,11,FALSE)=0,\" \",VLOOKUP($D37,invullijst!$A$11:$M$185,11,FALSE)),\"\")","v":" "},{"$f":"IF(VLOOKUP(D37,invullijst!A$11:F$226,4,FALSE)=\"\",\"\",VLOOKUP(D37,invullijst!A$11:D$226,4,FALSE))","v":0},null,{"$f":"IF(VLOOKUP($D37,invullijst!$A$11:$M$185,2,FALSE)=\"\",\"\",VLOOKUP($D37,invullijst!$A$11:$M$185,2,FALSE))","v":0},null,{"$f":"IF(VLOOKUP($D37,invullijst!$A$11:$M$185,9,FALSE)=0,\"\",VLOOKUP($D37,invullijst!$A$11:$M$185,9,FALSE))","v":""},null,3,{"$f":"IF($O$3=\"k\",IF(VLOOKUP($L37,invullijst!$A$11:$M$185,11,FALSE)=0,\" \",VLOOKUP($L37,invullijst!$A$11:$M$185,11,FALSE)),\"\")","v":" "},{"$f":"IF(VLOOKUP($L37,invullijst!$A$11:$M$226,4,FALSE)=\"\",\"\",VLOOKUP($L37,invullijst!$A$11:$M$226,4,FALSE))","v":0},null,{"$f":"IF(VLOOKUP($L37,invullijst!$A$11:$M$185,2,FALSE)=\"\",\"\",VLOOKUP($L37,invullijst!$A$11:$M$185,2,FALSE))","v":0},null,{"$f":"IF(VLOOKUP($L37,invullijst!$A$11:$M$185,9,FALSE)=0,\"\",VLOOKUP($L37,invullijst!$A$11:$M$185,9,FALSE))","v":""}]
["Totaal korps opgelegd A3",{"$nulls":5},{"$f":"SUM(G35:G37)","v":0},null,"Totaal korps opgelegd A3",{"$nulls":5},{"$f":"SUM(O35:O37)","v":0}]

{"sheet":"wedstrijd 5A","index":13,"n_rows":38,"n_cols":15,"rows_kept":38,"merged":[[0,0,0,4],[0,5,0,7],[0,8,0,14],[1,0,1,11],[1,12,1,14],[2,1,2,5],[2,9,2,13],[4,0,4,14],[5,4,5,5],[5,12,5,13],[6,4,6,5],[6,12,6,13],[7,4,7,5],[7,12,7,13],[8,4,8,5],[8,12,8,13],[9,0,9,5],[9,8,9,13],[11,4,11,5],[11,12,11,13],[12,4,12,5],[12,12,12,13],[13,4,13,5],[13,12,13,13],[14,4,14,5],[14,12,14,13],[15,0,15,5],[15,8,15,13],[17,4,17,5],[17,12,17,13],[18,4,18,5],[18,12,18,13],[19,4,19,5],[19,12,19,13],[20,4,20,5],[20,12,20,13],[21,0,21,5],[21,8,21,13],[23,0,23,14],[24,4,24,5],[24,12,24,13],[25,4,25,5],[25,12,25,13],[26,4,26,5],[26,12,26,13],[27,0,27,5],[27,8,27,13],[29,4,29,5],[29,12,29,13],[30,4,30,5],[30,12,30,13],[31,4,31,5],[31,12,31,13],[32,0,32,5],[32,8,32,13],[34,4,34,5],[34,12,34,13],[35,4,35,5],[35,12,35,13],[36,4,36,5],[36,12,36,13],[37,0,37,5],[37,8,37,13]]}
[{"$f":"invullijst!F1","v":"Organistatie"},{"$nulls":4},{"$f":"invullijst!H2","v":"2024 - 2025"},null,null,{"$f":"invullijst!F3","v":"O.L.V. Schuts Elshout"}]
["Datum: ",{"$nulls":11},"2024-03-16"]
[1,{"$f":"IF(VLOOKUP(A3,invullijst!A1:F5,2,FALSE)=\"\",\"\",VLOOKUP(A3,invullijst!A1:F5,2,FALSE))","v":"Sint Ambrosius Baardwijk"},{"$nulls":6},2,{"$f":"IF(VLOOKUP(I3,invullijst!A1:C5,2,FALSE)=\"\",\"\",VLOOKUP(I3,invullijst!A1:C5,2,FALSE))","v":"St. Crispinus & Crispinianus Besoijen"}]
[]
["vrijehand"]
[1,{"$f":"IF($G$3=\"k\",IF(VLOOKUP($D6,invullijst!$A$11:$M$185,11,FALSE)=0,\" \",VLOOKUP($D6,invullijst!$A$11:$M$185,11,FALSE)),\"\")","v":""},{"$f":"IF(VLOOKUP(D6,invullijst!A$11:F$226,4,FALSE)=\"\",\"\",VLOOKUP(D6,invullijst!A$11:D$226,4,FALSE))","v":"vr"},105,{"$f":"IF(VLOOKUP($D6,invullijst!$A$11:$M$185,2,FALSE)=\"\",\"\",VLOOKUP($D6,invullijst!$A$11:$M$185,2,FALSE))","v":"René Klijn"},null,{"$f":"IF(VLOOKUP($D6,invullijst!$A$11:$M$185,10,FALSE)=0,\"\",VLOOKUP($D6,invullijst!$A$11:$M$185,10,FALSE))","v":88},null,1,{"$f":"IF($O$3=\"k\",IF(VLOOKUP($L6,invullijst!$A$11:$M$185,11,FALSE)=0,\" \",VLOOKUP($L6,invullijst!$A$11:$M$185,11,FALSE)),\"\")","v":""},{"$f":"IF(VLOOKUP($L6,invullijst!$A$11:$M$226,4,FALSE)=\"\",\"\",VLOOKUP($L6,invullijst!$A$11:$M$226,4,FALSE))","v":"vr"},210,{"$f":"IF(VLOOKUP($L6,invullijst!$A$11:$M$185,2,FALSE)=\"\",\"\",VLOOKUP($L6,invullijst!$A$11:$M$185,2,FALSE))","v":"Sander Oome"},null,{"$f":"IF(VLOOKUP($L6,invullijst!$A$11:$M$185,10,FALSE)=0,\"\",VLOOKUP($L6,invullijst!$A$11:$M$185,10,FALSE))","v":90}]
[2,{"$f":"IF($G$3=\"k\",IF(VLOOKUP($D7,invullijst!$A$11:$M$185,11,FALSE)=0,\" \",VLOOKUP($D7,invullijst!$A$11:$M$185,11,FALSE)),\"\")","v":""},{"$f":"IF(VLOOKUP(D7,invullijst!A$11:F$226,4,FALSE)=\"\",\"\",VLOOKUP(D7,invullijst!A$11:D$226,4,FALSE))","v":"vr"},106,{"$f":"IF(VLOOKUP($D7,invullijst!$A$11:$M$185,2,FALSE)=\"\",\"\",VLOOKUP($D7,invullijst!$A$11:$M$185,2,FALSE))","v":"René Pullens"},null,{"$f":"IF(VLOOKUP($D7,invullijst!$A$11:$M$185,10,FALSE)=0,\"\",VLOOKUP($D7,invullijst!$A$11:$M$185,10,FALSE))","v":77},null,2,{"$f":"IF($O$3=\"k\",IF(VLOOKUP($L7,invullijst!$A$11:$M$185,11,FALSE)=0,\" \",VLOOKUP($L7,invullijst!$A$11:$M$185,11,FALSE)),\"\")","v":""},{"$f":"IF(VLOOKUP($L7,invullijst!$A$11:$M$226,4,FALSE)=\"\",\"\",VLOOKUP($L7,invullijst!$A$11:$M$226,4,FALSE))","v":"vr"},207,{"$f":"IF(VLOOKUP($L7,invullijst!$A$11:$M$185,2,FALSE)=\"\",\"\",VLOOKUP($L7,invullijst!$A$11:$M$185,2,FALSE))","v":"Max de Louw"},null,{"$f":"IF(VLOOKUP($L7,invullijst!$A$11:$M$185,10,FALSE)=0,\"\",VLOOKUP($L7,invullijst!$A$11:$M$185,10,FALSE))","v":89}]
[3,{"$f":"IF($G$3=\"k\",IF(VLOOKUP($D8,invullijst!$A$11:$M$185,11,FALSE)=0,\" \",VLOOKUP($D8,invullijst!$A$11:$M$185,11,FALSE)),\"\")","v":""},{"$f":"IF(VLOOKUP(D8,invullijst!A$11:F$226,4,FALSE)=\"\",\"\",VLOOKUP(D8,invullijst!A$11:D$226,4,FALSE))","v":"vr"},108,{"$f":"IF(VLOOKUP($D8,invullijst!$A$11:$M$185,2,FALSE)=\"\",\"\",VLOOKUP($D8,invullijst!$A$11:$M$185,2,FALSE))","v":"Bram Pullens"},null,{"$f":"IF(VLOOKUP($D8,invullijst!$A$11:$M$185,10,FALSE)=0,\"\",VLOOKUP($D8,invullijst!$A$11:$M$185,10,FALSE))","v":80},null,3,{"$f":"IF($O$3=\"k\",IF(VLOOKUP($L8,invullijst!$A$11:$M$185,11,FALSE)=0,\" \",VLOOKUP($L8,invullijst!$A$11:$M$185,11,FALSE)),\"\")","v":""},{"$f":"IF(VLOOKUP($L8,invullijst!$A$11:$M$226,4,FALSE)=\"\",\"\",VLOOKUP($L8,invullijst!$A$11:$M$226,4,FALSE))","v":"vr"},216,{"$f":"IF(VLOOKUP($L8,invullijst!$A$11:$M$185,2,FALSE)=\"\",\"\",VLOOKUP($L8,invullijst!$A$11:$M$185,2,FALSE))","v":"Pieter Laghuwitz"},null,{"$f":"IF(VLOOKUP($L8,invullijst!$A$11:$M$185,10,FALSE)=0,\"\",VLOOKUP($L8,invullijst!$A$11:$M$185,10,FALSE))","v":90}]
[4,{"$f":"IF($G$3=\"k\",IF(VLOOKUP($D9,invullijst!$A$11:$M$185,11,FALSE)=0,\" \",VLOOKUP($D9,invullijst!$A$11:$M$185,11,FALSE)),\"\")","v":""},{"$f":"IF(VLOOKUP(D9,invullijst!A$11:F$226,4,FALSE)=\"\",\"\",VLOOKUP(D9,invullijst!A$11:D$226,4,FALSE))","v":"vr"},109,{"$f":"IF(VLOOKUP($D9,invullijst!$A$11:$M$185,2,FALSE)=\"\",\"\",VLOOKUP($D9,invullijst!$A$11:$M$185,2,FALSE))","v":"Gijs Pullens"},null,{"$f":"IF(VLOOKUP($D9,invullijst!$A$11:$M$185,10,FALSE)=0,\"\",VLOOKUP($D9,invullijst!$A$11:$M$185,10,FALSE))","v":70},null,4,{"$f":"IF($O$3=\"k\",IF(VLOOKUP($L9,invullijst!$A$11:$M$185,11,FALSE)=0,\" \",VLOOKUP($L9,invullijst!$A$11:$M$185,11,FALSE)),\"\")","v":""},{"$f":"IF(VLOOKUP($L9,invullijst!$A$11:$M$226,4,FALSE)=\"\",\"\",VLOOKUP($L9,invullijst!$A$11:$M$226,4,FALSE))","v":"vr"},204,{"$f":"IF(VLOOKUP($L9,invullijst!$A$11:$M$185,2,FALSE)=\"\",\"\",VLOOKUP($L9,invullijst!$A$11:$M$185,2,FALSE))","v":"Harry de Louw"},null,{"$f":"IF(VLOOKUP($L9,invullijst!$A$11:$M$185,10,FALSE)=0,\"\",VLOOKUP($L9,invullijst!$A$11:$M$185,10,FALSE))","v":74}]
["Totaal A korps",{"$nulls":5},{"$f":"SUM(G6:G9)","v":315},null,"Totaal A korps",{"$nulls":5},{"$f":"SUM(O6:O9)","v":343}]
[]
[1,{"$f":"IF($G$3=\"k\",IF(VLOOKUP($D12,invullijst!$A$11:$M$185,11,FALSE)=0,\" \",VLOOKUP($D12,invullijst!$A$11:$M$185,11,FALSE)),\"\")","v":""},{"$f":"IF(VLOOKUP(D12,invullijst!A$11:F$226,4,FALSE)=\"\",\"\",VLOOKUP(D12,invullijst!A$11:D$226,4,FALSE))","v":"vr"},102,{"$f":"IF(VLOOKUP($D12,invullijst!$A$11:$M$185,2,FALSE)=\"\",\"\",VLOOKUP($D12,invullijst!$A$11:$M$185,2,FALSE))","v":"John de Jong"},null,{"$f":"IF(VLOOKUP($D12,invullijst!$A$11:$M$185,10,FALSE)=0,\"\",VLOOKUP($D12,invullijst!$A$11:$M$185,10,FALSE))","v":62},null,1,{"$f":"IF($O$3=\"k\",IF(VLOOKUP($L12,invullijst!$A$11:$M$185,11,FALSE)=0,\" \",VLOOKUP($L12,invullijst!$A$11:$M$185,11,FALSE)),\"\")","v":""},{"$f":"IF(VLOOKUP($L12,invullijst!$A$11:$M$226,4,FALSE)=\"\",\"\",VLOOKUP($L12,invullijst!$A$11:$M$226,4,FALSE))","v":"vr"},203,{"$f":"IF(VLOOKUP($L12,invullijst!$A$11:$M$185,2,FALSE)=\"\",\"\",VLOOKUP($L12,invullijst!$A$11:$M$185,2,FALSE))","v":"Frank van den Houdt"},null,{"$f":"IF(VLOOKUP($L12,invullijst!$A$11:$M$185,10,FALSE)=0,\"\",VLOOKUP($L12,invullijst!$A$11:$M$185,10,FALSE))","v":75}]
[2,{"$f":"IF($G$3=\"k\",IF(VLOOKUP($D13,invullijst!$A$11:$M$185,11,FALSE)=0,\" \",VLOOKUP($D13,invullijst!$A$11:$M$185,11,FALSE)),\"\")","v":""},{"$f":"IF(VLOOKUP(D13,invullijst!A$11:F$226,4,FALSE)=\"\",\"\",VLOOKUP(D13,invullijst!A$11:D$226,4,FALSE))","v":"vr"},101,{"$f":"IF(VLOOKUP($D13,invullijst!$A$11:$M$185,2,FALSE)=\"\",\"\",VLOOKUP($D13,invullijst!$A$11:$M$185,2,FALSE))","v":"Antwan van Buul"},null,{"$f":"IF(VLOOKUP($D13,invullijst!$A$11:$M$185,10,FALSE)=0,\"\",VLOOKUP($D13,invullijst!$A$11:$M$185,10,FALSE))","v":61},null,2,{"$f":"IF($O$3=\"k\",IF(VLOOKUP($L13,invullijst!$A$11:$M$185,11,FALSE)=0,\" \",VLOOKUP($L13,invullijst!$A$11:$M$185,11,FALSE)),\"\")","v":""},{"$f":"IF(VLOOKUP($L13,invullijst!$A$11:$M$226,4,FALSE)=\"\",\"\",VLOOKUP($L13,invullijst!$A$11:$M$226,4,FALSE))","v":"vr"},205,{"$f":"IF(VLOOKUP($L13,invullijst!$A$11:$M$185,2,FALSE)=\"\",\"\",VLOOKUP($L13,invullijst!$A$11:$M$185,2,FALSE))","v":"Jos v/d Snepscheut"},null,{"$f":"IF(VLOOKUP($L13,invullijst!$A$11:$M$185,10,FALSE)=0,\"\",VLOOKUP($L13,invullijst!$A$11:$M$185,10,FALSE))","v":74}]
[3,{"$f":"IF($G$3=\"k\",IF(VLOOKUP($D14,invullijst!$A$11:$M$185,11,FALSE)=0,\" \",VLOOKUP($D14,invullijst!$A$11:$M$185,11,FALSE)),\"\")","v":""},{"$f":"IF(VLOOKUP(D14,invullijst!A$11:F$226,4,FALSE)=\"\",\"\",VLOOKUP(D14,invullijst!A$11:D$226,4,FALSE))","v":"vr"},103,{"$f":"IF(VLOOKUP($D14,invullijst!$A$11:$M$185,2,FALSE)=\"\",\"\",VLOOKUP($D14,invullijst!$A$11:$M$185,2,FALSE))","v":"Norbert van Buul"},null,{"$f":"IF(VLOOKUP($D14,invullijst!$A$11:$M$185,10,FALSE)=0,\"\",VLOOKUP($D14,invullijst!$A$11:$M$185,10,FALSE))","v":59},null,3,{"$f":"IF($O$3=\"k\",IF(VLOOKUP($L14,invullijst!$A$11:$M$185,11,FALSE)=0,\" \",VLOOKUP($L14,invullijst!$A$11:$M$185,11,FALSE)),\"\")","v":""},{"$f":"IF(VLOOKUP($L14,invullijst!$A$11:$M$226,4,FALSE)=\"\",\"\",VLOOKUP($L14,invullijst!$A$11:$M$226,4,FALSE))","v":"vr"},209,{"$f":"IF(VLOOKUP($L14,invullijst!$A$11:$M$185,2,FALSE)=\"\",\"\",VLOOKUP($L14,invullijst!$A$11:$M$185,2,FALSE))","v":"René van Kuijk"},null,{"$f":"IF(VLOOKUP($L14,invullijst!$A$11:$M$185,10,FALSE)=0,\"\",VLOOKUP($L14,invullijst!$A$11:$M$185,10,FALSE))","v":81}]
[4,{"$f":"IF($G$3=\"k\",IF(VLOOKUP($D15,invullijst!$A$11:$M$185,11,FALSE)=0,\" \",VLOOKUP($D15,invullijst!$A$11:$M$185,11,FALSE)),\"\")","v":""},{"$f":"IF(VLOOKUP(D15,invullijst!A$11:F$226,4,FALSE)=\"\",\"\",VLOOKUP(D15,invullijst!A$11:D$226,4,FALSE))","v":0},null,{"$f":"IF(VLOOKUP($D15,invullijst!$A$11:$M$185,2,FALSE)=\"\",\"\",VLOOKUP($D15,invullijst!$A$11:$M$185,2,FALSE))","v":0},null,{"$f":"IF(VLOOKUP($D15,invullijst!$A$11:$M$185,10,FALSE)=0,\"\",VLOOKUP($D15,invullijst!$A$11:$M$185,10,FALSE))","v":""},null,4,{"$f":"IF($O$3=\"k\",IF(VLOOKUP($L15,invullijst!$A$11:$M$185,11,FALSE)=0,\" \",VLOOKUP($L15,invullijst!$A$11:$M$185,11,FALSE)),\"\")","v":""},{"$f":"IF(VLOOKUP($L15,invullijst!$A$11:$M$226,4,FALSE)=\"\",\"\",VLOOKUP($L15,invullijst!$A$11:$M$226,4,FALSE))","v":"vr"},208,{"$f":"IF(VLOOKUP($L15,invullijst!$A$11:$M$185,2,FALSE)=\"\",\"\",VLOOKUP($L15,invullijst!$A$11:$M$185,2,FALSE))","v":"Erin van Hulten"},null,{"$f":"IF(VLOOKUP($L15,invullijst!$A$11:$M$185,10,FALSE)=0,\"\",VLOOKUP($L15,invullijst!$A$11:$M$185,10,FALSE))","v":78}]
["Totaal B1 korps",{"$nulls":5},{"$f":"SUM(G12:G15)","v":182},null,"Totaal B1 korps",{"$nulls":5},{"$f":"SUM(O12:O15)","v":308}]
[]
[1,{"$f":"IF($G$3=\"k\",IF(VLOOKUP($D18,invullijst!$A$11:$M$185,11,FALSE)=0,\" \",VLOOKUP($D18,invullijst!$A$11:$M$185,11,FALSE)),\"\")","v":""},{"$f":"IF(VLOOKUP(D18,invullijst!A$11:F$226,4,FALSE)=\"\",\"\",VLOOKUP(D18,invullijst!A$11:D$226,4,FALSE))","v":0},null,{"$f":"IF(VLOOKUP($D18,invullijst!$A$11:$M$185,2,FALSE)=\"\",\"\",VLOOKUP($D18,invullijst!$A$11:$M$185,2,FALSE))","v":0},null,{"$f":"IF(VLOOKUP($D18,invullijst!$A$11:$M$185,10,FALSE)=0,\"\",VLOOKUP($D18,invullijst!$A$11:$M$185,10,FALSE))","v":""},null,1,{"$f":"IF($O$3=\"k\",IF(VLOOKUP($L18,invullijst!$A$11:$M$185,11,FALSE)=0,\" \",VLOOKUP($L18,invullijst!$A$11:$M$185,11,FALSE)),\"\")","v":""},{"$f":"IF(VLOOKUP($L18,invullijst!$A$11:$M$226,4,FALSE)=\"\",\"\",VLOOKUP($L18,invullijst!$A$11:$M$226,4,FALSE))","v":"vr"},217,{"$f":"IF(VLOOKUP($L18,invullijst!$A$11:$M$185,2,FALSE)=\"\",\"\",VLOOKUP($L18,invullijst!$A$11:$M$185,2,FALSE))","v":"Hans Laghuwitz"},null,{"$f":"IF(VLOOKUP($L18,invullijst!$A$11:$M$185,10,FALSE)=0,\"\",VLOOKUP($L18,invullijst!$A$11:$M$185,10,FALSE))","v":72}]
[2,{"$f":"IF($G$3=\"k\",IF(VLOOKUP($D19,invullijst!$A$11:$M$185,11,FALSE)=0,\" \",VLOOKUP($D19,invullijst!$A$11:$M$185,11,FALSE)),\"\")","v":""},{"$f":"IF(VLOOKUP(D19,invullijst!A$11:F$226,4,FALSE)=\"\",\"\",VLOOKUP(D19,invullijst!A$11:D$226,4,FALSE))","v":0},null,{"$f":"IF(VLOOKUP($D19,invullijst!$A$11:$M$185,2,FALSE)=\"\",\"\",VLOOKUP($D19,invullijst!$A$11:$M$185,2,FALSE))","v":0},null,{"$f":"IF(VLOOKUP($D19,invullijst!$A$11:$M$185,10,FALSE)=0,\"\",VLOOKUP($D19,invullijst!$A$11:$M$185,10,FALSE))","v":""},null,2,{"$f":"IF($O$3=\"k\",IF(VLOOKUP($L19,invullijst!$A$11:$M$185,11,FALSE)=0,\" \",VLOOKUP($L19,invullijst!$A$11:$M$185,11,FALSE)),\"\")","v":""},{"$f":"IF(VLOOKUP($L19,invullijst!$A$11:$M$226,4,FALSE)=\"\",\"\",VLOOKUP($L19,invullijst!$A$11:$M$226,4,FALSE))","v":"vr"},222,{"$f":"IF(VLOOKUP($L19,invullijst!$A$11:$M$185,2,FALSE)=\"\",\"\",VLOOKUP($L19,invullijst!$A$11:$M$185,2,FALSE))","v":"Nick de Vaan"},null,{"$f":"IF(VLOOKUP($L19,invullijst!$A$11:$M$185,10,FALSE)=0,\"\",VLOOKUP($L19,invullijst!$A$11:$M$185,10,FALSE))","v":82}]
[3,{"$f":"IF($G$3=\"k\",IF(VLOOKUP($D20,invullijst!$A$11:$M$185,11,FALSE)=0,\" \",VLOOKUP($D20,invullijst!$A$11:$M$185,11,FALSE)),\"\")","v":""},{"$f":"IF(VLOOKUP(D20,invullijst!A$11:F$226,4,FALSE)=\"\",\"\",VLOOKUP(D20,invullijst!A$11:D$226,4,FALSE))","v":0},null,{"$f":"IF(VLOOKUP($D20,invullijst!$A$11:$M$185,2,FALSE)=\"\",\"\",VLOOKUP($D20,invullijst!$A$11:$M$185,2,FALSE))","v":0},null,{"$f":"IF(VLOOKUP($D20,invullijst!$A$11:$M$185,10,FALSE)=0,\"\",VLOOKUP($D20,invullijst!$A$11:$M$185,10,FALSE))","v":""},null,3,{"$f":"IF($O$3=\"k\",IF(VLOOKUP($L20,invullijst!$A$11:$M$185,11,FALSE)=0,\" \",VLOOKUP($L20,invullijst!$A$11:$M$185,11,FALSE)),\"\")","v":""},{"$f":"IF(VLOOKUP($L20,invullijst!$A$11:$M$226,4,FALSE)=\"\",\"\",VLOOKUP($L20,invullijst!$A$11:$M$226,4,FALSE))","v":"vr"},213,{"$f":"IF(VLOOKUP($L20,invullijst!$A$11:$M$185,2,FALSE)=\"\",\"\",VLOOKUP($L20,invullijst!$A$11:$M$185,2,FALSE))","v":"Roland van Delft"},null,{"$f":"IF(VLOOKUP($L20,invullijst!$A$11:$M$185,10,FALSE)=0,\"\",VLOOKUP($L20,invullijst!$A$11:$M$185,10,FALSE))","v":71}]
[4,{"$f":"IF($G$3=\"k\",IF(VLOOKUP($D21,invullijst!$A$11:$M$185,11,FALSE)=0,\" \",VLOOKUP($D21,invullijst!$A$11:$M$185,11,FALSE)),\"\")","v":""},{"$f":"IF(VLOOKUP(D21,invullijst!A$11:F$226,4,FALSE)=\"\",\"\",VLOOKUP(D21,invullijst!A$11:D$226,4,FALSE))","v":0},null,{"$f":"IF(VLOOKUP($D21,invullijst!$A$11:$M$185,2,FALSE)=\"\",\"\",VLOOKUP($D21,invullijst!$A$11:$M$185,2,FALSE))","v":0},null,{"$f":"IF(VLOOKUP($D21,invullijst!$A$11:$M$185,10,FALSE)=0,\"\",VLOOKUP($D21,invullijst!$A$11:$M$185,10,FALSE))","v":""},null,4,{"$f":"IF($O$3=\"k\",IF(VLOOKUP($L21,invullijst!$A$11:$M$185,11,FALSE)=0,\" \",VLOOKUP($L21,invullijst!$A$11:$M$185,11,FALSE)),\"\")","v":""},{"$f":"IF(VLOOKUP($L21,invullijst!$A$11:$M$226,4,FALSE)=\"\",\"\",VLOOKUP($L21,invullijst!$A$11:$M$226,4,FALSE))","v":"vr"},202,{"$f":"IF(VLOOKUP($L21,invullijst!$A$11:$M$185,2,FALSE)=\"\",\"\",VLOOKUP($L21,invullijst!$A$11:$M$185,2,FALSE))","v":"Arco van Kuijk"},null,{"$f":"IF(VLOOKUP($L21,invullijst!$A$11:$M$185,10,FALSE)=0,\"\",VLOOKUP($L21,invullijst!$A$11:$M$185,10,FALSE))","v":76}]
["DIVERSEN / INHAAL",{"$nulls":7},"DIVERSEN ",{"$nulls":5},{"$f":"SUM(O18:O21)","v":301}]
[]
["OPGELEGD (Jeugd <16 en 65+)"]
[1,{"$f":"IF($G$3=\"k\",IF(VLOOKUP($D25,invullijst!$A$11:$M$185,11,FALSE)=0,\" \",VLOOKUP($D25,invullijst!$A$11:$M$185,11,FALSE)),\"\")","v":""},{"$f":"IF(VLOOKUP(D25,invullijst!A$11:F$226,4,FALSE)=\"\",\"\",VLOOKUP(D25,invullijst!A$11:D$226,4,FALSE))","v":"65+"},112,{"$f":"IF(VLOOKUP($D25,invullijst!$A$11:$M$185,2,FALSE)=\"\",\"\",VLOOKUP($D25,invullijst!$A$11:$M$185,2,FALSE))","v":"Toon van Buul"},null,{"$f":"IF(VLOOKUP($D25,invullijst!$A$11:$M$185,10,FALSE)=0,\"\",VLOOKUP($D25,invullijst!$A$11:$M$185,10,FALSE))","v":64},null,1,{"$f":"IF($O$3=\"k\",IF(VLOOKUP($L25,invullijst!$A$11:$M$185,11,FALSE)=0,\" \",VLOOKUP($L25,invullijst!$A$11:$M$185,11,FALSE)),\"\")","v":""},{"$f":"IF(VLOOKUP($L25,invullijst!$A$11:$M$226,4,FALSE)=\"\",\"\",VLOOKUP($L25,invullijst!$A$11:$M$226,4,FALSE))","v":"65+"},218,{"$f":"IF(VLOOKUP($L25,invullijst!$A$11:$M$185,2,FALSE)=\"\",\"\",VLOOKUP($L25,invullijst!$A$11:$M$185,2,FALSE))","v":"Jacob van de Werken"},null,{"$f":"IF(VLOOKUP($L25,invullijst!$A$11:$M$185,10,FALSE)=0,\"\",VLOOKUP($L25,invullijst!$A$11:$M$185,10,FALSE))","v":91}]
[2,{"$f":"IF($G$3=\"k\",IF(VLOOKUP($D26,invullijst!$A$11:$M$185,11,FALSE)=0,\" \",VLOOKUP($D26,invullijst!$A$11:$M$185,11,FALSE)),\"\")","v":""},{"$f":"IF(VLOOKUP(D26,invullijst!A$11:F$226,4,FALSE)=\"\",\"\",VLOOKUP(D26,invullijst!A$11:D$226,4,FALSE))","v":"65+"},107,{"$f":"IF(VLOOKUP($D26,invullijst!$A$11:$M$185,2,FALSE)=\"\",\"\",VLOOKUP($D26,invullijst!$A$11:$M$185,2,FALSE))","v":"Cees Coppens"},null,{"$f":"IF(VLOOKUP($D26,invullijst!$A$11:$M$185,10,FALSE)=0,\"\",VLOOKUP($D26,invullijst!$A$11:$M$185,10,FALSE))","v":75},null,2,{"$f":"IF($O$3=\"k\",IF(VLOOKUP($L26,invullijst!$A$11:$M$185,11,FALSE)=0,\" \",VLOOKUP($L26,invullijst!$A$11:$M$185,11,FALSE)),\"\")","v":""},{"$f":"IF(VLOOKUP($L26,invullijst!$A$11:$M$226,4,FALSE)=\"\",\"\",VLOOKUP($L26,invullijst!$A$11:$M$226,4,FALSE))","v":"65+"},220,{"$f":"IF(VLOOKUP($L26,invullijst!$A$11:$M$185,2,FALSE)=\"\",\"\",VLOOKUP($L26,invullijst!$A$11:$M$185,2,FALSE))","v":"Kees Vos"},null,{"$f":"IF(VLOOKUP($L26,invullijst!$A$11:$M$185,10,FALSE)=0,\"\",VLOOKUP($L26,invullijst!$A$11:$M$185,10,FALSE))","v":90}]
[3,{"$f":"IF($G$3=\"k\",IF(VLOOKUP($D27,invullijst!$A$11:$M$185,11,FALSE)=0,\" \",VLOOKUP($D27,invullijst!$A$11:$M$185,11,FALSE)),\"\")","v":""},{"$f":"IF(VLOOKUP(D27,invullijst!A$11:F$226,4,FALSE)=\"\",\"\",VLOOKUP(D27,invullijst!A$11:D$226,4,FALSE))","v":0},null,{"$f":"IF(VLOOKUP($D27,invullijst!$A$11:$M$185,2,FALSE)=\"\",\"\",VLOOKUP($D27,invullijst!$A$11:$M$185,2,FALSE))","v":0},null,{"$f":"IF(VLOOKUP($D27,invullijst!$A$11:$M$185,10,FALSE)=0,\"\",VLOOKUP($D27,invullijst!$A$11:$M$185,10,FALSE))","v":""},null,3,{"$f":"IF($O$3=\"k\",IF(VLOOKUP($L27,invullijst!$A$11:$M$185,11,FALSE)=0,\" \",VLOOKUP($L27,invullijst!$A$11:$M$185,11,FALSE)),\"\")","v":""},{"$f":"IF(VLOOKUP($L27,invullijst!$A$11:$M$226,4,FALSE)=\"\",\"\",VLOOKUP($L27,invullijst!$A$11:$M$226,4,FALSE))","v":"65+"},219,{"$f":"IF(VLOOKUP($L27,invullijst!$A$11:$M$185,2,FALSE)=\"\",\"\",VLOOKUP($L27,invullijst!$A$11:$M$185,2,FALSE))","v":"Frans de Bont"},null,{"$f":"IF(VLOOKUP($L27,invullijst!$A$11:$M$185,10,FALSE)=0,\"\",VLOOKUP($L27,invullijst!$A$11:$M$185,10,FALSE))","v":96}]
["Totaal korps opgelegd A1",{"$nulls":5},{"$f":"SUM(G25:G27)","v":139},null,"Totaal korps opgelegd A1",{"$nulls":5},{"$f":"SUM(O25:O27)","v":277}]
[]
[1,{"$f":"IF($G$3=\"k\",IF(VLOOKUP($D30,invullijst!$A$11:$M$185,11,FALSE)=0,\" \",VLOOKUP($D30,invullijst!$A$11:$M$185,11,FALSE)),\"\")","v":""},{"$f":"IF(VLOOKUP(D30,invullijst!A$11:F$226,4,FALSE)=\"\",\"\",VLOOKUP(D30,invullijst!A$11:D$226,4,FALSE))","v":0},null,{"$f":"IF(VLOOKUP($D30,invullijst!$A$11:$M$185,2,FALSE)=\"\",\"\",VLOOKUP($D30,invullijst!$A$11:$M$185,2,FALSE))","v":0},null,{"$f":"IF(VLOOKUP($D30,invullijst!$A$11:$M$185,10,FALSE)=0,\"\",VLOOKUP($D30,invullijst!$A$11:$M$185,10,FALSE))","v":""},null,1,{"$f":"IF($O$3=\"k\",IF(VLOOKUP($L30,invullijst!$A$11:$M$185,11,FALSE)=0,\" \",VLOOKUP($L30,invullijst!$A$11:$M$185,11,FALSE)),\"\")","v":""},{"$f":"IF(VLOOKUP($L30,invullijst!$A$11:$M$226,4,FALSE)=\"\",\"\",VLOOKUP($L30,invullijst!$A$11:$M$226,4,FALSE))","v":"65+"},214,{"$f":"IF(VLOOKUP($L30,invullijst!$A$11:$M$185,2,FALSE)=\"\",\"\",VLOOKUP($L30,invullijst!$A$11:$M$185,2,FALSE))","v":"Andre de Vaan"},null,{"$f":"IF(VLOOKUP($L30,invullijst!$A$11:$M$185,10,FALSE)=0,\"\",VLOOKUP($L30,invullijst!$A$11:$M$185,10,FALSE))","v":90}]
[2,{"$f":"IF($G$3=\"k\",IF(VLOOKUP($D31,invullijst!$A$11:$M$185,11,FALSE)=0,\" \",VLOOKUP($D31,invullijst!$A$11:$M$185,11,FALSE)),\"\")","v":""},{"$f":"IF(VLOOKUP(D31,invullijst!A$11:F$226,4,FALSE)=\"\",\"\",VLOOKUP(D31,invullijst!A$11:D$226,4,FALSE))","v":0},null,{"$f":"IF(VLOOKUP($D31,invullijst!$A$11:$M$185,2,FALSE)=\"\",\"\",VLOOKUP($D31,invullijst!$A$11:$M$185,2,FALSE))","v":0},null,{"$f":"IF(VLOOKUP($D31,invullijst!$A$11:$M$185,10,FALSE)=0,\"\",VLOOKUP($D31,invullijst!$A$11:$M$185,10,FALSE))","v":""},null,2,{"$f":"IF($O$3=\"k\",IF(VLOOKUP($L31,invullijst!$A$11:$M$185,11,FALSE)=0,\" \",VLOOKUP($L31,invullijst!$A$11:$M$185,11,FALSE)),\"\")","v":""},{"$f":"IF(VLOOKUP($L31,invullijst!$A$11:$M$226,4,FALSE)=\"\",\"\",VLOOKUP($L31,invullijst!$A$11:$M$226,4,FALSE))","v":"65+"},212,{"$f":"IF(VLOOKUP($L31,invullijst!$A$11:$M$185,2,FALSE)=\"\",\"\",VLOOKUP($L31,invullijst!$A$11:$M$185,2,FALSE))","v":"René Duquesnoy"},null,{"$f":"IF(VLOOKUP($L31,invullijst!$A$11:$M$185,10,FALSE)=0,\"\",VLOOKUP($L31,invullijst!$A$11:$M$185,10,FALSE))","v":86}]
[3,{"$f":"IF($G$3=\"k\",IF(VLOOKUP($D32,invullijst!$A$11:$M$185,11,FALSE)=0,\" \",VLOOKUP($D32,invullijst!$A$11:$M$185,11,FALSE)),\"\")","v":""},{"$f":"IF(VLOOKUP(D32,invullijst!A$11:F$226,4,FALSE)=\"\",\"\",VLOOKUP(D32,invullijst!A$11:D$226,4,FALSE))","v":0},null,{"$f":"IF(VLOOKUP($D32,invullijst!$A$11:$M$185,2,FALSE)=\"\",\"\",VLOOKUP($D32,invullijst!$A$11:$M$185,2,FALSE))","v":0},null,{"$f":"IF(VLOOKUP($D32,invullijst!$A$11:$M$185,10,FALSE)=0,\"\",VLOOKUP($D32,invullijst!$A$11:$M$185,10,FALSE))","v":""},null,3,{"$f":"IF($O$3=\"k\",IF(VLOOKUP($L32,invullijst!$A$11:$M$185,11,FALSE)=0,\" \",VLOOKUP($L32,invullijst!$A$11:$M$185,11,FALSE)),\"\")","v":""},{"$f":"IF(VLOOKUP($L32,invullijst!$A$11:$M$226,4,FALSE)=\"\",\"\",VLOOKUP($L32,invullijst!$A$11:$M$226,4,FALSE))","v":"J"},221,{"$f":"IF(VLOOKUP($L32,invullijst!$A$11:$M$185,2,FALSE)=\"\",\"\",VLOOKUP($L32,invullijst!$A$11:$M$185,2,FALSE))","v":"Mees Huijben"},null,{"$f":"IF(VLOOKUP($L32,invullijst!$A$11:$M$185,10,FALSE)=0,\"\",VLOOKUP($L32,invullijst!$A$11:$M$185,10,FALSE))","v":75}]
["Totaal korps opgelegd A2",{"$nulls":5},{"$f":"SUM(G30:G32)","v":0},null,"Totaal korps opgelegd A2",{"$nulls":5},{"$f":"SUM(O30:O32)","v":251}]
[]
[1,{"$f":"IF($G$3=\"k\",IF(VLOOKUP($D35,invullijst!$A$11:$M$185,11,FALSE)=0,\" \",VLOOKUP($D35,invullijst!$A$11:$M$185,11,FALSE)),\"\")","v":""},{"$f":"IF(VLOOKUP(D35,invullijst!A$11:F$226,4,FALSE)=\"\",\"\",VLOOKUP(D35,invullijst!A$11:D$226,4,FALSE))","v":0},null,{"$f":"IF(VLOOKUP($D35,invullijst!$A$11:$M$185,2,FALSE)=\"\",\"\",VLOOKUP($D35,invullijst!$A$11:$M$185,2,FALSE))","v":0},null,{"$f":"IF(VLOOKUP($D35,invullijst!$A$11:$M$185,10,FALSE)=0,\"\",VLOOKUP($D35,invullijst!$A$11:$M$185,10,FALSE))","v":""},null,1,{"$f":"IF($O$3=\"k\",IF(VLOOKUP($L35,invullijst!$A$11:$M$185,11,FALSE)=0,\" \",VLOOKUP($L35,invullijst!$A$11:$M$185,11,FALSE)),\"\")","v":""},{"$f":"IF(VLOOKUP($L35,invullijst!$A$11:$M$226,4,FALSE)=\"\",\"\",VLOOKUP($L35,invullijst!$A$11:$M$226,4,FALSE))","v":0},null,{"$f":"IF(VLOOKUP($L35,invullijst!$A$11:$M$185,2,FALSE)=\"\",\"\",VLOOKUP($L35,invullijst!$A$11:$M$185,2,FALSE))","v":0},null,{"$f":"IF(VLOOKUP($L35,invullijst!$A$11:$M$185,10,FALSE)=0,\"\",VLOOKUP($L35,invullijst!$A$11:$M$185,10,FALSE))","v":""}]
[2,{"$f":"IF($G$3=\"k\",IF(VLOOKUP($D36,invullijst!$A$11:$M$185,11,FALSE)=0,\" \",VLOOKUP($D36,invullijst!$A$11:$M$185,11,FALSE)),\"\")","v":""},{"$f":"IF(VLOOKUP(D36,invullijst!A$11:F$226,4,FALSE)=\"\",\"\",VLOOKUP(D36,invullijst!A$11:D$226,4,FALSE))","v":0},null,{"$f":"IF(VLOOKUP($D36,invullijst!$A$11:$M$185,2,FALSE)=\"\",\"\",VLOOKUP($D36,invullijst!$A$11:$M$185,2,FALSE))","v":0},null,{"$f":"IF(VLOOKUP($D36,invullijst!$A$11:$M$185,10,FALSE)=0,\"\",VLOOKUP($D36,invullijst!$A$11:$M$185,10,FALSE))","v":""},null,2,{"$f":"IF($O$3=\"k\",IF(VLOOKUP($L36,invullijst!$A$11:$M$185,11,FALSE)=0,\" \",VLOOKUP($L36,invullijst!$A$11:$M$185,11,FALSE)),\"\")","v":""},{"$f":"IF(VLOOKUP($L36,invullijst!$A$11:$M$226,4,FALSE)=\"\",\"\",VLOOKUP($L36,invullijst!$A$11:$M$226,4,FALSE))","v":0},null,{"$f":"IF(VLOOKUP($L36,invullijst!$A$11:$M$185,2,FALSE)=\"\",\"\",VLOOKUP($L36,invullijst!$A$11:$M$185,2,FALSE))","v":0},null,{"$f":"IF(VLOOKUP($L36,invullijst!$A$11:$M$185,10,FALSE)=0,\"\",VLOOKUP($L36,invullijst!$A$11:$M$185,10,FALSE))","v":""}]
[3,{"$f":"IF($G$3=\"k\",IF(VLOOKUP($D37,invullijst!$A$11:$M$185,11,FALSE)=0,\" \",VLOOKUP($D37,invullijst!$A$11:$M$185,11,FALSE)),\"\")","v":""},{"$f":"IF(VLOOKUP(D37,invullijst!A$11:F$226,4,FALSE)=\"\",\"\",VLOOKUP(D37,invullijst!A$11:D$226,4,FALSE))","v":0},null,{"$f":"IF(VLOOKUP($D37,invullijst!$A$11:$M$185,2,FALSE)=\"\",\"\",VLOOKUP($D37,invullijst!$A$11:$M$185,2,FALSE))","v":0},null,{"$f":"IF(VLOOKUP($D37,invullijst!$A$11:$M$185,10,FALSE)=0,\"\",VLOOKUP($D37,invullijst!$A$11:$M$185,10,FALSE))","v":""},null,3,{"$f":"IF($O$3=\"k\",IF(VLOOKUP($L37,invullijst!$A$11:$M$185,11,FALSE)=0,\" \",VLOOKUP($L37,invullijst!$A$11:$M$185,11,FALSE)),\"\")","v":""},{"$f":"IF(VLOOKUP($L37,invullijst!$A$11:$M$226,4,FALSE)=\"\",\"\",VLOOKUP($L37,invullijst!$A$11:$M$226,4,FALSE))","v":0},null,{"$f":"IF(VLOOKUP($L37,invullijst!$A$11:$M$185,2,FALSE)=\"\",\"\",VLOOKUP($L37,invullijst!$A$11:$M$185,2,FALSE))","v":0},null,{"$f":"IF(VLOOKUP($L37,invullijst!$A$11:$M$185,10,FALSE)=0,\"\",VLOOKUP($L37,invullijst!$A$11:$M$185,10,FALSE))","v":""}]
["Totaal korps opgelegd A3",{"$nulls":5},{"$f":"SUM(G35:G37)","v":0},null,"Totaal korps opgelegd A3",{"$nulls":5},{"$f":"SUM(O35:O37)","v":0}]

{"sheet":"wedstrijd 5B","index":14,"n_rows":38,"n_cols":15,"rows_kept":38,"merged":[[0,0,0,4],[0,5,0,7],[0,8,0,14],[1,0,1,11],[1,12,1,14],[2,1,2,5],[2,9,2,13],[4,0,4,14],[5,4,5,5],[5,12,5,13],[6,4,6,5],[6,12,6,13],[7,4,7,5],[7,12,7,13],[8,4,8,5],[8,12,8,13],[9,0,9,5],[9,8,9,13],[11,4,11,5],[11,12,11,13],[12,4,12,5],[12,12,12,13],[13,4,13,5],[13,12,13,13],[14,4,14,5],[14,12,14,13],[15,0,15,5],[15,8,15,13],[17,4,17,5],[17,12,17,13],[18,4,18,5],[18,12,18,13],[19,4,19,5],[19,12,19,13],[20,4,20,5],[20,12,20,13],[21,0,21,5],[21,8,21,13],[23,0,23,14],[24,4,24,5],[24,12,24,13],[25,4,25,5],[25,12,25,13],[26,4,26,5],[26,12,26,13],[27,0,27,5],[27,8,27,13],[29,4,29,5],[29,12,29,13],[30,4,30,5],[30,12,30,13],[31,4,31,5],[31,12,31,13],[32,0,32,5],[32,8,32,13],[34,4,34,5],[34,12,34,13],[35,4,35,5],[35,12,35,13],[36,4,36,5],[36,12,36,13],[37,0,37,5],[37,8,37,13]]}
[{"$f":"invullijst!F1","v":"Organistatie"},{"$nulls":4},{"$f":"invullijst!H2","v":"2024 - 2025"},null,null,{"$f":"invullijst!F3","v":"O.L.V. Schuts Elshout"}]
["Datum: ",{"$nulls":11},"2025-03-16"]
[5,{"$f":"IF(VLOOKUP(A3,invullijst!A1:F5,2,FALSE)=\"\",\"\",VLOOKUP(A3,invullijst!A1:F5,2,FALSE))","v":"Sint Jan Baptist Kaatsheuvel"},{"$nulls":6},4,{"$f":"IF(VLOOKUP(I3,invullijst!A1:C5,2,FALSE)=\"\",\"\",VLOOKUP(I3,invullijst!A1:C5,2,FALSE))","v":"Sint Ambrosius Haarsteeg"}]
[]
["vrijehand"]
[1,{"$f":"IF($G$3=\"k\",IF(VLOOKUP($D6,invullijst!$A$11:$M$185,11,FALSE)=0,\" \",VLOOKUP($D6,invullijst!$A$11:$M$185,11,FALSE)),\"\")","v":""},{"$f":"IF(VLOOKUP(D6,invullijst!A$11:F$226,4,FALSE)=\"\",\"\",VLOOKUP(D6,invullijst!A$11:D$226,4,FALSE))","v":"vr"},507,{"$f":"IF(VLOOKUP($D6,invullijst!$A$11:$M$185,2,FALSE)=\"\",\"\",VLOOKUP($D6,invullijst!$A$11:$M$185,2,FALSE))","v":"Michael Blaauwbroek"},null,{"$f":"IF(VLOOKUP($D6,invullijst!$A$11:$M$185,10,FALSE)=0,\"\",VLOOKUP($D6,invullijst!$A$11:$M$185,10,FALSE))","v":70},null,1,{"$f":"IF($O$3=\"k\",IF(VLOOKUP($L6,invullijst!$A$11:$M$185,11,FALSE)=0,\" \",VLOOKUP($L6,invullijst!$A$11:$M$185,11,FALSE)),\"\")","v":""},{"$f":"IF(VLOOKUP($L6,invullijst!$A$11:$M$226,4,FALSE)=\"\",\"\",VLOOKUP($L6,invullijst!$A$11:$M$226,4,FALSE))","v":"vr"},410,{"$f":"IF(VLOOKUP($L6,invullijst!$A$11:$M$185,2,FALSE)=\"\",\"\",VLOOKUP($L6,invullijst!$A$11:$M$185,2,FALSE))","v":"Tonnie Koks"},null,{"$f":"IF(VLOOKUP($L6,invullijst!$A$11:$M$185,10,FALSE)=0,\"\",VLOOKUP($L6,invullijst!$A$11:$M$185,10,FALSE))","v":86}]
[2,{"$f":"IF($G$3=\"k\",IF(VLOOKUP($D7,invullijst!$A$11:$M$185,11,FALSE)=0,\" \",VLOOKUP($D7,invullijst!$A$11:$M$185,11,FALSE)),\"\")","v":""},{"$f":"IF(VLOOKUP(D7,invullijst!A$11:F$226,4,FALSE)=\"\",\"\",VLOOKUP(D7,invullijst!A$11:D$226,4,FALSE))","v":"vr"},501,{"$f":"IF(VLOOKUP($D7,invullijst!$A$11:$M$185,2,FALSE)=\"\",\"\",VLOOKUP($D7,invullijst!$A$11:$M$185,2,FALSE))","v":"Annette Vos"},null,{"$f":"IF(VLOOKUP($D7,invullijst!$A$11:$M$185,10,FALSE)=0,\"\",VLOOKUP($D7,invullijst!$A$11:$M$185,10,FALSE))","v":81},null,2,{"$f":"IF($O$3=\"k\",IF(VLOOKUP($L7,invullijst!$A$11:$M$185,11,FALSE)=0,\" \",VLOOKUP($L7,invullijst!$A$11:$M$185,11,FALSE)),\"\")","v":""},{"$f":"IF(VLOOKUP($L7,invullijst!$A$11:$M$226,4,FALSE)=\"\",\"\",VLOOKUP($L7,invullijst!$A$11:$M$226,4,FALSE))","v":"vr"},416,{"$f":"IF(VLOOKUP($L7,invullijst!$A$11:$M$185,2,FALSE)=\"\",\"\",VLOOKUP($L7,invullijst!$A$11:$M$185,2,FALSE))","v":"Thijs Koks"},null,{"$f":"IF(VLOOKUP($L7,invullijst!$A$11:$M$185,10,FALSE)=0,\"\",VLOOKUP($L7,invullijst!$A$11:$M$185,10,FALSE))","v":92}]
[3,{"$f":"IF($G$3=\"k\",IF(VLOOKUP($D8,invullijst!$A$11:$M$185,11,FALSE)=0,\" \",VLOOKUP($D8,invullijst!$A$11:$M$185,11,FALSE)),\"\")","v":""},{"$f":"IF(VLOOKUP(D8,invullijst!A$11:F$226,4,FALSE)=\"\",\"\",VLOOKUP(D8,invullijst!A$11:D$226,4,FALSE))","v":"vr"},506,{"$f":"IF(VLOOKUP($D8,invullijst!$A$11:$M$185,2,FALSE)=\"\",\"\",VLOOKUP($D8,invullijst!$A$11:$M$185,2,FALSE))","v":"Maikel Monden"},null,{"$f":"IF(VLOOKUP($D8,invullijst!$A$11:$M$185,10,FALSE)=0,\"\",VLOOKUP($D8,invullijst!$A$11:$M$185,10,FALSE))","v":82},null,3,{"$f":"IF($O$3=\"k\",IF(VLOOKUP($L8,invullijst!$A$11:$M$185,11,FALSE)=0,\" \",VLOOKUP($L8,invullijst!$A$11:$M$185,11,FALSE)),\"\")","v":""},{"$f":"IF(VLOOKUP($L8,invullijst!$A$11:$M$226,4,FALSE)=\"\",\"\",VLOOKUP($L8,invullijst!$A$11:$M$226,4,FALSE))","v":"vr"},406,{"$f":"IF(VLOOKUP($L8,invullijst!$A$11:$M$185,2,FALSE)=\"\",\"\",VLOOKUP($L8,invullijst!$A$11:$M$185,2,FALSE))","v":"Jeroen van Oss"},null,{"$f":"IF(VLOOKUP($L8,invullijst!$A$11:$M$185,10,FALSE)=0,\"\",VLOOKUP($L8,invullijst!$A$11:$M$185,10,FALSE))","v":80}]
[4,{"$f":"IF($G$3=\"k\",IF(VLOOKUP($D9,invullijst!$A$11:$M$185,11,FALSE)=0,\" \",VLOOKUP($D9,invullijst!$A$11:$M$185,11,FALSE)),\"\")","v":""},{"$f":"IF(VLOOKUP(D9,invullijst!A$11:F$226,4,FALSE)=\"\",\"\",VLOOKUP(D9,invullijst!A$11:D$226,4,FALSE))","v":"vr"},513,{"$f":"IF(VLOOKUP($D9,invullijst!$A$11:$M$185,2,FALSE)=\"\",\"\",VLOOKUP($D9,invullijst!$A$11:$M$185,2,FALSE))","v":"Mark van Delft"},null,{"$f":"IF(VLOOKUP($D9,invullijst!$A$11:$M$185,10,FALSE)=0,\"\",VLOOKUP($D9,invullijst!$A$11:$M$185,10,FALSE))","v":74},null,4,{"$f":"IF($O$3=\"k\",IF(VLOOKUP($L9,invullijst!$A$11:$M$185,11,FALSE)=0,\" \",VLOOKUP($L9,invullijst!$A$11:$M$185,11,FALSE)),\"\")","v":""},{"$f":"IF(VLOOKUP($L9,invullijst!$A$11:$M$226,4,FALSE)=\"\",\"\",VLOOKUP($L9,invullijst!$A$11:$M$226,4,FALSE))","v":"vr"},411,{"$f":"IF(VLOOKUP($L9,invullijst!$A$11:$M$185,2,FALSE)=\"\",\"\",VLOOKUP($L9,invullijst!$A$11:$M$185,2,FALSE))","v":"Wilma v/d Lee"},null,{"$f":"IF(VLOOKUP($L9,invullijst!$A$11:$M$185,10,FALSE)=0,\"\",VLOOKUP($L9,invullijst!$A$11:$M$185,10,FALSE))","v":75}]
["Totaal A korps",{"$nulls":5},{"$f":"SUM(G6:G9)","v":307},null,"Totaal A korps",{"$nulls":5},{"$f":"SUM(O6:O9)","v":333}]
[]
[1,{"$f":"IF($G$3=\"k\",IF(VLOOKUP($D12,invullijst!$A$11:$M$185,11,FALSE)=0,\" \",VLOOKUP($D12,invullijst!$A$11:$M$185,11,FALSE)),\"\")","v":""},{"$f":"IF(VLOOKUP(D12,invullijst!A$11:F$226,4,FALSE)=\"\",\"\",VLOOKUP(D12,invullijst!A$11:D$226,4,FALSE))","v":"vr"},517,{"$f":"IF(VLOOKUP($D12,invullijst!$A$11:$M$185,2,FALSE)=\"\",\"\",VLOOKUP($D12,invullijst!$A$11:$M$185,2,FALSE))","v":"Diny Vos"},null,{"$f":"IF(VLOOKUP($D12,invullijst!$A$11:$M$185,10,FALSE)=0,\"\",VLOOKUP($D12,invullijst!$A$11:$M$185,10,FALSE))","v":64},null,1,{"$f":"IF($O$3=\"k\",IF(VLOOKUP($L12,invullijst!$A$11:$M$185,11,FALSE)=0,\" \",VLOOKUP($L12,invullijst!$A$11:$M$185,11,FALSE)),\"\")","v":""},{"$f":"IF(VLOOKUP($L12,invullijst!$A$11:$M$226,4,FALSE)=\"\",\"\",VLOOKUP($L12,invullijst!$A$11:$M$226,4,FALSE))","v":0},null,{"$f":"IF(VLOOKUP($L12,invullijst!$A$11:$M$185,2,FALSE)=\"\",\"\",VLOOKUP($L12,invullijst!$A$11:$M$185,2,FALSE))","v":0},null,{"$f":"IF(VLOOKUP($L12,invullijst!$A$11:$M$185,10,FALSE)=0,\"\",VLOOKUP($L12,invullijst!$A$11:$M$185,10,FALSE))","v":""}]
[2,{"$f":"IF($G$3=\"k\",IF(VLOOKUP($D13,invullijst!$A$11:$M$185,11,FALSE)=0,\" \",VLOOKUP($D13,invullijst!$A$11:$M$185,11,FALSE)),\"\")","v":""},{"$f":"IF(VLOOKUP(D13,invullijst!A$11:F$226,4,FALSE)=\"\",\"\",VLOOKUP(D13,invullijst!A$11:D$226,4,FALSE))","v":"vr"},512,{"$f":"IF(VLOOKUP($D13,invullijst!$A$11:$M$185,2,FALSE)=\"\",\"\",VLOOKUP($D13,invullijst!$A$11:$M$185,2,FALSE))","v":"Hans Bergakker"},null,{"$f":"IF(VLOOKUP($D13,invullijst!$A$11:$M$185,10,FALSE)=0,\"\",VLOOKUP($D13,invullijst!$A$11:$M$185,10,FALSE))","v":73},null,2,{"$f":"IF($O$3=\"k\",IF(VLOOKUP($L13,invullijst!$A$11:$M$185,11,FALSE)=0,\" \",VLOOKUP($L13,invullijst!$A$11:$M$185,11,FALSE)),\"\")","v":""},{"$f":"IF(VLOOKUP($L13,invullijst!$A$11:$M$226,4,FALSE)=\"\",\"\",VLOOKUP($L13,invullijst!$A$11:$M$226,4,FALSE))","v":0},null,{"$f":"IF(VLOOKUP($L13,invullijst!$A$11:$M$185,2,FALSE)=\"\",\"\",VLOOKUP($L13,invullijst!$A$11:$M$185,2,FALSE))","v":0},null,{"$f":"IF(VLOOKUP($L13,invullijst!$A$11:$M$185,10,FALSE)=0,\"\",VLOOKUP($L13,invullijst!$A$11:$M$185,10,FALSE))","v":""}]
[3,{"$f":"IF($G$3=\"k\",IF(VLOOKUP($D14,invullijst!$A$11:$M$185,11,FALSE)=0,\" \",VLOOKUP($D14,invullijst!$A$11:$M$185,11,FALSE)),\"\")","v":""},{"$f":"IF(VLOOKUP(D14,invullijst!A$11:F$226,4,FALSE)=\"\",\"\",VLOOKUP(D14,invullijst!A$11:D$226,4,FALSE))","v":"vr"},508,{"$f":"IF(VLOOKUP($D14,invullijst!$A$11:$M$185,2,FALSE)=\"\",\"\",VLOOKUP($D14,invullijst!$A$11:$M$185,2,FALSE))","v":"Rowan Dobbelsteen"},null,{"$f":"IF(VLOOKUP($D14,invullijst!$A$11:$M$185,10,FALSE)=0,\"\",VLOOKUP($D14,invullijst!$A$11:$M$185,10,FALSE))","v":84},null,3,{"$f":"IF($O$3=\"k\",IF(VLOOKUP($L14,invullijst!$A$11:$M$185,11,FALSE)=0,\" \",VLOOKUP($L14,invullijst!$A$11:$M$185,11,FALSE)),\"\")","v":""},{"$f":"IF(VLOOKUP($L14,invullijst!$A$11:$M$226,4,FALSE)=\"\",\"\",VLOOKUP($L14,invullijst!$A$11:$M$226,4,FALSE))","v":0},null,{"$f":"IF(VLOOKUP($L14,invullijst!$A$11:$M$185,2,FALSE)=\"\",\"\",VLOOKUP($L14,invullijst!$A$11:$M$185,2,FALSE))","v":0},null,{"$f":"IF(VLOOKUP($L14,invullijst!$A$11:$M$185,10,FALSE)=0,\"\",VLOOKUP($L14,invullijst!$A$11:$M$185,10,FALSE))","v":""}]
[4,{"$f":"IF($G$3=\"k\",IF(VLOOKUP($D15,invullijst!$A$11:$M$185,11,FALSE)=0,\" \",VLOOKUP($D15,invullijst!$A$11:$M$185,11,FALSE)),\"\")","v":""},{"$f":"IF(VLOOKUP(D15,invullijst!A$11:F$226,4,FALSE)=\"\",\"\",VLOOKUP(D15,invullijst!A$11:D$226,4,FALSE))","v":"vr"},519,{"$f":"IF(VLOOKUP($D15,invullijst!$A$11:$M$185,2,FALSE)=\"\",\"\",VLOOKUP($D15,invullijst!$A$11:$M$185,2,FALSE))","v":"Frank Derissen"},null,{"$f":"IF(VLOOKUP($D15,invullijst!$A$11:$M$185,10,FALSE)=0,\"\",VLOOKUP($D15,invullijst!$A$11:$M$185,10,FALSE))","v":76},null,4,{"$f":"IF($O$3=\"k\",IF(VLOOKUP($L15,invullijst!$A$11:$M$185,11,FALSE)=0,\" \",VLOOKUP($L15,invullijst!$A$11:$M$185,11,FALSE)),\"\")","v":""},{"$f":"IF(VLOOKUP($L15,invullijst!$A$11:$M$226,4,FALSE)=\"\",\"\",VLOOKUP($L15,invullijst!$A$11:$M$226,4,FALSE))","v":0},null,{"$f":"IF(VLOOKUP($L15,invullijst!$A$11:$M$185,2,FALSE)=\"\",\"\",VLOOKUP($L15,invullijst!$A$11:$M$185,2,FALSE))","v":0},null,{"$f":"IF(VLOOKUP($L15,invullijst!$A$11:$M$185,10,FALSE)=0,\"\",VLOOKUP($L15,invullijst!$A$11:$M$185,10,FALSE))","v":""}]
["Totaal B1 korps",{"$nulls":5},{"$f":"SUM(G12:G15)","v":297},null,"Totaal B1 korps",{"$nulls":5},{"$f":"SUM(O12:O15)","v":0}]
[]
[1,{"$f":"IF($G$3=\"k\",IF(VLOOKUP($D18,invullijst!$A$11:$M$185,11,FALSE)=0,\" \",VLOOKUP($D18,invullijst!$A$11:$M$185,11,FALSE)),\"\")","v":""},{"$f":"IF(VLOOKUP(D18,invullijst!A$11:F$226,4,FALSE)=\"\",\"\",VLOOKUP(D18,invullijst!A$11:D$226,4,FALSE))","v":0},null,{"$f":"IF(VLOOKUP($D18,invullijst!$A$11:$M$185,2,FALSE)=\"\",\"\",VLOOKUP($D18,invullijst!$A$11:$M$185,2,FALSE))","v":0},null,{"$f":"IF(VLOOKUP($D18,invullijst!$A$11:$M$185,10,FALSE)=0,\"\",VLOOKUP($D18,invullijst!$A$11:$M$185,10,FALSE))","v":""},null,1,{"$f":"IF($O$3=\"k\",IF(VLOOKUP($L18,invullijst!$A$11:$M$185,11,FALSE)=0,\" \",VLOOKUP($L18,invullijst!$A$11:$M$185,11,FALSE)),\"\")","v":""},{"$f":"IF(VLOOKUP($L18,invullijst!$A$11:$M$226,4,FALSE)=\"\",\"\",VLOOKUP($L18,invullijst!$A$11:$M$226,4,FALSE))","v":0},null,{"$f":"IF(VLOOKUP($L18,invullijst!$A$11:$M$185,2,FALSE)=\"\",\"\",VLOOKUP($L18,invullijst!$A$11:$M$185,2,FALSE))","v":0},null,{"$f":"IF(VLOOKUP($L18,invullijst!$A$11:$M$185,10,FALSE)=0,\"\",VLOOKUP($L18,invullijst!$A$11:$M$185,10,FALSE))","v":""}]
[2,{"$f":"IF($G$3=\"k\",IF(VLOOKUP($D19,invullijst!$A$11:$M$185,11,FALSE)=0,\" \",VLOOKUP($D19,invullijst!$A$11:$M$185,11,FALSE)),\"\")","v":""},{"$f":"IF(VLOOKUP(D19,invullijst!A$11:F$226,4,FALSE)=\"\",\"\",VLOOKUP(D19,invullijst!A$11:D$226,4,FALSE))","v":0},null,{"$f":"IF(VLOOKUP($D19,invullijst!$A$11:$M$185,2,FALSE)=\"\",\"\",VLOOKUP($D19,invullijst!$A$11:$M$185,2,FALSE))","v":0},null,{"$f":"IF(VLOOKUP($D19,invullijst!$A$11:$M$185,10,FALSE)=0,\"\",VLOOKUP($D19,invullijst!$A$11:$M$185,10,FALSE))","v":""},null,2,{"$f":"IF($O$3=\"k\",IF(VLOOKUP($L19,invullijst!$A$11:$M$185,11,FALSE)=0,\" \",VLOOKUP($L19,invullijst!$A$11:$M$185,11,FALSE)),\"\")","v":""},{"$f":"IF(VLOOKUP($L19,invullijst!$A$11:$M$226,4,FALSE)=\"\",\"\",VLOOKUP($L19,invullijst!$A$11:$M$226,4,FALSE))","v":0},null,{"$f":"IF(VLOOKUP($L19,invullijst!$A$11:$M$185,2,FALSE)=\"\",\"\",VLOOKUP($L19,invullijst!$A$11:$M$185,2,FALSE))","v":0},null,{"$f":"IF(VLOOKUP($L19,invullijst!$A$11:$M$185,10,FALSE)=0,\"\",VLOOKUP($L19,invullijst!$A$11:$M$185,10,FALSE))","v":""}]
[3,{"$f":"IF($G$3=\"k\",IF(VLOOKUP($D20,invullijst!$A$11:$M$185,11,FALSE)=0,\" \",VLOOKUP($D20,invullijst!$A$11:$M$185,11,FALSE)),\"\")","v":""},{"$f":"IF(VLOOKUP(D20,invullijst!A$11:F$226,4,FALSE)=\"\",\"\",VLOOKUP(D20,invullijst!A$11:D$226,4,FALSE))","v":0},null,{"$f":"IF(VLOOKUP($D20,invullijst!$A$11:$M$185,2,FALSE)=\"\",\"\",VLOOKUP($D20,invullijst!$A$11:$M$185,2,FALSE))","v":0},null,{"$f":"IF(VLOOKUP($D20,invullijst!$A$11:$M$185,10,FALSE)=0,\"\",VLOOKUP($D20,invullijst!$A$11:$M$185,10,FALSE))","v":""},null,3,{"$f":"IF($O$3=\"k\",IF(VLOOKUP($L20,invullijst!$A$11:$M$185,11,FALSE)=0,\" \",VLOOKUP($L20,invullijst!$A$11:$M$185,11,FALSE)),\"\")","v":""},{"$f":"IF(VLOOKUP($L20,invullijst!$A$11:$M$226,4,FALSE)=\"\",\"\",VLOOKUP($L20,invullijst!$A$11:$M$226,4,FALSE))","v":0},null,{"$f":"IF(VLOOKUP($L20,invullijst!$A$11:$M$185,2,FALSE)=\"\",\"\",VLOOKUP($L20,invullijst!$A$11:$M$185,2,FALSE))","v":0},null,{"$f":"IF(VLOOKUP($L20,invullijst!$A$11:$M$185,10,FALSE)=0,\"\",VLOOKUP($L20,invullijst!$A$11:$M$185,10,FALSE))","v":""}]
[4,{"$f":"IF($G$3=\"k\",IF(VLOOKUP($D21,invullijst!$A$11:$M$185,11,FALSE)=0,\" \",VLOOKUP($D21,invullijst!$A$11:$M$185,11,FALSE)),\"\")","v":""},{"$f":"IF(VLOOKUP(D21,invullijst!A$11:F$226,4,FALSE)=\"\",\"\",VLOOKUP(D21,invullijst!A$11:D$226,4,FALSE))","v":0},null,{"$f":"IF(VLOOKUP($D21,invullijst!$A$11:$M$185,2,FALSE)=\"\",\"\",VLOOKUP($D21,invullijst!$A$11:$M$185,2,FALSE))","v":0},null,{"$f":"IF(VLOOKUP($D21,invullijst!$A$11:$M$185,10,FALSE)=0,\"\",VLOOKUP($D21,invullijst!$A$11:$M$185,10,FALSE))","v":""},null,4,{"$f":"IF($O$3=\"k\",IF(VLOOKUP($L21,invullijst!$A$11:$M$185,11,FALSE)=0,\" \",VLOOKUP($L21,invullijst!$A$11:$M$185,11,FALSE)),\"\")","v":""},{"$f":"IF(VLOOKUP($L21,invullijst!$A$11:$M$226,4,FALSE)=\"\",\"\",VLOOKUP($L21,invullijst!$A$11:$M$226,4,FALSE))","v":0},null,{"$f":"IF(VLOOKUP($L21,invullijst!$A$11:$M$185,2,FALSE)=\"\",\"\",VLOOKUP($L21,invullijst!$A$11:$M$185,2,FALSE))","v":0},null,{"$f":"IF(VLOOKUP($L21,invullijst!$A$11:$M$185,10,FALSE)=0,\"\",VLOOKUP($L21,invullijst!$A$11:$M$185,10,FALSE))","v":""}]
["DIVERSEN / INHAAL",{"$nulls":7},"DIVERSEN / INHAAL"]
[]
["OPGELEGD (Jeugd <16 en 65+)"]
[1,{"$f":"IF($G$3=\"k\",IF(VLOOKUP($D25,invullijst!$A$11:$M$185,11,FALSE)=0,\" \",VLOOKUP($D25,invullijst!$A$11:$M$185,11,FALSE)),\"\")","v":""},{"$f":"IF(VLOOKUP(D25,invullijst!A$11:F$226,4,FALSE)=\"\",\"\",VLOOKUP(D25,invullijst!A$11:D$226,4,FALSE))","v":"65+"},516,{"$f":"IF(VLOOKUP($D25,invullijst!$A$11:$M$185,2,FALSE)=\"\",\"\",VLOOKUP($D25,invullijst!$A$11:$M$185,2,FALSE))","v":"Henry Bergakker disp"},null,{"$f":"IF(VLOOKUP($D25,invullijst!$A$11:$M$185,10,FALSE)=0,\"\",VLOOKUP($D25,invullijst!$A$11:$M$185,10,FALSE))","v":92},null,1,{"$f":"IF($O$3=\"k\",IF(VLOOKUP($L25,invullijst!$A$11:$M$185,11,FALSE)=0,\" \",VLOOKUP($L25,invullijst!$A$11:$M$185,11,FALSE)),\"\")","v":""},{"$f":"IF(VLOOKUP($L25,invullijst!$A$11:$M$226,4,FALSE)=\"\",\"\",VLOOKUP($L25,invullijst!$A$11:$M$226,4,FALSE))","v":"65+"},401,{"$f":"IF(VLOOKUP($L25,invullijst!$A$11:$M$185,2,FALSE)=\"\",\"\",VLOOKUP($L25,invullijst!$A$11:$M$185,2,FALSE))","v":"Frans van Beurden"},null,{"$f":"IF(VLOOKUP($L25,invullijst!$A$11:$M$185,10,FALSE)=0,\"\",VLOOKUP($L25,invullijst!$A$11:$M$185,10,FALSE))","v":93}]
[2,{"$f":"IF($G$3=\"k\",IF(VLOOKUP($D26,invullijst!$A$11:$M$185,11,FALSE)=0,\" \",VLOOKUP($D26,invullijst!$A$11:$M$185,11,FALSE)),\"\")","v":""},{"$f":"IF(VLOOKUP(D26,invullijst!A$11:F$226,4,FALSE)=\"\",\"\",VLOOKUP(D26,invullijst!A$11:D$226,4,FALSE))","v":"65+"},509,{"$f":"IF(VLOOKUP($D26,invullijst!$A$11:$M$185,2,FALSE)=\"\",\"\",VLOOKUP($D26,invullijst!$A$11:$M$185,2,FALSE))","v":"Adwan de Pinth"},null,{"$f":"IF(VLOOKUP($D26,invullijst!$A$11:$M$185,10,FALSE)=0,\"\",VLOOKUP($D26,invullijst!$A$11:$M$185,10,FALSE))","v":91},null,2,{"$f":"IF($O$3=\"k\",IF(VLOOKUP($L26,invullijst!$A$11:$M$185,11,FALSE)=0,\" \",VLOOKUP($L26,invullijst!$A$11:$M$185,11,FALSE)),\"\")","v":""},{"$f":"IF(VLOOKUP($L26,invullijst!$A$11:$M$226,4,FALSE)=\"\",\"\",VLOOKUP($L26,invullijst!$A$11:$M$226,4,FALSE))","v":"65+"},405,{"$f":"IF(VLOOKUP($L26,invullijst!$A$11:$M$185,2,FALSE)=\"\",\"\",VLOOKUP($L26,invullijst!$A$11:$M$185,2,FALSE))","v":"Jan de Vaan"},null,{"$f":"IF(VLOOKUP($L26,invullijst!$A$11:$M$185,10,FALSE)=0,\"\",VLOOKUP($L26,invullijst!$A$11:$M$185,10,FALSE))","v":97}]
[3,{"$f":"IF($G$3=\"k\",IF(VLOOKUP($D27,invullijst!$A$11:$M$185,11,FALSE)=0,\" \",VLOOKUP($D27,invullijst!$A$11:$M$185,11,FALSE)),\"\")","v":""},{"$f":"IF(VLOOKUP(D27,invullijst!A$11:F$226,4,FALSE)=\"\",\"\",VLOOKUP(D27,invullijst!A$11:D$226,4,FALSE))","v":"65+"},515,{"$f":"IF(VLOOKUP($D27,invullijst!$A$11:$M$185,2,FALSE)=\"\",\"\",VLOOKUP($D27,invullijst!$A$11:$M$185,2,FALSE))","v":"Ilona Bergakker disp"},null,{"$f":"IF(VLOOKUP($D27,invullijst!$A$11:$M$185,10,FALSE)=0,\"\",VLOOKUP($D27,invullijst!$A$11:$M$185,10,FALSE))","v":89},null,3,{"$f":"IF($O$3=\"k\",IF(VLOOKUP($L27,invullijst!$A$11:$M$185,11,FALSE)=0,\" \",VLOOKUP($L27,invullijst!$A$11:$M$185,11,FALSE)),\"\")","v":""},{"$f":"IF(VLOOKUP($L27,invullijst!$A$11:$M$226,4,FALSE)=\"\",\"\",VLOOKUP($L27,invullijst!$A$11:$M$226,4,FALSE))","v":"65+"},404,{"$f":"IF(VLOOKUP($L27,invullijst!$A$11:$M$185,2,FALSE)=\"\",\"\",VLOOKUP($L27,invullijst!$A$11:$M$185,2,FALSE))","v":"Gerard van Beurden"},null,{"$f":"IF(VLOOKUP($L27,invullijst!$A$11:$M$185,10,FALSE)=0,\"\",VLOOKUP($L27,invullijst!$A$11:$M$185,10,FALSE))","v":97}]
["Totaal korps opgelegd A1",{"$nulls":5},{"$f":"SUM(G25:G27)","v":272},null,"Totaal korps opgelegd A1",{"$nulls":5},{"$f":"SUM(O25:O27)","v":287}]
[]
[1,{"$f":"IF($G$3=\"k\",IF(VLOOKUP($D30,invullijst!$A$11:$M$185,11,FALSE)=0,\" \",VLOOKUP($D30,invullijst!$A$11:$M$185,11,FALSE)),\"\")","v":""},{"$f":"IF(VLOOKUP(D30,invullijst!A$11:F$226,4,FALSE)=\"\",\"\",VLOOKUP(D30,invullijst!A$11:D$226,4,FALSE))","v":"65+"},518,{"$f":"IF(VLOOKUP($D30,invullijst!$A$11:$M$185,2,FALSE)=\"\",\"\",VLOOKUP($D30,invullijst!$A$11:$M$185,2,FALSE))","v":"Ton Stanz"},null,{"$f":"IF(VLOOKUP($D30,invullijst!$A$11:$M$185,10,FALSE)=0,\"\",VLOOKUP($D30,invullijst!$A$11:$M$185,10,FALSE))","v":77},null,1,{"$f":"IF($O$3=\"k\",IF(VLOOKUP($L30,invullijst!$A$11:$M$185,11,FALSE)=0,\" \",VLOOKUP($L30,invullijst!$A$11:$M$185,11,FALSE)),\"\")","v":""},{"$f":"IF(VLOOKUP($L30,invullijst!$A$11:$M$226,4,FALSE)=\"\",\"\",VLOOKUP($L30,invullijst!$A$11:$M$226,4,FALSE))","v":"65+"},413,{"$f":"IF(VLOOKUP($L30,invullijst!$A$11:$M$185,2,FALSE)=\"\",\"\",VLOOKUP($L30,invullijst!$A$11:$M$185,2,FALSE))","v":"Frans Mommersteeg"},null,{"$f":"IF(VLOOKUP($L30,invullijst!$A$11:$M$185,10,FALSE)=0,\"\",VLOOKUP($L30,invullijst!$A$11:$M$185,10,FALSE))","v":94}]
[2,{"$f":"IF($G$3=\"k\",IF(VLOOKUP($D31,invullijst!$A$11:$M$185,11,FALSE)=0,\" \",VLOOKUP($D31,invullijst!$A$11:$M$185,11,FALSE)),\"\")","v":""},{"$f":"IF(VLOOKUP(D31,invullijst!A$11:F$226,4,FALSE)=\"\",\"\",VLOOKUP(D31,invullijst!A$11:D$226,4,FALSE))","v":0},null,{"$f":"IF(VLOOKUP($D31,invullijst!$A$11:$M$185,2,FALSE)=\"\",\"\",VLOOKUP($D31,invullijst!$A$11:$M$185,2,FALSE))","v":0},null,{"$f":"IF(VLOOKUP($D31,invullijst!$A$11:$M$185,10,FALSE)=0,\"\",VLOOKUP($D31,invullijst!$A$11:$M$185,10,FALSE))","v":""},null,2,{"$f":"IF($O$3=\"k\",IF(VLOOKUP($L31,invullijst!$A$11:$M$185,11,FALSE)=0,\" \",VLOOKUP($L31,invullijst!$A$11:$M$185,11,FALSE)),\"\")","v":""},{"$f":"IF(VLOOKUP($L31,invullijst!$A$11:$M$226,4,FALSE)=\"\",\"\",VLOOKUP($L31,invullijst!$A$11:$M$226,4,FALSE))","v":"65+"},415,{"$f":"IF(VLOOKUP($L31,invullijst!$A$11:$M$185,2,FALSE)=\"\",\"\",VLOOKUP($L31,invullijst!$A$11:$M$185,2,FALSE))","v":"Wim de Gouw"},null,{"$f":"IF(VLOOKUP($L31,invullijst!$A$11:$M$185,10,FALSE)=0,\"\",VLOOKUP($L31,invullijst!$A$11:$M$185,10,FALSE))","v":94}]
[3,{"$f":"IF($G$3=\"k\",IF(VLOOKUP($D32,invullijst!$A$11:$M$185,11,FALSE)=0,\" \",VLOOKUP($D32,invullijst!$A$11:$M$185,11,FALSE)),\"\")","v":""},{"$f":"IF(VLOOKUP(D32,invullijst!A$11:F$226,4,FALSE)=\"\",\"\",VLOOKUP(D32,invullijst!A$11:D$226,4,FALSE))","v":0},null,{"$f":"IF(VLOOKUP($D32,invullijst!$A$11:$M$185,2,FALSE)=\"\",\"\",VLOOKUP($D32,invullijst!$A$11:$M$185,2,FALSE))","v":0},null,{"$f":"IF(VLOOKUP($D32,invullijst!$A$11:$M$185,10,FALSE)=0,\"\",VLOOKUP($D32,invullijst!$A$11:$M$185,10,FALSE))","v":""},null,3,{"$f":"IF($O$3=\"k\",IF(VLOOKUP($L32,invullijst!$A$11:$M$185,11,FALSE)=0,\" \",VLOOKUP($L32,invullijst!$A$11:$M$185,11,FALSE)),\"\")","v":""},{"$f":"IF(VLOOKUP($L32,invullijst!$A$11:$M$226,4,FALSE)=\"\",\"\",VLOOKUP($L32,invullijst!$A$11:$M$226,4,FALSE))","v":"65+"},412,{"$f":"IF(VLOOKUP($L32,invullijst!$A$11:$M$185,2,FALSE)=\"\",\"\",VLOOKUP($L32,invullijst!$A$11:$M$185,2,FALSE))","v":"Francien v/d Wiel"},null,{"$f":"IF(VLOOKUP($L32,invullijst!$A$11:$M$185,10,FALSE)=0,\"\",VLOOKUP($L32,invullijst!$A$11:$M$185,10,FALSE))","v":94}]
["Totaal korps opgelegd A2",{"$nulls":5},{"$f":"SUM(G30:G32)","v":77},null,"Totaal korps opgelegd A2",{"$nulls":5},{"$f":"SUM(O30:O32)","v":282}]
[]
[1,{"$f":"IF($G$3=\"k\",IF(VLOOKUP($D35,invullijst!$A$11:$M$185,11,FALSE)=0,\" \",VLOOKUP($D35,invullijst!$A$11:$M$185,11,FALSE)),\"\")","v":""},{"$f":"IF(VLOOKUP(D35,invullijst!A$11:F$226,4,FALSE)=\"\",\"\",VLOOKUP(D35,invullijst!A$11:D$226,4,FALSE))","v":0},null,{"$f":"IF(VLOOKUP($D35,invullijst!$A$11:$M$185,2,FALSE)=\"\",\"\",VLOOKUP($D35,invullijst!$A$11:$M$185,2,FALSE))","v":0},null,{"$f":"IF(VLOOKUP($D35,invullijst!$A$11:$M$185,10,FALSE)=0,\"\",VLOOKUP($D35,invullijst!$A$11:$M$185,10,FALSE))","v":""},null,1,{"$f":"IF($O$3=\"k\",IF(VLOOKUP($L35,invullijst!$A$11:$M$185,11,FALSE)=0,\" \",VLOOKUP($L35,invullijst!$A$11:$M$185,11,FALSE)),\"\")","v":""},{"$f":"IF(VLOOKUP($L35,invullijst!$A$11:$M$226,4,FALSE)=\"\",\"\",VLOOKUP($L35,invullijst!$A$11:$M$226,4,FALSE))","v":"65+"},403,{"$f":"IF(VLOOKUP($L35,invullijst!$A$11:$M$185,2,FALSE)=\"\",\"\",VLOOKUP($L35,invullijst!$A$11:$M$185,2,FALSE))","v":"Dorien de Kort"},null,{"$f":"IF(VLOOKUP($L35,invullijst!$A$11:$M$185,10,FALSE)=0,\"\",VLOOKUP($L35,invullijst!$A$11:$M$185,10,FALSE))","v":90}]
[2,{"$f":"IF($G$3=\"k\",IF(VLOOKUP($D36,invullijst!$A$11:$M$185,11,FALSE)=0,\" \",VLOOKUP($D36,invullijst!$A$11:$M$185,11,FALSE)),\"\")","v":""},{"$f":"IF(VLOOKUP(D36,invullijst!A$11:F$226,4,FALSE)=\"\",\"\",VLOOKUP(D36,invullijst!A$11:D$226,4,FALSE))","v":0},null,{"$f":"IF(VLOOKUP($D36,invullijst!$A$11:$M$185,2,FALSE)=\"\",\"\",VLOOKUP($D36,invullijst!$A$11:$M$185,2,FALSE))","v":0},null,{"$f":"IF(VLOOKUP($D36,invullijst!$A$11:$M$185,10,FALSE)=0,\"\",VLOOKUP($D36,invullijst!$A$11:$M$185,10,FALSE))","v":""},null,2,{"$f":"IF($O$3=\"k\",IF(VLOOKUP($L36,invullijst!$A$11:$M$185,11,FALSE)=0,\" \",VLOOKUP($L36,invullijst!$A$11:$M$185,11,FALSE)),\"\")","v":""},{"$f":"IF(VLOOKUP($L36,invullijst!$A$11:$M$226,4,FALSE)=\"\",\"\",VLOOKUP($L36,invullijst!$A$11:$M$226,4,FALSE))","v":0},null,{"$f":"IF(VLOOKUP($L36,invullijst!$A$11:$M$185,2,FALSE)=\"\",\"\",VLOOKUP($L36,invullijst!$A$11:$M$185,2,FALSE))","v":0},null,{"$f":"IF(VLOOKUP($L36,invullijst!$A$11:$M$185,10,FALSE)=0,\"\",VLOOKUP($L36,invullijst!$A$11:$M$185,10,FALSE))","v":""}]
[3,{"$f":"IF($G$3=\"k\",IF(VLOOKUP($D37,invullijst!$A$11:$M$185,11,FALSE)=0,\" \",VLOOKUP($D37,invullijst!$A$11:$M$185,11,FALSE)),\"\")","v":""},{"$f":"IF(VLOOKUP(D37,invullijst!A$11:F$226,4,FALSE)=\"\",\"\",VLOOKUP(D37,invullijst!A$11:D$226,4,FALSE))","v":0},null,{"$f":"IF(VLOOKUP($D37,invullijst!$A$11:$M$185,2,FALSE)=\"\",\"\",VLOOKUP($D37,invullijst!$A$11:$M$185,2,FALSE))","v":0},null,{"$f":"IF(VLOOKUP($D37,invullijst!$A$11:$M$185,10,FALSE)=0,\"\",VLOOKUP($D37,invullijst!$A$11:$M$185,10,FALSE))","v":""},null,3,{"$f":"IF($O$3=\"k\",IF(VLOOKUP($L37,invullijst!$A$11:$M$185,11,FALSE)=0,\" \",VLOOKUP($L37,invullijst!$A$11:$M$185,11,FALSE)),\"\")","v":""},{"$f":"IF(VLOOKUP($L37,invullijst!$A$11:$M$226,4,FALSE)=\"\",\"\",VLOOKUP($L37,invullijst!$A$11:$M$226,4,FALSE))","v":0},null,{"$f":"IF(VLOOKUP($L37,invullijst!$A$11:$M$185,2,FALSE)=\"\",\"\",VLOOKUP($L37,invullijst!$A$11:$M$185,2,FALSE))","v":0},null,{"$f":"IF(VLOOKUP($L37,invullijst!$A$11:$M$185,10,FALSE)=0,\"\",VLOOKUP($L37,invullijst!$A$11:$M$185,10,FALSE))","v":""}]
["Totaal korps opgelegd A3",{"$nulls":5},{"$f":"SUM(G35:G37)","v":0},null,"Totaal korps opgelegd A3",{"$nulls":5},{"$f":"SUM(O35:O37)","v":90}]

{"sheet":"blanco wedstrijd","index":15,"n_rows":38,"n_cols":13,"rows_kept":38,"merged":[[0,0,0,4],[0,5,0,7],[0,8,0,14],[1,0,1,11],[1,12,1,14],[2,1,2,5],[2,9,2,13],[4,0,4,14],[5,4,5,5],[5,12,5,13],[6,4,6,5],[6,12,6,13],[7,4,7,5],[7,12,7,13],[8,4,8,5],[8,12,8,13],[9,0,9,5],[9,8,9,13],[11,4,11,5],[11,12,11,13],[12,4,12,5],[12,12,12,13],[13,4,13,5],[13,12,13,13],[14,4,14,5],[14,12,14,13],[15,0,15,5],[15,8,15,13],[17,4,17,5],[17,12,17,13],[18,4,18,5],[18,12,18,13],[19,4,19,5],[19,12,19,13],[20,4,20,5],[20,12,20,13],[21,0,21,5],[21,8,21,13],[23,0,23,14],[24,4,24,5],[24,12,24,13],[25,4,25,5],[25,12,25,13],[26,4,26,5],[26,12,26,13],[27,0,27,5],[27,8,27,13],[29,4,29,5],[29,12,29,13],[30,4,30,5],[30,12,30,13],[31,4,31,5],[31,12,31,13],[32,0,32,5],[32,8,32,13],[34,4,34,5],[34,12,34,13],[35,4,35,5],[35,12,35,13],[36,4,36,5],[36,12,36,13],[37,0,37,5],[37,8,37,13]]}
[{"$f":"invullijst!F1","v":"Organistatie"},{"$nulls":4},{"$f":"invullijst!H2","v":"2024 - 2025"},null,null,{"$f":"invullijst!F3","v":"O.L.V. Schuts Elshout"}]
["Datum: ",{"$nulls":11},"2025-03-16"]
[5,{"$f":"IF(VLOOKUP(A3,invullijst!A1:F5,2,FALSE)=\"\",\"\",VLOOKUP(A3,invullijst!A1:F5,2,FALSE))","v":"Sint Jan Baptist Kaatsheuvel"},{"$nulls":6},4,{"$f":"IF(VLOOKUP(I3,invullijst!A1:C5,2,FALSE)=\"\",\"\",VLOOKUP(I3,invullijst!A1:C5,2,FALSE))","v":"Sint Ambrosius Haarsteeg"}]
[]
["vrijehand"]
[1,{"$f":"IF($G$3=\"k\",IF(VLOOKUP($D6,invullijst!$A$11:$M$185,11,FALSE)=0,\" \",VLOOKUP($D6,invullijst!$A$11:$M$185,11,FALSE)),\"\")","v":""},{"$nulls":6},1,{"$f":"IF($O$3=\"k\",IF(VLOOKUP($L6,invullijst!$A$11:$M$185,11,FALSE)=0,\" \",VLOOKUP($L6,invullijst!$A$11:$M$185,11,FALSE)),\"\")","v":""}]
[2,{"$f":"IF($G$3=\"k\",IF(VLOOKUP($D7,invullijst!$A$11:$M$185,11,FALSE)=0,\" \",VLOOKUP($D7,invullijst!$A$11:$M$185,11,FALSE)),\"\")","v":""},{"$nulls":6},2,{"$f":"IF($O$3=\"k\",IF(VLOOKUP($L7,invullijst!$A$11:$M$185,11,FALSE)=0,\" \",VLOOKUP($L7,invullijst!$A$11:$M$185,11,FALSE)),\"\")","v":""}]
[3,{"$f":"IF($G$3=\"k\",IF(VLOOKUP($D8,invullijst!$A$11:$M$185,11,FALSE)=0,\" \",VLOOKUP($D8,invullijst!$A$11:$M$185,11,FALSE)),\"\")","v":""},{"$nulls":6},3,{"$f":"IF($O$3=\"k\",IF(VLOOKUP($L8,invullijst!$A$11:$M$185,11,FALSE)=0,\" \",VLOOKUP($L8,invullijst!$A$11:$M$185,11,FALSE)),\"\")","v":""}]
[4,{"$f":"IF($G$3=\"k\",IF(VLOOKUP($D9,invullijst!$A$11:$M$185,11,FALSE)=0,\" \",VLOOKUP($D9,invullijst!$A$11:$M$185,11,FALSE)),\"\")","v":""},{"$nulls":6},4,{"$f":"IF($O$3=\"k\",IF(VLOOKUP($L9,invullijst!$A$11:$M$185,11,FALSE)=0,\" \",VLOOKUP($L9,invullijst!$A$11:$M$185,11,FALSE)),\"\")","v":""}]
["Totaal A korps",{"$nulls":7},"Totaal A korps"]
[]
[1,{"$f":"IF($G$3=\"k\",IF(VLOOKUP($D12,invullijst!$A$11:$M$185,11,FALSE)=0,\" \",VLOOKUP($D12,invullijst!$A$11:$M$185,11,FALSE)),\"\")","v":""},{"$nulls":6},1,{"$f":"IF($O$3=\"k\",IF(VLOOKUP($L12,invullijst!$A$11:$M$185,11,FALSE)=0,\" \",VLOOKUP($L12,invullijst!$A$11:$M$185,11,FALSE)),\"\")","v":""}]
[2,{"$f":"IF($G$3=\"k\",IF(VLOOKUP($D13,invullijst!$A$11:$M$185,11,FALSE)=0,\" \",VLOOKUP($D13,invullijst!$A$11:$M$185,11,FALSE)),\"\")","v":""},{"$nulls":6},2,{"$f":"IF($O$3=\"k\",IF(VLOOKUP($L13,invullijst!$A$11:$M$185,11,FALSE)=0,\" \",VLOOKUP($L13,invullijst!$A$11:$M$185,11,FALSE)),\"\")","v":""}]
[3,{"$f":"IF($G$3=\"k\",IF(VLOOKUP($D14,invullijst!$A$11:$M$185,11,FALSE)=0,\" \",VLOOKUP($D14,invullijst!$A$11:$M$185,11,FALSE)),\"\")","v":""},{"$nulls":6},3,{"$f":"IF($O$3=\"k\",IF(VLOOKUP($L14,invullijst!$A$11:$M$185,11,FALSE)=0,\" \",VLOOKUP($L14,invullijst!$A$11:$M$185,11,FALSE)),\"\")","v":""}]
[4,{"$f":"IF($G$3=\"k\",IF(VLOOKUP($D15,invullijst!$A$11:$M$185,11,FALSE)=0,\" \",VLOOKUP($D15,invullijst!$A$11:$M$185,11,FALSE)),\"\")","v":""},{"$nulls":6},4,{"$f":"IF($O$3=\"k\",IF(VLOOKUP($L15,invullijst!$A$11:$M$185,11,FALSE)=0,\" \",VLOOKUP($L15,invullijst!$A$11:$M$185,11,FALSE)),\"\")","v":""}]
["Totaal B1 korps",{"$nulls":7},"Totaal B1 korps"]
[]
[1,{"$f":"IF($G$3=\"k\",IF(VLOOKUP($D18,invullijst!$A$11:$M$185,11,FALSE)=0,\" \",VLOOKUP($D18,invullijst!$A$11:$M$185,11,FALSE)),\"\")","v":""},{"$nulls":6},1,{"$f":"IF($O$3=\"k\",IF(VLOOKUP($L18,invullijst!$A$11:$M$185,11,FALSE)=0,\" \",VLOOKUP($L18,invullijst!$A$11:$M$185,11,FALSE)),\"\")","v":""}]
[2,{"$f":"IF($G$3=\"k\",IF(VLOOKUP($D19,invullijst!$A$11:$M$185,11,FALSE)=0,\" \",VLOOKUP($D19,invullijst!$A$11:$M$185,11,FALSE)),\"\")","v":""},{"$nulls":6},2,{"$f":"IF($O$3=\"k\",IF(VLOOKUP($L19,invullijst!$A$11:$M$185,11,FALSE)=0,\" \",VLOOKUP($L19,invullijst!$A$11:$M$185,11,FALSE)),\"\")","v":""}]
[3,{"$f":"IF($G$3=\"k\",IF(VLOOKUP($D20,invullijst!$A$11:$M$185,11,FALSE)=0,\" \",VLOOKUP($D20,invullijst!$A$11:$M$185,11,FALSE)),\"\")","v":""},{"$nulls":6},3,{"$f":"IF($O$3=\"k\",IF(VLOOKUP($L20,invullijst!$A$11:$M$185,11,FALSE)=0,\" \",VLOOKUP($L20,invullijst!$A$11:$M$185,11,FALSE)),\"\")","v":""}]
[4,{"$f":"IF($G$3=\"k\",IF(VLOOKUP($D21,invullijst!$A$11:$M$185,11,FALSE)=0,\" \",VLOOKUP($D21,invullijst!$A$11:$M$185,11,FALSE)),\"\")","v":""},{"$nulls":6},4,{"$f":"IF($O$3=\"k\",IF(VLOOKUP($L21,invullijst!$A$11:$M$185,11,FALSE)=0,\" \",VLOOKUP($L21,invullijst!$A$11:$M$185,11,FALSE)),\"\")","v":""}]
["DIVERSEN / INHAAL",{"$nulls":7},"DIVERSEN / INHAAL"]
[]
["OPGELEGD (Jeugd <16 en 65+)"]
[1,{"$f":"IF($G$3=\"k\",IF(VLOOKUP($D25,invullijst!$A$11:$M$185,11,FALSE)=0,\" \",VLOOKUP($D25,invullijst!$A$11:$M$185,11,FALSE)),\"\")","v":""},{"$nulls":6},1,{"$f":"IF($O$3=\"k\",IF(VLOOKUP($L25,invullijst!$A$11:$M$185,11,FALSE)=0,\" \",VLOOKUP($L25,invullijst!$A$11:$M$185,11,FALSE)),\"\")","v":""}]
[2,{"$f":"IF($G$3=\"k\",IF(VLOOKUP($D26,invullijst!$A$11:$M$185,11,FALSE)=0,\" \",VLOOKUP($D26,invullijst!$A$11:$M$185,11,FALSE)),\"\")","v":""},{"$nulls":6},2,{"$f":"IF($O$3=\"k\",IF(VLOOKUP($L26,invullijst!$A$11:$M$185,11,FALSE)=0,\" \",VLOOKUP($L26,invullijst!$A$11:$M$185,11,FALSE)),\"\")","v":""}]
[3,{"$f":"IF($G$3=\"k\",IF(VLOOKUP($D27,invullijst!$A$11:$M$185,11,FALSE)=0,\" \",VLOOKUP($D27,invullijst!$A$11:$M$185,11,FALSE)),\"\")","v":""},{"$nulls":6},3,{"$f":"IF($O$3=\"k\",IF(VLOOKUP($L27,invullijst!$A$11:$M$185,11,FALSE)=0,\" \",VLOOKUP($L27,invullijst!$A$11:$M$185,11,FALSE)),\"\")","v":""}]
["Totaal korps opgelegd A1",{"$nulls":7},"Totaal korps opgelegd A1"]
[]
[1,{"$f":"IF($G$3=\"k\",IF(VLOOKUP($D30,invullijst!$A$11:$M$185,11,FALSE)=0,\" \",VLOOKUP($D30,invullijst!$A$11:$M$185,11,FALSE)),\"\")","v":""},{"$nulls":6},1,{"$f":"IF($O$3=\"k\",IF(VLOOKUP($L30,invullijst!$A$11:$M$185,11,FALSE)=0,\" \",VLOOKUP($L30,invullijst!$A$11:$M$185,11,FALSE)),\"\")","v":""}]
[2,{"$f":"IF($G$3=\"k\",IF(VLOOKUP($D31,invullijst!$A$11:$M$185,11,FALSE)=0,\" \",VLOOKUP($D31,invullijst!$A$11:$M$185,11,FALSE)),\"\")","v":""},{"$nulls":6},2,{"$f":"IF($O$3=\"k\",IF(VLOOKUP($L31,invullijst!$A$11:$M$185,11,FALSE)=0,\" \",VLOOKUP($L31,invullijst!$A$11:$M$185,11,FALSE)),\"\")","v":""}]
[3,{"$f":"IF($G$3=\"k\",IF(VLOOKUP($D32,invullijst!$A$11:$M$185,11,FALSE)=0,\" \",VLOOKUP($D32,invullijst!$A$11:$M$185,11,FALSE)),\"\")","v":""},{"$nulls":6},3,{"$f":"IF($O$3=\"k\",IF(VLOOKUP($L32,invullijst!$A$11:$M$185,11,FALSE)=0,\" \",VLOOKUP($L32,invullijst!$A$11:$M$185,11,FALSE)),\"\")","v":""}]
["Totaal korps opgelegd A2",{"$nulls":7},"Totaal korps opgelegd A2"]
[]
[1,{"$f":"IF($G$3=\"k\",IF(VLOOKUP($D35,invullijst!$A$11:$M$185,11,FALSE)=0,\" \",VLOOKUP($D35,invullijst!$A$11:$M$185,11,FALSE)),\"\")","v":""},{"$nulls":6},1,{"$f":"IF($O$3=\"k\",IF(VLOOKUP($L35,invullijst!$A$11:$M$185,11,FALSE)=0,\" \",VLOOKUP($L35,invullijst!$A$11:$M$185,11,FALSE)),\"\")","v":""}]
[2,{"$f":"IF($G$3=\"k\",IF(VLOOKUP($D36,invullijst!$A$11:$M$185,11,FALSE)=0,\" \",VLOOKUP($D36,invullijst!$A$11:$M$185,11,FALSE)),\"\")","v":""},{"$nulls":6},2,{"$f":"IF($O$3=\"k\",IF(VLOOKUP($L36,invullijst!$A$11:$M$185,11,FALSE)=0,\" \",VLOOKUP($L36,invullijst!$A$11:$M$185,11,FALSE)),\"\")","v":""}]
[3,{"$f":"IF($G$3=\"k\",IF(VLOOKUP($D37,invullijst!$A$11:$M$185,11,FALSE)=0,\" \",VLOOKUP($D37,invullijst!$A$11:$M$185,11,FALSE)),\"\")","v":""},{"$nulls":6},3,{"$f":"IF($O$3=\"k\",IF(VLOOKUP($L37,invullijst!$A$11:$M$185,11,FALSE)=0,\" \",VLOOKUP($L37,invullijst!$A$11:$M$185,11,FALSE)),\"\")","v":""}]
["Totaal korps opgelegd A3",{"$nulls":7},"Totaal korps opgelegd A3"]

{"sheet":"Blad1","index":16,"n_rows":0,"n_cols":0,"rows_kept":0}

{"sheet":"schema","index":17,"n_rows":30,"n_cols":16,"rows_kept":30,"merged":[[0,0,0,10],[0,11,0,15],[1,0,1,8],[1,9,1,15],[3,0,3,8],[3,9,3,15],[5,0,5,7],[5,9,5,15],[7,9,7,15],[8,9,8,11],[8,12,8,14],[9,9,9,11],[9,12,9,14],[11,9,11,15],[12,9,12,11],[12,12,12,14],[13,9,13,11],[13,12,13,14],[15,9,15,15],[16,9,16,11],[16,12,16,14],[17,9,17,11],[17,12,17,14],[19,9,19,15],[20,9,20,11],[20,12,20,14],[21,9,21,11],[21,12,21,14],[23,9,23,15],[24,9,24,11],[24,12,24,14],[25,0,25,7],[25,9,25,11],[25,12,25,14],[27,0,27,15],[28,0,28,15],[29,0,29,15]]}
["Onderlinge vijf luchtbuks",{"$nulls":10},{"$f":"invullijst!H2","v":"2024 - 2025"}]
["organiserend Gilde :",{"$nulls":8},{"$f":"invullijst!F3","v":"O.L.V. Schuts Elshout"}]
[]
["WEDSTRIJD FORMULIEREN OPSTUREN NAAR:",{"$nulls":8},"Johan Klerx / freek de jong / of  via whatsapp ovlb"]
[]
["WEDSTRIJD PLANNING",{"$nulls":8},"CONTACTGEGEVENS"]
["Dag","Maand","nr","Thuis","k","nr","Uit","k"]
["8","december",5,"Kaatsheuvel",null,2,"Elshout",null,null,"Baardwijk 1"]
[null,null,4,"Besoijen",null,3,"Haarsteeg",null,null,"René Pullens",null,null,"hoofdman.ambrosiusbaardwijk@gmail.com",null,null,"06-51427565"]
[null,null,1,{"$f":"IF(VLOOKUP(C10,invullijst!$A$1:$F$5,3,FALSE)=\"\",\"\",VLOOKUP(C10,invullijst!$A$1:$F$5,3,FALSE))","v":"Baardwijk"},"vrij",{"$nulls":4},"Peter Brekelmans",null,null,"peterbrekelmans@ziggo.nl",null,null,"06-14670425"]
[]
["19","Januari",4,"Baardwijk",null,2,"Elshout",null,null,"Besoijen 2"]
[null,null,5,"Kaatsheuvel",null,1,"Besoijen",null,null,"Sander Oome",null,null,"soome@home.nl",null,null,"06-28123449"]
[null,null,3,"Haarsteeg","vrij",{"$nulls":4},"Rene van Kuijk",null,null,"rene.van.kuijk@kpnmail.nl",null,null,"06-53257760"]
[]
["2","februari",1,"Besoijen",null,2,"Elshout",null,null,"Elshout 3"]
[null,null,3,"Haarsteeg","K",5,"Baardwijk",null,null,"Johan Klerx",null,null,"johanklerx1960@gmail.com",null,null,"06-28920658"]
[null,null,4,"Kaatsheuvel","vrij",{"$nulls":4},"Freek de Jong",null,null,"freekdj@hotmail.com",null,null,"06-28417602"]
[]
["23","Februari",3,"Haarsteeg","K",2,"Elshout","K",null,"Haarsteeg 4"]
[null,null,1,"Baardwijk","K",4,"Kaatsheuvel","K",null,"Frans Mommersteeg",null,null,"f.l.mommersteeg@gmail.com",null,null,"06-23566537"]
[null,null,5,"Besoijen","vrij",{"$nulls":4},"Jan de Vaan",null,null,"jan.ambrosius@kpnmail.nl",null,null,"06-57005029"]
[]
["16","Maart",3,"Baardwijk",null,1,"Besoijen",null,null,"Kaatsheuvel 5"]
[null,null,4,"Kaatsheuvel",null,5,"Haarsteeg",null,null,"Diny Vos",null,null,"diny.voswesterlaken@gmail.com",null,null,"06-20297437"]
["Slotconcours te Elshout",{"$nulls":8},"Maikel Monden",null,null,"maikel@monden.co",null,null,"06-30302817"]
[]
["Alle wedstrijden vangen aan om 10:30 uur.      Aanvang slotwedstrijd om 10:00 uur"]
["organisatie volgorde"]
["Besoyen - Elshout - Baardwijk - Kaatsheuvel - Haarsteeg"]