{"text_format":"3","workbook":"xlsx","n_sheets":20,"sheets":["invullijst","Personeel","Jeugd","65+","Korps","wedstrijd 1A","wedstrijd 1B","wedstrijd 2A","wedstrijd 2B","wedstrijd 3A","wedstrijd 3B","wedstrijd 4A","wedstrijd 4B","wedstrijd 5A","wedstrijd 5B","blanco formulier","Blad3","Blad1","schema","Blad2"],"not_rendered":{"macros":1,"defined_names":4},"read":"whole","date_system":"1900"}

{"sheet":"invullijst","index":0,"n_rows":97,"n_cols":11,"rows_kept":97,"merged":[[0,3,0,4],[0,5,0,6],[0,7,0,9],[1,3,1,4],[1,5,1,6],[1,7,1,9],[2,3,2,4],[2,5,2,10],[3,3,3,4],[3,9,4,10],[4,3,4,4],[88,4,88,8],[97,1,97,9],[98,1,98,2],[98,3,98,4],[99,1,99,2],[99,3,99,4],[100,1,100,2],[100,3,100,4],[101,1,101,2],[101,3,101,4],[102,1,102,2],[102,3,102,4],[103,1,103,2],[103,3,103,4]]}
[1,"Sint Ambrosius Baardwijk","Baardwijk",null,null,"Organistatie",null,"jaar",null,null,"nr"]
[2,"St. Crispinus & Crispinianus Besoijen","Besoijen",{"$nulls":4},"2025 - 2026",null,null,1]
[3,"O.L.V. Schuts Elshout","Elshout",null,null,{"$f":"IF(VLOOKUP($K2,invullijst!$A$1:$C$6,2,FALSE)=\"\",\"\",VLOOKUP($K2,invullijst!$A$1:$C$6,2,FALSE))","v":"Sint Ambrosius Baardwijk"}]
[4,"Sint Ambrosius Haarsteeg","Haarsteeg",{"$nulls":6},"versie 2020-1"]
[5,"Sint Jan Baptist Kaatsheuvel","Kaatsheuvel"]
[]
[]
["NR","NAAM","PLAATS","dis.","€","W 1","W 2","W 3","W 4","W 5","kampk"]
[]
[0,0,0,0,0,0,0,0,0,0,0]
[0,0,0,0,{"v":0,"d":"0.00"},0,0,0,0,0,0]
[101,"Antwan van Buul","Baardwijk","vr",null,53,"x","x",null,"x"]
[102,"John de Jong (disp)","Baardwijk","65+",null,90,84,82,null,"x"]
[104,"Peter Brekelmans","Baardwijk","65+",null,75,82,"x",null,"x"]
[105,"René Klijn","Baardwijk","vr",null,86,81,84,null,"x"]
[106,"René Pullens","Baardwijk","vr",null,82,66,83,null,"x"]
[107,"Cees Coppens","Baardwijk","65+",null,86,"x",83,null,"x"]
[108,"Bram Pullens","Baardwijk","vr",null,80,78,78,null,"x"]
[109,"Gijs Pullens","Baardwijk","vr",null,71,84,76,null,"x"]
[112,"Toon van Buul","Baardwijk","65+",null,54,"x","x",null,"x"]
[203,"Frank van den Houdt","Besoijen","vr",null,87,84,73,"x",null,39]
[204,"Harry de Louw","Besoijen","vr",null,84,80,83,"x",null,33]
[205,"Jos v/d Snepscheut","Besoijen","vr",null,70,"x",76,"x",null,39]
[206,"Kees van Hulten","Besoijen","vr",null,77,"x","x","x"]
[208,"Erin van Hulten","Besoijen","vr",null,83,82,"x","x"]
[209,"René van Kuijk","Besoijen","vr",null,76,83,84,"x",null,33]
[210,"Sander Oome","Besoijen","vr",null,83,91,93,"x",null,40]
[211,"Ad van den houdt","Besoijen","65+",null,88,"x",89,"x",null,41]
[212,"René Duquesnoy","Besoijen","65+",null,88,85,90,"x",null,37]
[213,"Roland van Delft","Besoijen","vr",null,52,75,62,"x",null,36]
[214,"Andre de Vaan","Besoijen","65+",null,92,93,90,"x",null,44]
[216,"Pieter Laghuwitz","Besoijen","vr",null,92,92,86,"x",null,44]
[217,"Hans Laghuwitz","Besoijen","vr",null,76,80,83,"x",null,37]
[218,"Jacob van de Werken","Besoijen","65+",null,95,96,96,"x",null,48]
[219,"Frans de Bont","Besoijen","65+",null,93,96,97,"x",null,48]
[220,"Kees Vos","Besoijen","65+",null,88,94,93,"x",null,48]
[221,"Mees Huijben","Besoijen","J",null,86,83,89,"x",null,43]
[222,"Nick de Vaan","Besoijen","vr",null,80,"x",74,"x",null,29]
[223,"Jänis Jakobsons","Besoijen","vr",null,80,74,70,"x",null,12]
[301,"Arjen van Assem (disp)","Elshout","65+",null,"x",84,88]
[302,"Freek de Jong","Elshout","vr",null,"x",90,88]
[303,"Hans van de Wiel","Elshout","65+",null,"x",96,"x"]
[304,"Henk Bruurmijn ","Elshout","vr",null,"x",76,74]
[305,"Johan Klerx","Elshout","vr",null,"x",88,82]
[306,"Ron Groot","Elshout","vr",null,"x",92,87]
[307,"Bert van Engelen","Elshout","65+",null,"x",93,94]
[309,"René de Jong","Elshout","65+",null,"x",88,"x"]
[310,"Tiny Boom","Elshout","65+",null,"x",92,94]
[312,"Floor de Jong","Elshout","J",null,"x",90,97]
[401,"Frans van Beurden","Haarsteeg","65+",null,96,"x",96]
[402,"Daniëlle v/d Lee","Haarsteeg","vr",null,81,"x",80]
[403,"Dorien de Kort","Haarsteeg","65+",null,91,"x",96]
[404,"Gerard van Beurden","Haarsteeg","65+",null,92,"x",98]
[405,"Jan de Vaan","Haarsteeg","65+",null,95,"x",96]
[406,"Jeroen van Oss","Haarsteeg","vr",null,77,"x",84]
[408,"Rudy van Falier","Haarsteeg","vr",null,80,"x",80]
[409,"Thijs Koks","Haarsteeg","vr",null,84,"x",86]
[410,"Tonnie Koks","Haarsteeg","vr",null,79,"x",78]
[411,"Wilma v/d Lee","Haarsteeg","vr",null,78,"x",72]
[412,"Francien v/d Wiel","Haarsteeg","65+",null,87,"x",95]
[413,"Frans Mommersteeg","Haarsteeg","65+",null,93,"x",97]
[414,"Alex Hus","Haarsteeg","65+",null,73,"x",90]
[415,"Wim de Gouw","Haarsteeg","65+",null,96,"x",97]
[501,"Annette Vos","Kaatsheuvel","vr",null,81,77,"x"]
[502,"Djody Wagemakers","Kaatsheuvel","J",null,93,91,"x"]
[503,"Kees Vos (disp)","Kaatsheuvel","65+",null,87,82,"x"]
[504,"Koen v/d Ven","Kaatsheuvel","vr",null,87,83,"x"]
[506,"Maikel Monden","Kaatsheuvel","vr",null,81,"x","x"]
[507,"Michael Blaauwbroek","Kaatsheuvel","vr",null,76,74,"x"]
[508,"Rowan Dobbelsteen","Kaatsheuvel","vr",null,80,81,"x"]
[509,"Adwan de Pinth","Kaatsheuvel","65+",null,96,96,"x"]
[512,"Hans Bergakker","Kaatsheuvel","vr",null,72,75,"x"]
[513,"Mark van Delft","Kaatsheuvel","vr",null,82,83,"x"]
[515,"Ilona Bergakker (disp)","Kaatsheuvel","65+",null,89,87,"x"]
[516,"Henry Bergakker (disp)","Kaatsheuvel","65+",null,93,81,"x"]
[517,"Diny Vos (disp)","Kaatsheuvel","65+",null,90,95,"x"]
[518,"Ton Stanz","Kaatsheuvel","65+",null,80,88,"x"]
{"$rows_empty":11}
[{"$nulls":4},"te betalen"]
[null,"aantal schutters Baardwijk",9,null,9,"x",{"v":3,"d":"3.00"},"=",{"$f":"E90*G90","v":{"v":27,"d":"€ 27.00"}},"ontvangen"]
["1J","aantal schutters Besoijen",19,null,18,"x",{"v":3,"d":"3.00"},"=",{"$f":"E91*G91","v":{"v":54,"d":"€ 54.00"}},"ontvangen"]
["1J","aantal schutters Elshout",10,null,10,"x",{"v":3,"d":"3.00"},"=",{"$f":"E92*G92","v":{"v":30,"d":"€ 30.00"}},"ontvangen"]
[null,"aantal schutters Haarsteeg",14,null,15,"x",{"v":3,"d":"3.00"},"=",{"$f":"E93*G93","v":{"v":45,"d":"€ 45.00"}},"ontvangen"]
["1J","aantal schutters Kaatsheuvel",14,null,16,"x",{"v":3,"d":"3.00"},"=",{"$f":"E94*G94","v":{"v":48,"d":"€ 48.00"}},"ontvangen"]
[null,"aantal schutters totaal",{"$f":"SUM(C90:C94)","v":66},null,66,"x",{"v":3,"d":"3.00"},"=",{"$f":"PRODUCT(E95:G95)","v":{"v":198,"d":"€ 198.00"}},"betaald",{"$f":"SUM(K90:K94)","v":{"v":0,"d":"€ 0.00"}}]
[]
[null,"Jeugd gratis (<16 jaar)",3]

{"sheet":"Personeel","index":1,"n_rows":55,"n_cols":13,"rows_kept":55,"merged":[[0,0,1,5],[0,6,0,9],[0,10,0,12],[1,6,1,12],[2,0,2,5],[2,6,2,10]]}
["PERSONEEL",{"$nulls":5},{"$f":"invullijst!F1","v":"Organistatie"},{"$nulls":3},{"$f":"invullijst!H2","v":"2025 - 2026"}]
[{"$nulls":6},{"$f":"invullijst!F3","v":"Sint Ambrosius Baardwijk"}]
["alleen in de gele kolom nummer schutter invullen",{"$nulls":5},"wedstrijd",{"$nulls":5},"KAMP-"]
["KL.",null,"schutter",null,"NAAM","PLAATS",1,2,3,4,5,"TOTAAL","KAART"]
["A",1,101,{"$f":"IF(VLOOKUP($C5,invullijst!$A$11:$M$196,4,FALSE)=\"\",\"\",VLOOKUP($C5,invullijst!$A$11:$M$196,4,FALSE))","v":"vr"},{"$f":"IF(VLOOKUP($C5,invullijst!$A$11:$M$196,2,FALSE)=\"\",\"\",VLOOKUP($C5,invullijst!$A$11:$M$196,2,FALSE))","v":"Antwan van Buul"},{"$f":"IF(VLOOKUP($C5,invullijst!$A$11:$M$196,3,FALSE)=\"\",\"\",VLOOKUP($C5,invullijst!$A$11:$M$196,3,FALSE))","v":"Baardwijk"},{"$f":"IF(VLOOKUP(C5,invullijst!$A$11:$M$196,6,FALSE)=\"\",\"\",VLOOKUP(C5,invullijst!$A$11:$M$196,6,FALSE))","v":53},{"$f":"IF(VLOOKUP($C5,invullijst!$A$11:$M$196,7,FALSE)=\"\",\"\",VLOOKUP($C5,invullijst!$A$11:$M$196,7,FALSE))","v":"x"},{"$f":"IF(VLOOKUP($C5,invullijst!$A$11:$M$196,8,FALSE)=\"\",\"\",VLOOKUP($C5,invullijst!$A$11:$M$196,8,FALSE))","v":"x"},{"$f":"IF(VLOOKUP($C5,invullijst!$A$11:$M$196,9,FALSE)=\"\",\"\",VLOOKUP($C5,invullijst!$A$11:$M$196,9,FALSE))","v":""},{"$f":"IF(VLOOKUP($C5,invullijst!$A$11:$M$196,10,FALSE)=\"\",\"\",VLOOKUP($C5,invullijst!$A$11:$M$196,10,FALSE))","v":"x"},{"$f":"SUM(G5:K5)","v":53},{"$f":"IF(VLOOKUP($C5,invullijst!$A$11:$M$196,11,FALSE)=\"\",\"\",VLOOKUP($C5,invullijst!$A$11:$M$196,11,FALSE))","v":""}]
[null,2,105,{"$f":"IF(VLOOKUP($C6,invullijst!$A$11:$M$196,4,FALSE)=\"\",\"\",VLOOKUP($C6,invullijst!$A$11:$M$196,4,FALSE))","v":"vr"},{"$f":"IF(VLOOKUP($C6,invullijst!$A$11:$M$196,2,FALSE)=\"\",\"\",VLOOKUP($C6,invullijst!$A$11:$M$196,2,FALSE))","v":"René Klijn"},{"$f":"IF(VLOOKUP($C6,invullijst!$A$11:$M$196,3,FALSE)=\"\",\"\",VLOOKUP($C6,invullijst!$A$11:$M$196,3,FALSE))","v":"Baardwijk"},{"$f":"IF(VLOOKUP(C6,invullijst!$A$11:$M$196,6,FALSE)=\"\",\"\",VLOOKUP(C6,invullijst!$A$11:$M$196,6,FALSE))","v":86},{"$f":"IF(VLOOKUP($C6,invullijst!$A$11:$M$196,7,FALSE)=\"\",\"\",VLOOKUP($C6,invullijst!$A$11:$M$196,7,FALSE))","v":81},{"$f":"IF(VLOOKUP($C6,invullijst!$A$11:$M$196,8,FALSE)=\"\",\"\",VLOOKUP($C6,invullijst!$A$11:$M$196,8,FALSE))","v":84},{"$f":"IF(VLOOKUP($C6,invullijst!$A$11:$M$196,9,FALSE)=\"\",\"\",VLOOKUP($C6,invullijst!$A$11:$M$196,9,FALSE))","v":""},{"$f":"IF(VLOOKUP($C6,invullijst!$A$11:$M$196,10,FALSE)=\"\",\"\",VLOOKUP($C6,invullijst!$A$11:$M$196,10,FALSE))","v":"x"},251,{"$f":"IF(VLOOKUP($C6,invullijst!$A$11:$M$196,11,FALSE)=\"\",\"\",VLOOKUP($C6,invullijst!$A$11:$M$196,11,FALSE))","v":""}]
[null,3,106,{"$f":"IF(VLOOKUP($C7,invullijst!$A$11:$M$196,4,FALSE)=\"\",\"\",VLOOKUP($C7,invullijst!$A$11:$M$196,4,FALSE))","v":"vr"},{"$f":"IF(VLOOKUP($C7,invullijst!$A$11:$M$196,2,FALSE)=\"\",\"\",VLOOKUP($C7,invullijst!$A$11:$M$196,2,FALSE))","v":"René Pullens"},{"$f":"IF(VLOOKUP($C7,invullijst!$A$11:$M$196,3,FALSE)=\"\",\"\",VLOOKUP($C7,invullijst!$A$11:$M$196,3,FALSE))","v":"Baardwijk"},{"$f":"IF(VLOOKUP(C7,invullijst!$A$11:$M$196,6,FALSE)=\"\",\"\",VLOOKUP(C7,invullijst!$A$11:$M$196,6,FALSE))","v":82},{"$f":"IF(VLOOKUP($C7,invullijst!$A$11:$M$196,7,FALSE)=\"\",\"\",VLOOKUP($C7,invullijst!$A$11:$M$196,7,FALSE))","v":66},{"$f":"IF(VLOOKUP($C7,invullijst!$A$11:$M$196,8,FALSE)=\"\",\"\",VLOOKUP($C7,invullijst!$A$11:$M$196,8,FALSE))","v":83},{"$f":"IF(VLOOKUP($C7,invullijst!$A$11:$M$196,9,FALSE)=\"\",\"\",VLOOKUP($C7,invullijst!$A$11:$M$196,9,FALSE))","v":""},{"$f":"IF(VLOOKUP($C7,invullijst!$A$11:$M$196,10,FALSE)=\"\",\"\",VLOOKUP($C7,invullijst!$A$11:$M$196,10,FALSE))","v":"x"},231,{"$f":"IF(VLOOKUP($C7,invullijst!$A$11:$M$196,11,FALSE)=\"\",\"\",VLOOKUP($C7,invullijst!$A$11:$M$196,11,FALSE))","v":""}]
[null,4,108,{"$f":"IF(VLOOKUP($C8,invullijst!$A$11:$M$196,4,FALSE)=\"\",\"\",VLOOKUP($C8,invullijst!$A$11:$M$196,4,FALSE))","v":"vr"},{"$f":"IF(VLOOKUP($C8,invullijst!$A$11:$M$196,2,FALSE)=\"\",\"\",VLOOKUP($C8,invullijst!$A$11:$M$196,2,FALSE))","v":"Bram Pullens"},{"$f":"IF(VLOOKUP($C8,invullijst!$A$11:$M$196,3,FALSE)=\"\",\"\",VLOOKUP($C8,invullijst!$A$11:$M$196,3,FALSE))","v":"Baardwijk"},{"$f":"IF(VLOOKUP(C8,invullijst!$A$11:$M$196,6,FALSE)=\"\",\"\",VLOOKUP(C8,invullijst!$A$11:$M$196,6,FALSE))","v":80},{"$f":"IF(VLOOKUP($C8,invullijst!$A$11:$M$196,7,FALSE)=\"\",\"\",VLOOKUP($C8,invullijst!$A$11:$M$196,7,FALSE))","v":78},{"$f":"IF(VLOOKUP($C8,invullijst!$A$11:$M$196,8,FALSE)=\"\",\"\",VLOOKUP($C8,invullijst!$A$11:$M$196,8,FALSE))","v":78},{"$f":"IF(VLOOKUP($C8,invullijst!$A$11:$M$196,9,FALSE)=\"\",\"\",VLOOKUP($C8,invullijst!$A$11:$M$196,9,FALSE))","v":""},{"$f":"IF(VLOOKUP($C8,invullijst!$A$11:$M$196,10,FALSE)=\"\",\"\",VLOOKUP($C8,invullijst!$A$11:$M$196,10,FALSE))","v":"x"},236,{"$f":"IF(VLOOKUP($C8,invullijst!$A$11:$M$196,11,FALSE)=\"\",\"\",VLOOKUP($C8,invullijst!$A$11:$M$196,11,FALSE))","v":""}]
[null,5,109,{"$f":"IF(VLOOKUP($C9,invullijst!$A$11:$M$196,4,FALSE)=\"\",\"\",VLOOKUP($C9,invullijst!$A$11:$M$196,4,FALSE))","v":"vr"},{"$f":"IF(VLOOKUP($C9,invullijst!$A$11:$M$196,2,FALSE)=\"\",\"\",VLOOKUP($C9,invullijst!$A$11:$M$196,2,FALSE))","v":"Gijs Pullens"},{"$f":"IF(VLOOKUP($C9,invullijst!$A$11:$M$196,3,FALSE)=\"\",\"\",VLOOKUP($C9,invullijst!$A$11:$M$196,3,FALSE))","v":"Baardwijk"},{"$f":"IF(VLOOKUP($C9,invullijst!$A$11:$M$196,6,FALSE)=\"\",\"\",VLOOKUP($C9,invullijst!$A$11:$M$196,6,FALSE))","v":71},{"$f":"IF(VLOOKUP($C9,invullijst!$A$11:$M$196,7,FALSE)=\"\",\"\",VLOOKUP($C9,invullijst!$A$11:$M$196,7,FALSE))","v":84},{"$f":"IF(VLOOKUP($C9,invullijst!$A$11:$M$196,8,FALSE)=\"\",\"\",VLOOKUP($C9,invullijst!$A$11:$M$196,8,FALSE))","v":76},{"$f":"IF(VLOOKUP($C9,invullijst!$A$11:$M$196,9,FALSE)=\"\",\"\",VLOOKUP($C9,invullijst!$A$11:$M$196,9,FALSE))","v":""},{"$f":"IF(VLOOKUP($C9,invullijst!$A$11:$M$196,10,FALSE)=\"\",\"\",VLOOKUP($C9,invullijst!$A$11:$M$196,10,FALSE))","v":"x"},231,{"$f":"IF(VLOOKUP($C9,invullijst!$A$11:$M$196,11,FALSE)=\"\",\"\",VLOOKUP($C9,invullijst!$A$11:$M$196,11,FALSE))","v":""}]
[null,6,203,{"$f":"IF(VLOOKUP($C10,invullijst!$A$11:$M$196,4,FALSE)=\"\",\"\",VLOOKUP($C10,invullijst!$A$11:$M$196,4,FALSE))","v":"vr"},{"$f":"IF(VLOOKUP($C10,invullijst!$A$11:$M$196,2,FALSE)=\"\",\"\",VLOOKUP($C10,invullijst!$A$11:$M$196,2,FALSE))","v":"Frank van den Houdt"},{"$f":"IF(VLOOKUP($C10,invullijst!$A$11:$M$196,3,FALSE)=\"\",\"\",VLOOKUP($C10,invullijst!$A$11:$M$196,3,FALSE))","v":"Besoijen"},{"$f":"IF(VLOOKUP(C10,invullijst!$A$11:$M$196,6,FALSE)=\"\",\"\",VLOOKUP(C10,invullijst!$A$11:$M$196,6,FALSE))","v":87},{"$f":"IF(VLOOKUP($C10,invullijst!$A$11:$M$196,7,FALSE)=\"\",\"\",VLOOKUP($C10,invullijst!$A$11:$M$196,7,FALSE))","v":84},{"$f":"IF(VLOOKUP($C10,invullijst!$A$11:$M$196,8,FALSE)=\"\",\"\",VLOOKUP($C10,invullijst!$A$11:$M$196,8,FALSE))","v":73},{"$f":"IF(VLOOKUP($C10,invullijst!$A$11:$M$196,9,FALSE)=\"\",\"\",VLOOKUP($C10,invullijst!$A$11:$M$196,9,FALSE))","v":"x"},{"$f":"IF(VLOOKUP($C10,invullijst!$A$11:$M$196,10,FALSE)=\"\",\"\",VLOOKUP($C10,invullijst!$A$11:$M$196,10,FALSE))","v":""},244,{"$f":"IF(VLOOKUP($C10,invullijst!$A$11:$M$196,11,FALSE)=\"\",\"\",VLOOKUP($C10,invullijst!$A$11:$M$196,11,FALSE))","v":39}]
[null,7,204,{"$f":"IF(VLOOKUP($C11,invullijst!$A$11:$M$196,4,FALSE)=\"\",\"\",VLOOKUP($C11,invullijst!$A$11:$M$196,4,FALSE))","v":"vr"},{"$f":"IF(VLOOKUP($C11,invullijst!$A$11:$M$196,2,FALSE)=\"\",\"\",VLOOKUP($C11,invullijst!$A$11:$M$196,2,FALSE))","v":"Harry de Louw"},{"$f":"IF(VLOOKUP($C11,invullijst!$A$11:$M$196,3,FALSE)=\"\",\"\",VLOOKUP($C11,invullijst!$A$11:$M$196,3,FALSE))","v":"Besoijen"},{"$f":"IF(VLOOKUP(C11,invullijst!$A$11:$M$196,6,FALSE)=\"\",\"\",VLOOKUP(C11,invullijst!$A$11:$M$196,6,FALSE))","v":84},{"$f":"IF(VLOOKUP($C11,invullijst!$A$11:$M$196,7,FALSE)=\"\",\"\",VLOOKUP($C11,invullijst!$A$11:$M$196,7,FALSE))","v":80},{"$f":"IF(VLOOKUP($C11,invullijst!$A$11:$M$196,8,FALSE)=\"\",\"\",VLOOKUP($C11,invullijst!$A$11:$M$196,8,FALSE))","v":83},{"$f":"IF(VLOOKUP($C11,invullijst!$A$11:$M$196,9,FALSE)=\"\",\"\",VLOOKUP($C11,invullijst!$A$11:$M$196,9,FALSE))","v":"x"},{"$f":"IF(VLOOKUP($C11,invullijst!$A$11:$M$196,10,FALSE)=\"\",\"\",VLOOKUP($C11,invullijst!$A$11:$M$196,10,FALSE))","v":""},247,{"$f":"IF(VLOOKUP($C11,invullijst!$A$11:$M$196,11,FALSE)=\"\",\"\",VLOOKUP($C11,invullijst!$A$11:$M$196,11,FALSE))","v":33}]
[null,8,205,{"$f":"IF(VLOOKUP($C12,invullijst!$A$11:$M$196,4,FALSE)=\"\",\"\",VLOOKUP($C12,invullijst!$A$11:$M$196,4,FALSE))","v":"vr"},{"$f":"IF(VLOOKUP($C12,invullijst!$A$11:$M$196,2,FALSE)=\"\",\"\",VLOOKUP($C12,invullijst!$A$11:$M$196,2,FALSE))","v":"Jos v/d Snepscheut"},{"$f":"IF(VLOOKUP($C12,invullijst!$A$11:$M$196,3,FALSE)=\"\",\"\",VLOOKUP($C12,invullijst!$A$11:$M$196,3,FALSE))","v":"Besoijen"},{"$f":"IF(VLOOKUP(C12,invullijst!$A$11:$M$196,6,FALSE)=\"\",\"\",VLOOKUP(C12,invullijst!$A$11:$M$196,6,FALSE))","v":70},{"$f":"IF(VLOOKUP($C12,invullijst!$A$11:$M$196,7,FALSE)=\"\",\"\",VLOOKUP($C12,invullijst!$A$11:$M$196,7,FALSE))","v":"x"},{"$f":"IF(VLOOKUP($C12,invullijst!$A$11:$M$196,8,FALSE)=\"\",\"\",VLOOKUP($C12,invullijst!$A$11:$M$196,8,FALSE))","v":76},{"$f":"IF(VLOOKUP($C12,invullijst!$A$11:$M$196,9,FALSE)=\"\",\"\",VLOOKUP($C12,invullijst!$A$11:$M$196,9,FALSE))","v":"x"},{"$f":"IF(VLOOKUP($C12,invullijst!$A$11:$M$196,10,FALSE)=\"\",\"\",VLOOKUP($C12,invullijst!$A$11:$M$196,10,FALSE))","v":""},146,{"$f":"IF(VLOOKUP($C12,invullijst!$A$11:$M$196,11,FALSE)=\"\",\"\",VLOOKUP($C12,invullijst!$A$11:$M$196,11,FALSE))","v":39}]
[null,9,206,{"$f":"IF(VLOOKUP($C13,invullijst!$A$11:$M$196,4,FALSE)=\"\",\"\",VLOOKUP($C13,invullijst!$A$11:$M$196,4,FALSE))","v":"vr"},{"$f":"IF(VLOOKUP($C13,invullijst!$A$11:$M$196,2,FALSE)=\"\",\"\",VLOOKUP($C13,invullijst!$A$11:$M$196,2,FALSE))","v":"Kees van Hulten"},{"$f":"IF(VLOOKUP($C13,invullijst!$A$11:$M$196,3,FALSE)=\"\",\"\",VLOOKUP($C13,invullijst!$A$11:$M$196,3,FALSE))","v":"Besoijen"},{"$f":"IF(VLOOKUP(C13,invullijst!$A$11:$M$196,6,FALSE)=\"\",\"\",VLOOKUP(C13,invullijst!$A$11:$M$196,6,FALSE))","v":77},{"$f":"IF(VLOOKUP($C13,invullijst!$A$11:$M$196,7,FALSE)=\"\",\"\",VLOOKUP($C13,invullijst!$A$11:$M$196,7,FALSE))","v":"x"},{"$f":"IF(VLOOKUP($C13,invullijst!$A$11:$M$196,8,FALSE)=\"\",\"\",VLOOKUP($C13,invullijst!$A$11:$M$196,8,FALSE))","v":"x"},{"$f":"IF(VLOOKUP($C13,invullijst!$A$11:$M$196,9,FALSE)=\"\",\"\",VLOOKUP($C13,invullijst!$A$11:$M$196,9,FALSE))","v":"x"},{"$f":"IF(VLOOKUP($C13,invullijst!$A$11:$M$196,10,FALSE)=\"\",\"\",VLOOKUP($C13,invullijst!$A$11:$M$196,10,FALSE))","v":""},77,{"$f":"IF(VLOOKUP($C13,invullijst!$A$11:$M$196,11,FALSE)=\"\",\"\",VLOOKUP($C13,invullijst!$A$11:$M$196,11,FALSE))","v":""}]
[null,10,208,{"$f":"IF(VLOOKUP($C14,invullijst!$A$11:$M$196,4,FALSE)=\"\",\"\",VLOOKUP($C14,invullijst!$A$11:$M$196,4,FALSE))","v":"vr"},{"$f":"IF(VLOOKUP($C14,invullijst!$A$11:$M$196,2,FALSE)=\"\",\"\",VLOOKUP($C14,invullijst!$A$11:$M$196,2,FALSE))","v":"Erin van Hulten"},{"$f":"IF(VLOOKUP($C14,invullijst!$A$11:$M$196,3,FALSE)=\"\",\"\",VLOOKUP($C14,invullijst!$A$11:$M$196,3,FALSE))","v":"Besoijen"},{"$f":"IF(VLOOKUP(C14,invullijst!$A$11:$M$196,6,FALSE)=\"\",\"\",VLOOKUP(C14,invullijst!$A$11:$M$196,6,FALSE))","v":83},{"$f":"IF(VLOOKUP($C14,invullijst!$A$11:$M$196,7,FALSE)=\"\",\"\",VLOOKUP($C14,invullijst!$A$11:$M$196,7,FALSE))","v":82},{"$f":"IF(VLOOKUP($C14,invullijst!$A$11:$M$196,8,FALSE)=\"\",\"\",VLOOKUP($C14,invullijst!$A$11:$M$196,8,FALSE))","v":"x"},{"$f":"IF(VLOOKUP($C14,invullijst!$A$11:$M$196,9,FALSE)=\"\",\"\",VLOOKUP($C14,invullijst!$A$11:$M$196,9,FALSE))","v":"x"},{"$f":"IF(VLOOKUP($C14,invullijst!$A$11:$M$196,10,FALSE)=\"\",\"\",VLOOKUP($C14,invullijst!$A$11:$M$196,10,FALSE))","v":""},165,{"$f":"IF(VLOOKUP($C14,invullijst!$A$11:$M$196,11,FALSE)=\"\",\"\",VLOOKUP($C14,invullijst!$A$11:$M$196,11,FALSE))","v":""}]
[null,11,209,{"$f":"IF(VLOOKUP($C15,invullijst!$A$11:$M$196,4,FALSE)=\"\",\"\",VLOOKUP($C15,invullijst!$A$11:$M$196,4,FALSE))","v":"vr"},{"$f":"IF(VLOOKUP($C15,invullijst!$A$11:$M$196,2,FALSE)=\"\",\"\",VLOOKUP($C15,invullijst!$A$11:$M$196,2,FALSE))","v":"René van Kuijk"},{"$f":"IF(VLOOKUP($C15,invullijst!$A$11:$M$196,3,FALSE)=\"\",\"\",VLOOKUP($C15,invullijst!$A$11:$M$196,3,FALSE))","v":"Besoijen"},{"$f":"IF(VLOOKUP(C15,invullijst!$A$11:$M$196,6,FALSE)=\"\",\"\",VLOOKUP(C15,invullijst!$A$11:$M$196,6,FALSE))","v":76},{"$f":"IF(VLOOKUP($C15,invullijst!$A$11:$M$196,7,FALSE)=\"\",\"\",VLOOKUP($C15,invullijst!$A$11:$M$196,7,FALSE))","v":83},{"$f":"IF(VLOOKUP($C15,invullijst!$A$11:$M$196,8,FALSE)=\"\",\"\",VLOOKUP($C15,invullijst!$A$11:$M$196,8,FALSE))","v":84},{"$f":"IF(VLOOKUP($C15,invullijst!$A$11:$M$196,9,FALSE)=\"\",\"\",VLOOKUP($C15,invullijst!$A$11:$M$196,9,FALSE))","v":"x"},{"$f":"IF(VLOOKUP($C15,invullijst!$A$11:$M$196,10,FALSE)=\"\",\"\",VLOOKUP($C15,invullijst!$A$11:$M$196,10,FALSE))","v":""},243,{"$f":"IF(VLOOKUP($C15,invullijst!$A$11:$M$196,11,FALSE)=\"\",\"\",VLOOKUP($C15,invullijst!$A$11:$M$196,11,FALSE))","v":33}]
[null,12,210,{"$f":"IF(VLOOKUP($C16,invullijst!$A$11:$M$196,4,FALSE)=\"\",\"\",VLOOKUP($C16,invullijst!$A$11:$M$196,4,FALSE))","v":"vr"},{"$f":"IF(VLOOKUP($C16,invullijst!$A$11:$M$196,2,FALSE)=\"\",\"\",VLOOKUP($C16,invullijst!$A$11:$M$196,2,FALSE))","v":"Sander Oome"},{"$f":"IF(VLOOKUP($C16,invullijst!$A$11:$M$196,3,FALSE)=\"\",\"\",VLOOKUP($C16,invullijst!$A$11:$M$196,3,FALSE))","v":"Besoijen"},{"$f":"IF(VLOOKUP(C16,invullijst!$A$11:$M$196,6,FALSE)=\"\",\"\",VLOOKUP(C16,invullijst!$A$11:$M$196,6,FALSE))","v":83},{"$f":"IF(VLOOKUP($C16,invullijst!$A$11:$M$196,7,FALSE)=\"\",\"\",VLOOKUP($C16,invullijst!$A$11:$M$196,7,FALSE))","v":91},{"$f":"IF(VLOOKUP($C16,invullijst!$A$11:$M$196,8,FALSE)=\"\",\"\",VLOOKUP($C16,invullijst!$A$11:$M$196,8,FALSE))","v":93},{"$f":"IF(VLOOKUP($C16,invullijst!$A$11:$M$196,9,FALSE)=\"\",\"\",VLOOKUP($C16,invullijst!$A$11:$M$196,9,FALSE))","v":"x"},{"$f":"IF(VLOOKUP($C16,invullijst!$A$11:$M$196,10,FALSE)=\"\",\"\",VLOOKUP($C16,invullijst!$A$11:$M$196,10,FALSE))","v":""},267,{"$f":"IF(VLOOKUP($C16,invullijst!$A$11:$M$196,11,FALSE)=\"\",\"\",VLOOKUP($C16,invullijst!$A$11:$M$196,11,FALSE))","v":40}]
[null,13,213,{"$f":"IF(VLOOKUP($C17,invullijst!$A$11:$M$196,4,FALSE)=\"\",\"\",VLOOKUP($C17,invullijst!$A$11:$M$196,4,FALSE))","v":"vr"},{"$f":"IF(VLOOKUP($C17,invullijst!$A$11:$M$196,2,FALSE)=\"\",\"\",VLOOKUP($C17,invullijst!$A$11:$M$196,2,FALSE))","v":"Roland van Delft"},{"$f":"IF(VLOOKUP($C17,invullijst!$A$11:$M$196,3,FALSE)=\"\",\"\",VLOOKUP($C17,invullijst!$A$11:$M$196,3,FALSE))","v":"Besoijen"},{"$f":"IF(VLOOKUP(C17,invullijst!$A$11:$M$196,6,FALSE)=\"\",\"\",VLOOKUP(C17,invullijst!$A$11:$M$196,6,FALSE))","v":52},{"$f":"IF(VLOOKUP($C17,invullijst!$A$11:$M$196,7,FALSE)=\"\",\"\",VLOOKUP($C17,invullijst!$A$11:$M$196,7,FALSE))","v":75},{"$f":"IF(VLOOKUP($C17,invullijst!$A$11:$M$196,8,FALSE)=\"\",\"\",VLOOKUP($C17,invullijst!$A$11:$M$196,8,FALSE))","v":62},{"$f":"IF(VLOOKUP($C17,invullijst!$A$11:$M$196,9,FALSE)=\"\",\"\",VLOOKUP($C17,invullijst!$A$11:$M$196,9,FALSE))","v":"x"},{"$f":"IF(VLOOKUP($C17,invullijst!$A$11:$M$196,10,FALSE)=\"\",\"\",VLOOKUP($C17,invullijst!$A$11:$M$196,10,FALSE))","v":""},189,{"$f":"IF(VLOOKUP($C17,invullijst!$A$11:$M$196,11,FALSE)=\"\",\"\",VLOOKUP($C17,invullijst!$A$11:$M$196,11,FALSE))","v":36}]
[null,14,216,{"$f":"IF(VLOOKUP($C18,invullijst!$A$11:$M$196,4,FALSE)=\"\",\"\",VLOOKUP($C18,invullijst!$A$11:$M$196,4,FALSE))","v":"vr"},{"$f":"IF(VLOOKUP($C18,invullijst!$A$11:$M$196,2,FALSE)=\"\",\"\",VLOOKUP($C18,invullijst!$A$11:$M$196,2,FALSE))","v":"Pieter Laghuwitz"},{"$f":"IF(VLOOKUP($C18,invullijst!$A$11:$M$196,3,FALSE)=\"\",\"\",VLOOKUP($C18,invullijst!$A$11:$M$196,3,FALSE))","v":"Besoijen"},{"$f":"IF(VLOOKUP(C18,invullijst!$A$11:$M$196,6,FALSE)=\"\",\"\",VLOOKUP(C18,invullijst!$A$11:$M$196,6,FALSE))","v":92},{"$f":"IF(VLOOKUP($C18,invullijst!$A$11:$M$196,7,FALSE)=\"\",\"\",VLOOKUP($C18,invullijst!$A$11:$M$196,7,FALSE))","v":92},{"$f":"IF(VLOOKUP($C18,invullijst!$A$11:$M$196,8,FALSE)=\"\",\"\",VLOOKUP($C18,invullijst!$A$11:$M$196,8,FALSE))","v":86},{"$f":"IF(VLOOKUP($C18,invullijst!$A$11:$M$196,9,FALSE)=\"\",\"\",VLOOKUP($C18,invullijst!$A$11:$M$196,9,FALSE))","v":"x"},{"$f":"IF(VLOOKUP($C18,invullijst!$A$11:$M$196,10,FALSE)=\"\",\"\",VLOOKUP($C18,invullijst!$A$11:$M$196,10,FALSE))","v":""},270,{"$f":"IF(VLOOKUP($C18,invullijst!$A$11:$M$196,11,FALSE)=\"\",\"\",VLOOKUP($C18,invullijst!$A$11:$M$196,11,FALSE))","v":44}]
[null,15,217,{"$f":"IF(VLOOKUP($C19,invullijst!$A$11:$M$196,4,FALSE)=\"\",\"\",VLOOKUP($C19,invullijst!$A$11:$M$196,4,FALSE))","v":"vr"},{"$f":"IF(VLOOKUP($C19,invullijst!$A$11:$M$196,2,FALSE)=\"\",\"\",VLOOKUP($C19,invullijst!$A$11:$M$196,2,FALSE))","v":"Hans Laghuwitz"},{"$f":"IF(VLOOKUP($C19,invullijst!$A$11:$M$196,3,FALSE)=\"\",\"\",VLOOKUP($C19,invullijst!$A$11:$M$196,3,FALSE))","v":"Besoijen"},{"$f":"IF(VLOOKUP(C19,invullijst!$A$11:$M$196,6,FALSE)=\"\",\"\",VLOOKUP(C19,invullijst!$A$11:$M$196,6,FALSE))","v":76},{"$f":"IF(VLOOKUP($C19,invullijst!$A$11:$M$196,7,FALSE)=\"\",\"\",VLOOKUP($C19,invullijst!$A$11:$M$196,7,FALSE))","v":80},{"$f":"IF(VLOOKUP($C19,invullijst!$A$11:$M$196,8,FALSE)=\"\",\"\",VLOOKUP($C19,invullijst!$A$11:$M$196,8,FALSE))","v":83},{"$f":"IF(VLOOKUP($C19,invullijst!$A$11:$M$196,9,FALSE)=\"\",\"\",VLOOKUP($C19,invullijst!$A$11:$M$196,9,FALSE))","v":"x"},{"$f":"IF(VLOOKUP($C19,invullijst!$A$11:$M$196,10,FALSE)=\"\",\"\",VLOOKUP($C19,invullijst!$A$11:$M$196,10,FALSE))","v":""},239,{"$f":"IF(VLOOKUP($C19,invullijst!$A$11:$M$196,11,FALSE)=\"\",\"\",VLOOKUP($C19,invullijst!$A$11:$M$196,11,FALSE))","v":37}]
[null,16,222,{"$f":"IF(VLOOKUP($C20,invullijst!$A$11:$M$196,4,FALSE)=\"\",\"\",VLOOKUP($C20,invullijst!$A$11:$M$196,4,FALSE))","v":"vr"},{"$f":"IF(VLOOKUP($C20,invullijst!$A$11:$M$196,2,FALSE)=\"\",\"\",VLOOKUP($C20,invullijst!$A$11:$M$196,2,FALSE))","v":"Nick de Vaan"},{"$f":"IF(VLOOKUP($C20,invullijst!$A$11:$M$196,3,FALSE)=\"\",\"\",VLOOKUP($C20,invullijst!$A$11:$M$196,3,FALSE))","v":"Besoijen"},{"$f":"IF(VLOOKUP(C20,invullijst!$A$11:$M$196,6,FALSE)=\"\",\"\",VLOOKUP(C20,invullijst!$A$11:$M$196,6,FALSE))","v":80},{"$f":"IF(VLOOKUP($C20,invullijst!$A$11:$M$196,7,FALSE)=\"\",\"\",VLOOKUP($C20,invullijst!$A$11:$M$196,7,FALSE))","v":"x"},null,{"$f":"IF(VLOOKUP($C20,invullijst!$A$11:$M$196,9,FALSE)=\"\",\"\",VLOOKUP($C20,invullijst!$A$11:$M$196,9,FALSE))","v":"x"},{"$f":"IF(VLOOKUP($C20,invullijst!$A$11:$M$196,10,FALSE)=\"\",\"\",VLOOKUP($C20,invullijst!$A$11:$M$196,10,FALSE))","v":""},80,{"$f":"IF(VLOOKUP($C20,invullijst!$A$11:$M$196,11,FALSE)=\"\",\"\",VLOOKUP($C20,invullijst!$A$11:$M$196,11,FALSE))","v":29}]
[null,17,223,{"$f":"IF(VLOOKUP($C21,invullijst!$A$11:$M$196,4,FALSE)=\"\",\"\",VLOOKUP($C21,invullijst!$A$11:$M$196,4,FALSE))","v":"vr"},{"$f":"IF(VLOOKUP($C21,invullijst!$A$11:$M$196,2,FALSE)=\"\",\"\",VLOOKUP($C21,invullijst!$A$11:$M$196,2,FALSE))","v":"Jänis Jakobsons"},{"$f":"IF(VLOOKUP($C21,invullijst!$A$11:$M$196,3,FALSE)=\"\",\"\",VLOOKUP($C21,invullijst!$A$11:$M$196,3,FALSE))","v":"Besoijen"},{"$f":"IF(VLOOKUP(C21,invullijst!$A$11:$M$196,6,FALSE)=\"\",\"\",VLOOKUP(C21,invullijst!$A$11:$M$196,6,FALSE))","v":80},{"$f":"IF(VLOOKUP($C21,invullijst!$A$11:$M$196,7,FALSE)=\"\",\"\",VLOOKUP($C21,invullijst!$A$11:$M$196,7,FALSE))","v":74},{"$f":"IF(VLOOKUP($C21,invullijst!$A$11:$M$196,8,FALSE)=\"\",\"\",VLOOKUP($C21,invullijst!$A$11:$M$196,8,FALSE))","v":70},{"$f":"IF(VLOOKUP($C21,invullijst!$A$11:$M$196,9,FALSE)=\"\",\"\",VLOOKUP($C21,invullijst!$A$11:$M$196,9,FALSE))","v":"x"},{"$f":"IF(VLOOKUP($C21,invullijst!$A$11:$M$196,10,FALSE)=\"\",\"\",VLOOKUP($C21,invullijst!$A$11:$M$196,10,FALSE))","v":""},224,{"$f":"IF(VLOOKUP($C21,invullijst!$A$11:$M$196,11,FALSE)=\"\",\"\",VLOOKUP($C21,invullijst!$A$11:$M$196,11,FALSE))","v":12}]
["B",1,302,{"$f":"IF(VLOOKUP($C22,invullijst!$A$11:$M$196,4,FALSE)=\"\",\"\",VLOOKUP($C22,invullijst!$A$11:$M$196,4,FALSE))","v":"vr"},{"$f":"IF(VLOOKUP($C22,invullijst!$A$11:$M$196,2,FALSE)=\"\",\"\",VLOOKUP($C22,invullijst!$A$11:$M$196,2,FALSE))","v":"Freek de Jong"},{"$f":"IF(VLOOKUP($C22,invullijst!$A$11:$M$196,3,FALSE)=\"\",\"\",VLOOKUP($C22,invullijst!$A$11:$M$196,3,FALSE))","v":"Elshout"},{"$f":"IF(VLOOKUP(C22,invullijst!$A$11:$M$196,6,FALSE)=\"\",\"\",VLOOKUP(C22,invullijst!$A$11:$M$196,6,FALSE))","v":"x"},{"$f":"IF(VLOOKUP($C22,invullijst!$A$11:$M$196,7,FALSE)=\"\",\"\",VLOOKUP($C22,invullijst!$A$11:$M$196,7,FALSE))","v":90},{"$f":"IF(VLOOKUP($C22,invullijst!$A$11:$M$196,8,FALSE)=\"\",\"\",VLOOKUP($C22,invullijst!$A$11:$M$196,8,FALSE))","v":88},{"$f":"IF(VLOOKUP($C22,invullijst!$A$11:$M$196,9,FALSE)=\"\",\"\",VLOOKUP($C22,invullijst!$A$11:$M$196,9,FALSE))","v":""},{"$f":"IF(VLOOKUP($C22,invullijst!$A$11:$M$196,10,FALSE)=\"\",\"\",VLOOKUP($C22,invullijst!$A$11:$M$196,10,FALSE))","v":""},178,{"$f":"IF(VLOOKUP($C22,invullijst!$A$11:$M$196,11,FALSE)=\"\",\"\",VLOOKUP($C22,invullijst!$A$11:$M$196,11,FALSE))","v":""}]
[null,2,304,{"$f":"IF(VLOOKUP($C23,invullijst!$A$11:$M$196,4,FALSE)=\"\",\"\",VLOOKUP($C23,invullijst!$A$11:$M$196,4,FALSE))","v":"vr"},{"$f":"IF(VLOOKUP($C23,invullijst!$A$11:$M$196,2,FALSE)=\"\",\"\",VLOOKUP($C23,invullijst!$A$11:$M$196,2,FALSE))","v":"Henk Bruurmijn "},{"$f":"IF(VLOOKUP($C23,invullijst!$A$11:$M$196,3,FALSE)=\"\",\"\",VLOOKUP($C23,invullijst!$A$11:$M$196,3,FALSE))","v":"Elshout"},{"$f":"IF(VLOOKUP(C23,invullijst!$A$11:$M$196,6,FALSE)=\"\",\"\",VLOOKUP(C23,invullijst!$A$11:$M$196,6,FALSE))","v":"x"},{"$f":"IF(VLOOKUP($C23,invullijst!$A$11:$M$196,7,FALSE)=\"\",\"\",VLOOKUP($C23,invullijst!$A$11:$M$196,7,FALSE))","v":76},{"$f":"IF(VLOOKUP($C23,invullijst!$A$11:$M$196,8,FALSE)=\"\",\"\",VLOOKUP($C23,invullijst!$A$11:$M$196,8,FALSE))","v":74},{"$f":"IF(VLOOKUP($C23,invullijst!$A$11:$M$196,9,FALSE)=\"\",\"\",VLOOKUP($C23,invullijst!$A$11:$M$196,9,FALSE))","v":""},{"$f":"IF(VLOOKUP($C23,invullijst!$A$11:$M$196,10,FALSE)=\"\",\"\",VLOOKUP($C23,invullijst!$A$11:$M$196,10,FALSE))","v":""},150,{"$f":"IF(VLOOKUP($C23,invullijst!$A$11:$M$196,11,FALSE)=\"\",\"\",VLOOKUP($C23,invullijst!$A$11:$M$196,11,FALSE))","v":""}]
[null,3,305,{"$f":"IF(VLOOKUP($C24,invullijst!$A$11:$M$196,4,FALSE)=\"\",\"\",VLOOKUP($C24,invullijst!$A$11:$M$196,4,FALSE))","v":"vr"},{"$f":"IF(VLOOKUP($C24,invullijst!$A$11:$M$196,2,FALSE)=\"\",\"\",VLOOKUP($C24,invullijst!$A$11:$M$196,2,FALSE))","v":"Johan Klerx"},{"$f":"IF(VLOOKUP($C24,invullijst!$A$11:$M$196,3,FALSE)=\"\",\"\",VLOOKUP($C24,invullijst!$A$11:$M$196,3,FALSE))","v":"Elshout"},{"$f":"IF(VLOOKUP(C24,invullijst!$A$11:$M$196,6,FALSE)=\"\",\"\",VLOOKUP(C24,invullijst!$A$11:$M$196,6,FALSE))","v":"x"},{"$f":"IF(VLOOKUP($C24,invullijst!$A$11:$M$196,7,FALSE)=\"\",\"\",VLOOKUP($C24,invullijst!$A$11:$M$196,7,FALSE))","v":88},{"$f":"IF(VLOOKUP($C24,invullijst!$A$11:$M$196,8,FALSE)=\"\",\"\",VLOOKUP($C24,invullijst!$A$11:$M$196,8,FALSE))","v":82},{"$f":"IF(VLOOKUP($C24,invullijst!$A$11:$M$196,9,FALSE)=\"\",\"\",VLOOKUP($C24,invullijst!$A$11:$M$196,9,FALSE))","v":""},{"$f":"IF(VLOOKUP($C24,invullijst!$A$11:$M$196,10,FALSE)=\"\",\"\",VLOOKUP($C24,invullijst!$A$11:$M$196,10,FALSE))","v":""},170,{"$f":"IF(VLOOKUP($C24,invullijst!$A$11:$M$196,11,FALSE)=\"\",\"\",VLOOKUP($C24,invullijst!$A$11:$M$196,11,FALSE))","v":""}]
[null,4,306,{"$f":"IF(VLOOKUP($C25,invullijst!$A$11:$M$196,4,FALSE)=\"\",\"\",VLOOKUP($C25,invullijst!$A$11:$M$196,4,FALSE))","v":"vr"},{"$f":"IF(VLOOKUP($C25,invullijst!$A$11:$M$196,2,FALSE)=\"\",\"\",VLOOKUP($C25,invullijst!$A$11:$M$196,2,FALSE))","v":"Ron Groot"},{"$f":"IF(VLOOKUP($C25,invullijst!$A$11:$M$196,3,FALSE)=\"\",\"\",VLOOKUP($C25,invullijst!$A$11:$M$196,3,FALSE))","v":"Elshout"},{"$f":"IF(VLOOKUP(C25,invullijst!$A$11:$M$196,6,FALSE)=\"\",\"\",VLOOKUP(C25,invullijst!$A$11:$M$196,6,FALSE))","v":"x"},{"$f":"IF(VLOOKUP($C25,invullijst!$A$11:$M$196,7,FALSE)=\"\",\"\",VLOOKUP($C25,invullijst!$A$11:$M$196,7,FALSE))","v":92},{"$f":"IF(VLOOKUP($C25,invullijst!$A$11:$M$196,8,FALSE)=\"\",\"\",VLOOKUP($C25,invullijst!$A$11:$M$196,8,FALSE))","v":87},{"$f":"IF(VLOOKUP($C25,invullijst!$A$11:$M$196,9,FALSE)=\"\",\"\",VLOOKUP($C25,invullijst!$A$11:$M$196,9,FALSE))","v":""},{"$f":"IF(VLOOKUP($C25,invullijst!$A$11:$M$196,10,FALSE)=\"\",\"\",VLOOKUP($C25,invullijst!$A$11:$M$196,10,FALSE))","v":""},179,{"$f":"IF(VLOOKUP($C25,invullijst!$A$11:$M$196,11,FALSE)=\"\",\"\",VLOOKUP($C25,invullijst!$A$11:$M$196,11,FALSE))","v":""}]
[null,5,402,{"$f":"IF(VLOOKUP($C26,invullijst!$A$11:$M$196,4,FALSE)=\"\",\"\",VLOOKUP($C26,invullijst!$A$11:$M$196,4,FALSE))","v":"vr"},{"$f":"IF(VLOOKUP($C26,invullijst!$A$11:$M$196,2,FALSE)=\"\",\"\",VLOOKUP($C26,invullijst!$A$11:$M$196,2,FALSE))","v":"Daniëlle v/d Lee"},{"$f":"IF(VLOOKUP($C26,invullijst!$A$11:$M$196,3,FALSE)=\"\",\"\",VLOOKUP($C26,invullijst!$A$11:$M$196,3,FALSE))","v":"Haarsteeg"},{"$f":"IF(VLOOKUP(C26,invullijst!$A$11:$M$196,6,FALSE)=\"\",\"\",VLOOKUP(C26,invullijst!$A$11:$M$196,6,FALSE))","v":81},{"$f":"IF(VLOOKUP($C26,invullijst!$A$11:$M$196,7,FALSE)=\"\",\"\",VLOOKUP($C26,invullijst!$A$11:$M$196,7,FALSE))","v":"x"},null,{"$f":"IF(VLOOKUP($C26,invullijst!$A$11:$M$196,9,FALSE)=\"\",\"\",VLOOKUP($C26,invullijst!$A$11:$M$196,9,FALSE))","v":""},{"$f":"IF(VLOOKUP($C26,invullijst!$A$11:$M$196,10,FALSE)=\"\",\"\",VLOOKUP($C26,invullijst!$A$11:$M$196,10,FALSE))","v":""},81,{"$f":"IF(VLOOKUP($C26,invullijst!$A$11:$M$196,11,FALSE)=\"\",\"\",VLOOKUP($C26,invullijst!$A$11:$M$196,11,FALSE))","v":""}]
[null,6,406,{"$f":"IF(VLOOKUP($C27,invullijst!$A$11:$M$196,4,FALSE)=\"\",\"\",VLOOKUP($C27,invullijst!$A$11:$M$196,4,FALSE))","v":"vr"},{"$f":"IF(VLOOKUP($C27,invullijst!$A$11:$M$196,2,FALSE)=\"\",\"\",VLOOKUP($C27,invullijst!$A$11:$M$196,2,FALSE))","v":"Jeroen van Oss"},{"$f":"IF(VLOOKUP($C27,invullijst!$A$11:$M$196,3,FALSE)=\"\",\"\",VLOOKUP($C27,invullijst!$A$11:$M$196,3,FALSE))","v":"Haarsteeg"},{"$f":"IF(VLOOKUP(C27,invullijst!$A$11:$M$196,6,FALSE)=\"\",\"\",VLOOKUP(C27,invullijst!$A$11:$M$196,6,FALSE))","v":77},{"$f":"IF(VLOOKUP($C27,invullijst!$A$11:$M$196,7,FALSE)=\"\",\"\",VLOOKUP($C27,invullijst!$A$11:$M$196,7,FALSE))","v":"x"},{"$f":"IF(VLOOKUP($C27,invullijst!$A$11:$M$196,8,FALSE)=\"\",\"\",VLOOKUP($C27,invullijst!$A$11:$M$196,8,FALSE))","v":84},{"$f":"IF(VLOOKUP($C27,invullijst!$A$11:$M$196,9,FALSE)=\"\",\"\",VLOOKUP($C27,invullijst!$A$11:$M$196,9,FALSE))","v":""},{"$f":"IF(VLOOKUP($C27,invullijst!$A$11:$M$196,10,FALSE)=\"\",\"\",VLOOKUP($C27,invullijst!$A$11:$M$196,10,FALSE))","v":""},161,{"$f":"IF(VLOOKUP($C27,invullijst!$A$11:$M$196,11,FALSE)=\"\",\"\",VLOOKUP($C27,invullijst!$A$11:$M$196,11,FALSE))","v":""}]
[null,7,408,{"$f":"IF(VLOOKUP($C28,invullijst!$A$11:$M$196,4,FALSE)=\"\",\"\",VLOOKUP($C28,invullijst!$A$11:$M$196,4,FALSE))","v":"vr"},{"$f":"IF(VLOOKUP($C28,invullijst!$A$11:$M$196,2,FALSE)=\"\",\"\",VLOOKUP($C28,invullijst!$A$11:$M$196,2,FALSE))","v":"Rudy van Falier"},{"$f":"IF(VLOOKUP($C28,invullijst!$A$11:$M$196,3,FALSE)=\"\",\"\",VLOOKUP($C28,invullijst!$A$11:$M$196,3,FALSE))","v":"Haarsteeg"},{"$f":"IF(VLOOKUP(C28,invullijst!$A$11:$M$196,6,FALSE)=\"\",\"\",VLOOKUP(C28,invullijst!$A$11:$M$196,6,FALSE))","v":80},{"$f":"IF(VLOOKUP($C28,invullijst!$A$11:$M$196,7,FALSE)=\"\",\"\",VLOOKUP($C28,invullijst!$A$11:$M$196,7,FALSE))","v":"x"},null,{"$f":"IF(VLOOKUP($C28,invullijst!$A$11:$M$196,9,FALSE)=\"\",\"\",VLOOKUP($C28,invullijst!$A$11:$M$196,9,FALSE))","v":""},{"$f":"IF(VLOOKUP($C28,invullijst!$A$11:$M$196,10,FALSE)=\"\",\"\",VLOOKUP($C28,invullijst!$A$11:$M$196,10,FALSE))","v":""},80,{"$f":"IF(VLOOKUP($C28,invullijst!$A$11:$M$196,11,FALSE)=\"\",\"\",VLOOKUP($C28,invullijst!$A$11:$M$196,11,FALSE))","v":""}]
[null,8,409,{"$f":"IF(VLOOKUP($C29,invullijst!$A$11:$M$196,4,FALSE)=\"\",\"\",VLOOKUP($C29,invullijst!$A$11:$M$196,4,FALSE))","v":"vr"},{"$f":"IF(VLOOKUP($C29,invullijst!$A$11:$M$196,2,FALSE)=\"\",\"\",VLOOKUP($C29,invullijst!$A$11:$M$196,2,FALSE))","v":"Thijs Koks"},{"$f":"IF(VLOOKUP($C29,invullijst!$A$11:$M$196,3,FALSE)=\"\",\"\",VLOOKUP($C29,invullijst!$A$11:$M$196,3,FALSE))","v":"Haarsteeg"},{"$f":"IF(VLOOKUP(C29,invullijst!$A$11:$M$196,6,FALSE)=\"\",\"\",VLOOKUP(C29,invullijst!$A$11:$M$196,6,FALSE))","v":84},{"$f":"IF(VLOOKUP($C29,invullijst!$A$11:$M$196,7,FALSE)=\"\",\"\",VLOOKUP($C29,invullijst!$A$11:$M$196,7,FALSE))","v":"x"},{"$f":"IF(VLOOKUP($C29,invullijst!$A$11:$M$196,8,FALSE)=\"\",\"\",VLOOKUP($C29,invullijst!$A$11:$M$196,8,FALSE))","v":86},{"$f":"IF(VLOOKUP($C29,invullijst!$A$11:$M$196,9,FALSE)=\"\",\"\",VLOOKUP($C29,invullijst!$A$11:$M$196,9,FALSE))","v":""},{"$f":"IF(VLOOKUP($C29,invullijst!$A$11:$M$196,10,FALSE)=\"\",\"\",VLOOKUP($C29,invullijst!$A$11:$M$196,10,FALSE))","v":""},170,{"$f":"IF(VLOOKUP($C29,invullijst!$A$11:$M$196,11,FALSE)=\"\",\"\",VLOOKUP($C29,invullijst!$A$11:$M$196,11,FALSE))","v":""}]
[null,9,410,{"$f":"IF(VLOOKUP($C30,invullijst!$A$11:$M$196,4,FALSE)=\"\",\"\",VLOOKUP($C30,invullijst!$A$11:$M$196,4,FALSE))","v":"vr"},{"$f":"IF(VLOOKUP($C30,invullijst!$A$11:$M$196,2,FALSE)=\"\",\"\",VLOOKUP($C30,invullijst!$A$11:$M$196,2,FALSE))","v":"Tonnie Koks"},{"$f":"IF(VLOOKUP($C30,invullijst!$A$11:$M$196,3,FALSE)=\"\",\"\",VLOOKUP($C30,invullijst!$A$11:$M$196,3,FALSE))","v":"Haarsteeg"},{"$f":"IF(VLOOKUP(C30,invullijst!$A$11:$M$196,6,FALSE)=\"\",\"\",VLOOKUP(C30,invullijst!$A$11:$M$196,6,FALSE))","v":79},{"$f":"IF(VLOOKUP($C30,invullijst!$A$11:$M$196,7,FALSE)=\"\",\"\",VLOOKUP($C30,invullijst!$A$11:$M$196,7,FALSE))","v":"x"},{"$f":"IF(VLOOKUP($C30,invullijst!$A$11:$M$196,8,FALSE)=\"\",\"\",VLOOKUP($C30,invullijst!$A$11:$M$196,8,FALSE))","v":78},{"$f":"IF(VLOOKUP($C30,invullijst!$A$11:$M$196,9,FALSE)=\"\",\"\",VLOOKUP($C30,invullijst!$A$11:$M$196,9,FALSE))","v":""},{"$f":"IF(VLOOKUP($C30,invullijst!$A$11:$M$196,10,FALSE)=\"\",\"\",VLOOKUP($C30,invullijst!$A$11:$M$196,10,FALSE))","v":""},157,{"$f":"IF(VLOOKUP($C30,invullijst!$A$11:$M$196,11,FALSE)=\"\",\"\",VLOOKUP($C30,invullijst!$A$11:$M$196,11,FALSE))","v":""}]
[null,10,411,{"$f":"IF(VLOOKUP($C31,invullijst!$A$11:$M$196,4,FALSE)=\"\",\"\",VLOOKUP($C31,invullijst!$A$11:$M$196,4,FALSE))","v":"vr"},{"$f":"IF(VLOOKUP($C31,invullijst!$A$11:$M$196,2,FALSE)=\"\",\"\",VLOOKUP($C31,invullijst!$A$11:$M$196,2,FALSE))","v":"Wilma v/d Lee"},{"$f":"IF(VLOOKUP($C31,invullijst!$A$11:$M$196,3,FALSE)=\"\",\"\",VLOOKUP($C31,invullijst!$A$11:$M$196,3,FALSE))","v":"Haarsteeg"},{"$f":"IF(VLOOKUP(C31,invullijst!$A$11:$M$196,6,FALSE)=\"\",\"\",VLOOKUP(C31,invullijst!$A$11:$M$196,6,FALSE))","v":78},{"$f":"IF(VLOOKUP($C31,invullijst!$A$11:$M$196,7,FALSE)=\"\",\"\",VLOOKUP($C31,invullijst!$A$11:$M$196,7,FALSE))","v":"x"},{"$f":"IF(VLOOKUP($C31,invullijst!$A$11:$M$196,8,FALSE)=\"\",\"\",VLOOKUP($C31,invullijst!$A$11:$M$196,8,FALSE))","v":72},{"$f":"IF(VLOOKUP($C31,invullijst!$A$11:$M$196,9,FALSE)=\"\",\"\",VLOOKUP($C31,invullijst!$A$11:$M$196,9,FALSE))","v":""},{"$f":"IF(VLOOKUP($C31,invullijst!$A$11:$M$196,10,FALSE)=\"\",\"\",VLOOKUP($C31,invullijst!$A$11:$M$196,10,FALSE))","v":""},150,{"$f":"IF(VLOOKUP($C31,invullijst!$A$11:$M$196,11,FALSE)=\"\",\"\",VLOOKUP($C31,invullijst!$A$11:$M$196,11,FALSE))","v":""}]
[null,11,501,{"$f":"IF(VLOOKUP($C32,invullijst!$A$11:$M$196,4,FALSE)=\"\",\"\",VLOOKUP($C32,invullijst!$A$11:$M$196,4,FALSE))","v":"vr"},{"$f":"IF(VLOOKUP($C32,invullijst!$A$11:$M$196,2,FALSE)=\"\",\"\",VLOOKUP($C32,invullijst!$A$11:$M$196,2,FALSE))","v":"Annette Vos"},{"$f":"IF(VLOOKUP($C32,invullijst!$A$11:$M$196,3,FALSE)=\"\",\"\",VLOOKUP($C32,invullijst!$A$11:$M$196,3,FALSE))","v":"Kaatsheuvel"},{"$f":"IF(VLOOKUP(C32,invullijst!$A$11:$M$196,6,FALSE)=\"\",\"\",VLOOKUP(C32,invullijst!$A$11:$M$196,6,FALSE))","v":81},{"$f":"IF(VLOOKUP($C32,invullijst!$A$11:$M$196,7,FALSE)=\"\",\"\",VLOOKUP($C32,invullijst!$A$11:$M$196,7,FALSE))","v":77},{"$f":"IF(VLOOKUP($C32,invullijst!$A$11:$M$196,8,FALSE)=\"\",\"\",VLOOKUP($C32,invullijst!$A$11:$M$196,8,FALSE))","v":"x"},{"$f":"IF(VLOOKUP($C32,invullijst!$A$11:$M$196,9,FALSE)=\"\",\"\",VLOOKUP($C32,invullijst!$A$11:$M$196,9,FALSE))","v":""},{"$f":"IF(VLOOKUP($C32,invullijst!$A$11:$M$196,10,FALSE)=\"\",\"\",VLOOKUP($C32,invullijst!$A$11:$M$196,10,FALSE))","v":""},158,{"$f":"IF(VLOOKUP($C32,invullijst!$A$11:$M$196,11,FALSE)=\"\",\"\",VLOOKUP($C32,invullijst!$A$11:$M$196,11,FALSE))","v":""}]
[null,12,504,{"$f":"IF(VLOOKUP($C33,invullijst!$A$11:$M$196,4,FALSE)=\"\",\"\",VLOOKUP($C33,invullijst!$A$11:$M$196,4,FALSE))","v":"vr"},{"$f":"IF(VLOOKUP($C33,invullijst!$A$11:$M$196,2,FALSE)=\"\",\"\",VLOOKUP($C33,invullijst!$A$11:$M$196,2,FALSE))","v":"Koen v/d Ven"},{"$f":"IF(VLOOKUP($C33,invullijst!$A$11:$M$196,3,FALSE)=\"\",\"\",VLOOKUP($C33,invullijst!$A$11:$M$196,3,FALSE))","v":"Kaatsheuvel"},{"$f":"IF(VLOOKUP(C33,invullijst!$A$11:$M$196,6,FALSE)=\"\",\"\",VLOOKUP(C33,invullijst!$A$11:$M$196,6,FALSE))","v":87},{"$f":"IF(VLOOKUP($C33,invullijst!$A$11:$M$196,7,FALSE)=\"\",\"\",VLOOKUP($C33,invullijst!$A$11:$M$196,7,FALSE))","v":83},{"$f":"IF(VLOOKUP($C33,invullijst!$A$11:$M$196,8,FALSE)=\"\",\"\",VLOOKUP($C33,invullijst!$A$11:$M$196,8,FALSE))","v":"x"},{"$f":"IF(VLOOKUP($C33,invullijst!$A$11:$M$196,9,FALSE)=\"\",\"\",VLOOKUP($C33,invullijst!$A$11:$M$196,9,FALSE))","v":""},{"$f":"IF(VLOOKUP($C33,invullijst!$A$11:$M$196,10,FALSE)=\"\",\"\",VLOOKUP($C33,invullijst!$A$11:$M$196,10,FALSE))","v":""},170,{"$f":"IF(VLOOKUP($C33,invullijst!$A$11:$M$196,11,FALSE)=\"\",\"\",VLOOKUP($C33,invullijst!$A$11:$M$196,11,FALSE))","v":""}]
[null,13,506,{"$f":"IF(VLOOKUP($C34,invullijst!$A$11:$M$196,4,FALSE)=\"\",\"\",VLOOKUP($C34,invullijst!$A$11:$M$196,4,FALSE))","v":"vr"},{"$f":"IF(VLOOKUP($C34,invullijst!$A$11:$M$196,2,FALSE)=\"\",\"\",VLOOKUP($C34,invullijst!$A$11:$M$196,2,FALSE))","v":"Maikel Monden"},{"$f":"IF(VLOOKUP($C34,invullijst!$A$11:$M$196,3,FALSE)=\"\",\"\",VLOOKUP($C34,invullijst!$A$11:$M$196,3,FALSE))","v":"Kaatsheuvel"},{"$f":"IF(VLOOKUP(C34,invullijst!$A$11:$M$196,6,FALSE)=\"\",\"\",VLOOKUP(C34,invullijst!$A$11:$M$196,6,FALSE))","v":81},{"$f":"IF(VLOOKUP($C34,invullijst!$A$11:$M$196,7,FALSE)=\"\",\"\",VLOOKUP($C34,invullijst!$A$11:$M$196,7,FALSE))","v":"x"},{"$f":"IF(VLOOKUP($C34,invullijst!$A$11:$M$196,8,FALSE)=\"\",\"\",VLOOKUP($C34,invullijst!$A$11:$M$196,8,FALSE))","v":"x"},{"$f":"IF(VLOOKUP($C34,invullijst!$A$11:$M$196,9,FALSE)=\"\",\"\",VLOOKUP($C34,invullijst!$A$11:$M$196,9,FALSE))","v":""},{"$f":"IF(VLOOKUP($C34,invullijst!$A$11:$M$196,10,FALSE)=\"\",\"\",VLOOKUP($C34,invullijst!$A$11:$M$196,10,FALSE))","v":""},81,{"$f":"IF(VLOOKUP($C34,invullijst!$A$11:$M$196,11,FALSE)=\"\",\"\",VLOOKUP($C34,invullijst!$A$11:$M$196,11,FALSE))","v":""}]
[null,14,507,{"$f":"IF(VLOOKUP($C35,invullijst!$A$11:$M$196,4,FALSE)=\"\",\"\",VLOOKUP($C35,invullijst!$A$11:$M$196,4,FALSE))","v":"vr"},{"$f":"IF(VLOOKUP($C35,invullijst!$A$11:$M$196,2,FALSE)=\"\",\"\",VLOOKUP($C35,invullijst!$A$11:$M$196,2,FALSE))","v":"Michael Blaauwbroek"},{"$f":"IF(VLOOKUP($C35,invullijst!$A$11:$M$196,3,FALSE)=\"\",\"\",VLOOKUP($C35,invullijst!$A$11:$M$196,3,FALSE))","v":"Kaatsheuvel"},{"$f":"IF(VLOOKUP(C35,invullijst!$A$11:$M$196,6,FALSE)=\"\",\"\",VLOOKUP(C35,invullijst!$A$11:$M$196,6,FALSE))","v":76},{"$f":"IF(VLOOKUP($C35,invullijst!$A$11:$M$196,7,FALSE)=\"\",\"\",VLOOKUP($C35,invullijst!$A$11:$M$196,7,FALSE))","v":74},{"$f":"IF(VLOOKUP($C35,invullijst!$A$11:$M$196,8,FALSE)=\"\",\"\",VLOOKUP($C35,invullijst!$A$11:$M$196,8,FALSE))","v":"x"},{"$f":"IF(VLOOKUP($C35,invullijst!$A$11:$M$196,9,FALSE)=\"\",\"\",VLOOKUP($C35,invullijst!$A$11:$M$196,9,FALSE))","v":""},{"$f":"IF(VLOOKUP($C35,invullijst!$A$11:$M$196,10,FALSE)=\"\",\"\",VLOOKUP($C35,invullijst!$A$11:$M$196,10,FALSE))","v":""},150,{"$f":"IF(VLOOKUP($C35,invullijst!$A$11:$M$196,11,FALSE)=\"\",\"\",VLOOKUP($C35,invullijst!$A$11:$M$196,11,FALSE))","v":""}]
[null,15,508,{"$f":"IF(VLOOKUP($C36,invullijst!$A$11:$M$196,4,FALSE)=\"\",\"\",VLOOKUP($C36,invullijst!$A$11:$M$196,4,FALSE))","v":"vr"},{"$f":"IF(VLOOKUP($C36,invullijst!$A$11:$M$196,2,FALSE)=\"\",\"\",VLOOKUP($C36,invullijst!$A$11:$M$196,2,FALSE))","v":"Rowan Dobbelsteen"},{"$f":"IF(VLOOKUP($C36,invullijst!$A$11:$M$196,3,FALSE)=\"\",\"\",VLOOKUP($C36,invullijst!$A$11:$M$196,3,FALSE))","v":"Kaatsheuvel"},{"$f":"IF(VLOOKUP(C36,invullijst!$A$11:$M$196,6,FALSE)=\"\",\"\",VLOOKUP(C36,invullijst!$A$11:$M$196,6,FALSE))","v":80},{"$f":"IF(VLOOKUP($C36,invullijst!$A$11:$M$196,7,FALSE)=\"\",\"\",VLOOKUP($C36,invullijst!$A$11:$M$196,7,FALSE))","v":81},{"$f":"IF(VLOOKUP($C36,invullijst!$A$11:$M$196,8,FALSE)=\"\",\"\",VLOOKUP($C36,invullijst!$A$11:$M$196,8,FALSE))","v":"x"},{"$f":"IF(VLOOKUP($C36,invullijst!$A$11:$M$196,9,FALSE)=\"\",\"\",VLOOKUP($C36,invullijst!$A$11:$M$196,9,FALSE))","v":""},{"$f":"IF(VLOOKUP($C36,invullijst!$A$11:$M$196,10,FALSE)=\"\",\"\",VLOOKUP($C36,invullijst!$A$11:$M$196,10,FALSE))","v":""},161,{"$f":"IF(VLOOKUP($C36,invullijst!$A$11:$M$196,11,FALSE)=\"\",\"\",VLOOKUP($C36,invullijst!$A$11:$M$196,11,FALSE))","v":""}]
[null,16,512,{"$f":"IF(VLOOKUP($C37,invullijst!$A$11:$M$196,4,FALSE)=\"\",\"\",VLOOKUP($C37,invullijst!$A$11:$M$196,4,FALSE))","v":"vr"},{"$f":"IF(VLOOKUP($C37,invullijst!$A$11:$M$196,2,FALSE)=\"\",\"\",VLOOKUP($C37,invullijst!$A$11:$M$196,2,FALSE))","v":"Hans Bergakker"},{"$f":"IF(VLOOKUP($C37,invullijst!$A$11:$M$196,3,FALSE)=\"\",\"\",VLOOKUP($C37,invullijst!$A$11:$M$196,3,FALSE))","v":"Kaatsheuvel"},{"$f":"IF(VLOOKUP(C37,invullijst!$A$11:$M$196,6,FALSE)=\"\",\"\",VLOOKUP(C37,invullijst!$A$11:$M$196,6,FALSE))","v":72},{"$f":"IF(VLOOKUP($C37,invullijst!$A$11:$M$196,7,FALSE)=\"\",\"\",VLOOKUP($C37,invullijst!$A$11:$M$196,7,FALSE))","v":75},{"$f":"IF(VLOOKUP($C37,invullijst!$A$11:$M$196,8,FALSE)=\"\",\"\",VLOOKUP($C37,invullijst!$A$11:$M$196,8,FALSE))","v":"x"},{"$f":"IF(VLOOKUP($C37,invullijst!$A$11:$M$196,9,FALSE)=\"\",\"\",VLOOKUP($C37,invullijst!$A$11:$M$196,9,FALSE))","v":""},{"$f":"IF(VLOOKUP($C37,invullijst!$A$11:$M$196,10,FALSE)=\"\",\"\",VLOOKUP($C37,invullijst!$A$11:$M$196,10,FALSE))","v":""},147,{"$f":"IF(VLOOKUP($C37,invullijst!$A$11:$M$196,11,FALSE)=\"\",\"\",VLOOKUP($C37,invullijst!$A$11:$M$196,11,FALSE))","v":""}]
[null,17,513,{"$f":"IF(VLOOKUP($C38,invullijst!$A$11:$M$196,4,FALSE)=\"\",\"\",VLOOKUP($C38,invullijst!$A$11:$M$196,4,FALSE))","v":"vr"},{"$f":"IF(VLOOKUP($C38,invullijst!$A$11:$M$196,2,FALSE)=\"\",\"\",VLOOKUP($C38,invullijst!$A$11:$M$196,2,FALSE))","v":"Mark van Delft"},{"$f":"IF(VLOOKUP($C38,invullijst!$A$11:$M$196,3,FALSE)=\"\",\"\",VLOOKUP($C38,invullijst!$A$11:$M$196,3,FALSE))","v":"Kaatsheuvel"},{"$f":"IF(VLOOKUP(C38,invullijst!$A$11:$M$196,6,FALSE)=\"\",\"\",VLOOKUP(C38,invullijst!$A$11:$M$196,6,FALSE))","v":82},{"$f":"IF(VLOOKUP($C38,invullijst!$A$11:$M$196,7,FALSE)=\"\",\"\",VLOOKUP($C38,invullijst!$A$11:$M$196,7,FALSE))","v":83},{"$f":"IF(VLOOKUP($C38,invullijst!$A$11:$M$196,8,FALSE)=\"\",\"\",VLOOKUP($C38,invullijst!$A$11:$M$196,8,FALSE))","v":"x"},{"$f":"IF(VLOOKUP($C38,invullijst!$A$11:$M$196,9,FALSE)=\"\",\"\",VLOOKUP($C38,invullijst!$A$11:$M$196,9,FALSE))","v":""},{"$f":"IF(VLOOKUP($C38,invullijst!$A$11:$M$196,10,FALSE)=\"\",\"\",VLOOKUP($C38,invullijst!$A$11:$M$196,10,FALSE))","v":""},165,{"$f":"IF(VLOOKUP($C38,invullijst!$A$11:$M$196,11,FALSE)=\"\",\"\",VLOOKUP($C38,invullijst!$A$11:$M$196,11,FALSE))","v":""}]
[{"$nulls":3},{"$f":"IF(VLOOKUP($C39,invullijst!$A$11:$M$196,4,FALSE)=\"\",\"\",VLOOKUP($C39,invullijst!$A$11:$M$196,4,FALSE))","v":0},{"$f":"IF(VLOOKUP($C39,invullijst!$A$11:$M$196,2,FALSE)=\"\",\"\",VLOOKUP($C39,invullijst!$A$11:$M$196,2,FALSE))","v":0},{"$f":"IF(VLOOKUP($C39,invullijst!$A$11:$M$196,3,FALSE)=\"\",\"\",VLOOKUP($C39,invullijst!$A$11:$M$196,3,FALSE))","v":0},{"$f":"IF(VLOOKUP(C39,invullijst!$A$11:$M$196,6,FALSE)=\"\",\"\",VLOOKUP(C39,invullijst!$A$11:$M$196,6,FALSE))","v":0},{"$f":"IF(VLOOKUP($C39,invullijst!$A$11:$M$196,7,FALSE)=\"\",\"\",VLOOKUP($C39,invullijst!$A$11:$M$196,7,FALSE))","v":0},{"$f":"IF(VLOOKUP($C39,invullijst!$A$11:$M$196,8,FALSE)=\"\",\"\",VLOOKUP($C39,invullijst!$A$11:$M$196,8,FALSE))","v":0},{"$f":"IF(VLOOKUP($C39,invullijst!$A$11:$M$196,9,FALSE)=\"\",\"\",VLOOKUP($C39,invullijst!$A$11:$M$196,9,FALSE))","v":0},{"$f":"IF(VLOOKUP($C39,invullijst!$A$11:$M$196,10,FALSE)=\"\",\"\",VLOOKUP($C39,invullijst!$A$11:$M$196,10,FALSE))","v":0},0,{"$f":"IF(VLOOKUP($C39,invullijst!$A$11:$M$196,11,FALSE)=\"\",\"\",VLOOKUP($C39,invullijst!$A$11:$M$196,11,FALSE))","v":0}]
[{"$nulls":3},{"$f":"IF(VLOOKUP($C40,invullijst!$A$11:$M$196,4,FALSE)=\"\",\"\",VLOOKUP($C40,invullijst!$A$11:$M$196,4,FALSE))","v":0},{"$f":"IF(VLOOKUP($C40,invullijst!$A$11:$M$196,2,FALSE)=\"\",\"\",VLOOKUP($C40,invullijst!$A$11:$M$196,2,FALSE))","v":0},{"$f":"IF(VLOOKUP($C40,invullijst!$A$11:$M$196,3,FALSE)=\"\",\"\",VLOOKUP($C40,invullijst!$A$11:$M$196,3,FALSE))","v":0},{"$f":"IF(VLOOKUP(C40,invullijst!$A$11:$M$196,6,FALSE)=\"\",\"\",VLOOKUP(C40,invullijst!$A$11:$M$196,6,FALSE))","v":0},{"$f":"IF(VLOOKUP($C40,invullijst!$A$11:$M$196,7,FALSE)=\"\",\"\",VLOOKUP($C40,invullijst!$A$11:$M$196,7,FALSE))","v":0},{"$f":"IF(VLOOKUP($C40,invullijst!$A$11:$M$196,8,FALSE)=\"\",\"\",VLOOKUP($C40,invullijst!$A$11:$M$196,8,FALSE))","v":0},{"$f":"IF(VLOOKUP($C40,invullijst!$A$11:$M$196,9,FALSE)=\"\",\"\",VLOOKUP($C40,invullijst!$A$11:$M$196,9,FALSE))","v":0},{"$f":"IF(VLOOKUP($C40,invullijst!$A$11:$M$196,10,FALSE)=\"\",\"\",VLOOKUP($C40,invullijst!$A$11:$M$196,10,FALSE))","v":0},0,{"$f":"IF(VLOOKUP($C40,invullijst!$A$11:$M$196,11,FALSE)=\"\",\"\",VLOOKUP($C40,invullijst!$A$11:$M$196,11,FALSE))","v":0}]
[{"$nulls":3},{"$f":"IF(VLOOKUP($C41,invullijst!$A$11:$M$196,4,FALSE)=\"\",\"\",VLOOKUP($C41,invullijst!$A$11:$M$196,4,FALSE))","v":0},{"$f":"IF(VLOOKUP($C41,invullijst!$A$11:$M$196,2,FALSE)=\"\",\"\",VLOOKUP($C41,invullijst!$A$11:$M$196,2,FALSE))","v":0},{"$f":"IF(VLOOKUP($C41,invullijst!$A$11:$M$196,3,FALSE)=\"\",\"\",VLOOKUP($C41,invullijst!$A$11:$M$196,3,FALSE))","v":0},{"$f":"IF(VLOOKUP(C41,invullijst!$A$11:$M$196,6,FALSE)=\"\",\"\",VLOOKUP(C41,invullijst!$A$11:$M$196,6,FALSE))","v":0},{"$f":"IF(VLOOKUP($C41,invullijst!$A$11:$M$196,7,FALSE)=\"\",\"\",VLOOKUP($C41,invullijst!$A$11:$M$196,7,FALSE))","v":0},{"$f":"IF(VLOOKUP($C41,invullijst!$A$11:$M$196,8,FALSE)=\"\",\"\",VLOOKUP($C41,invullijst!$A$11:$M$196,8,FALSE))","v":0},{"$f":"IF(VLOOKUP($C41,invullijst!$A$11:$M$196,9,FALSE)=\"\",\"\",VLOOKUP($C41,invullijst!$A$11:$M$196,9,FALSE))","v":0},{"$f":"IF(VLOOKUP($C41,invullijst!$A$11:$M$196,10,FALSE)=\"\",\"\",VLOOKUP($C41,invullijst!$A$11:$M$196,10,FALSE))","v":0},0,{"$f":"IF(VLOOKUP($C41,invullijst!$A$11:$M$196,11,FALSE)=\"\",\"\",VLOOKUP($C41,invullijst!$A$11:$M$196,11,FALSE))","v":0}]
[{"$nulls":3},{"$f":"IF(VLOOKUP($C42,invullijst!$A$11:$M$196,4,FALSE)=\"\",\"\",VLOOKUP($C42,invullijst!$A$11:$M$196,4,FALSE))","v":0},{"$f":"IF(VLOOKUP($C42,invullijst!$A$11:$M$196,2,FALSE)=\"\",\"\",VLOOKUP($C42,invullijst!$A$11:$M$196,2,FALSE))","v":0},{"$f":"IF(VLOOKUP($C42,invullijst!$A$11:$M$196,3,FALSE)=\"\",\"\",VLOOKUP($C42,invullijst!$A$11:$M$196,3,FALSE))","v":0},{"$f":"IF(VLOOKUP(C42,invullijst!$A$11:$M$196,6,FALSE)=\"\",\"\",VLOOKUP(C42,invullijst!$A$11:$M$196,6,FALSE))","v":0},{"$f":"IF(VLOOKUP($C42,invullijst!$A$11:$M$196,7,FALSE)=\"\",\"\",VLOOKUP($C42,invullijst!$A$11:$M$196,7,FALSE))","v":0},{"$f":"IF(VLOOKUP($C42,invullijst!$A$11:$M$196,8,FALSE)=\"\",\"\",VLOOKUP($C42,invullijst!$A$11:$M$196,8,FALSE))","v":0},{"$f":"IF(VLOOKUP($C42,invullijst!$A$11:$M$196,9,FALSE)=\"\",\"\",VLOOKUP($C42,invullijst!$A$11:$M$196,9,FALSE))","v":0},{"$f":"IF(VLOOKUP($C42,invullijst!$A$11:$M$196,10,FALSE)=\"\",\"\",VLOOKUP($C42,invullijst!$A$11:$M$196,10,FALSE))","v":0},0,{"$f":"IF(VLOOKUP($C42,invullijst!$A$11:$M$196,11,FALSE)=\"\",\"\",VLOOKUP($C42,invullijst!$A$11:$M$196,11,FALSE))","v":0}]
[{"$nulls":3},{"$f":"IF(VLOOKUP($C43,invullijst!$A$11:$M$196,4,FALSE)=\"\",\"\",VLOOKUP($C43,invullijst!$A$11:$M$196,4,FALSE))","v":0},{"$f":"IF(VLOOKUP($C43,invullijst!$A$11:$M$196,2,FALSE)=\"\",\"\",VLOOKUP($C43,invullijst!$A$11:$M$196,2,FALSE))","v":0},{"$f":"IF(VLOOKUP($C43,invullijst!$A$11:$M$196,3,FALSE)=\"\",\"\",VLOOKUP($C43,invullijst!$A$11:$M$196,3,FALSE))","v":0},{"$f":"IF(VLOOKUP(C43,invullijst!$A$11:$M$196,6,FALSE)=\"\",\"\",VLOOKUP(C43,invullijst!$A$11:$M$196,6,FALSE))","v":0},{"$f":"IF(VLOOKUP($C43,invullijst!$A$11:$M$196,7,FALSE)=\"\",\"\",VLOOKUP($C43,invullijst!$A$11:$M$196,7,FALSE))","v":0},{"$f":"IF(VLOOKUP($C43,invullijst!$A$11:$M$196,8,FALSE)=\"\",\"\",VLOOKUP($C43,invullijst!$A$11:$M$196,8,FALSE))","v":0},{"$f":"IF(VLOOKUP($C43,invullijst!$A$11:$M$196,9,FALSE)=\"\",\"\",VLOOKUP($C43,invullijst!$A$11:$M$196,9,FALSE))","v":0},{"$f":"IF(VLOOKUP($C43,invullijst!$A$11:$M$196,10,FALSE)=\"\",\"\",VLOOKUP($C43,invullijst!$A$11:$M$196,10,FALSE))","v":0},0,{"$f":"IF(VLOOKUP($C43,invullijst!$A$11:$M$196,11,FALSE)=\"\",\"\",VLOOKUP($C43,invullijst!$A$11:$M$196,11,FALSE))","v":0}]
[{"$nulls":3},{"$f":"IF(VLOOKUP($C44,invullijst!$A$11:$M$196,4,FALSE)=\"\",\"\",VLOOKUP($C44,invullijst!$A$11:$M$196,4,FALSE))","v":0},{"$f":"IF(VLOOKUP($C44,invullijst!$A$11:$M$196,2,FALSE)=\"\",\"\",VLOOKUP($C44,invullijst!$A$11:$M$196,2,FALSE))","v":0},{"$f":"IF(VLOOKUP($C44,invullijst!$A$11:$M$196,3,FALSE)=\"\",\"\",VLOOKUP($C44,invullijst!$A$11:$M$196,3,FALSE))","v":0},{"$f":"IF(VLOOKUP(C44,invullijst!$A$11:$M$196,6,FALSE)=\"\",\"\",VLOOKUP(C44,invullijst!$A$11:$M$196,6,FALSE))","v":0},{"$f":"IF(VLOOKUP($C44,invullijst!$A$11:$M$196,7,FALSE)=\"\",\"\",VLOOKUP($C44,invullijst!$A$11:$M$196,7,FALSE))","v":0},{"$f":"IF(VLOOKUP($C44,invullijst!$A$11:$M$196,8,FALSE)=\"\",\"\",VLOOKUP($C44,invullijst!$A$11:$M$196,8,FALSE))","v":0},{"$f":"IF(VLOOKUP($C44,invullijst!$A$11:$M$196,9,FALSE)=\"\",\"\",VLOOKUP($C44,invullijst!$A$11:$M$196,9,FALSE))","v":0},{"$f":"IF(VLOOKUP($C44,invullijst!$A$11:$M$196,10,FALSE)=\"\",\"\",VLOOKUP($C44,invullijst!$A$11:$M$196,10,FALSE))","v":0},0,{"$f":"IF(VLOOKUP($C44,invullijst!$A$11:$M$196,11,FALSE)=\"\",\"\",VLOOKUP($C44,invullijst!$A$11:$M$196,11,FALSE))","v":0}]
[{"$nulls":3},{"$f":"IF(VLOOKUP($C45,invullijst!$A$11:$M$196,4,FALSE)=\"\",\"\",VLOOKUP($C45,invullijst!$A$11:$M$196,4,FALSE))","v":0},{"$f":"IF(VLOOKUP($C45,invullijst!$A$11:$M$196,2,FALSE)=\"\",\"\",VLOOKUP($C45,invullijst!$A$11:$M$196,2,FALSE))","v":0},{"$f":"IF(VLOOKUP($C45,invullijst!$A$11:$M$196,3,FALSE)=\"\",\"\",VLOOKUP($C45,invullijst!$A$11:$M$196,3,FALSE))","v":0},{"$f":"IF(VLOOKUP(C45,invullijst!$A$11:$M$196,6,FALSE)=\"\",\"\",VLOOKUP(C45,invullijst!$A$11:$M$196,6,FALSE))","v":0},{"$f":"IF(VLOOKUP($C45,invullijst!$A$11:$M$196,7,FALSE)=\"\",\"\",VLOOKUP($C45,invullijst!$A$11:$M$196,7,FALSE))","v":0},{"$f":"IF(VLOOKUP($C45,invullijst!$A$11:$M$196,8,FALSE)=\"\",\"\",VLOOKUP($C45,invullijst!$A$11:$M$196,8,FALSE))","v":0},{"$f":"IF(VLOOKUP($C45,invullijst!$A$11:$M$196,9,FALSE)=\"\",\"\",VLOOKUP($C45,invullijst!$A$11:$M$196,9,FALSE))","v":0},{"$f":"IF(VLOOKUP($C45,invullijst!$A$11:$M$196,10,FALSE)=\"\",\"\",VLOOKUP($C45,invullijst!$A$11:$M$196,10,FALSE))","v":0},0,{"$f":"IF(VLOOKUP($C45,invullijst!$A$11:$M$196,11,FALSE)=\"\",\"\",VLOOKUP($C45,invullijst!$A$11:$M$196,11,FALSE))","v":0}]
[{"$nulls":3},{"$f":"IF(VLOOKUP($C46,invullijst!$A$11:$M$196,4,FALSE)=\"\",\"\",VLOOKUP($C46,invullijst!$A$11:$M$196,4,FALSE))","v":0},{"$f":"IF(VLOOKUP($C46,invullijst!$A$11:$M$196,2,FALSE)=\"\",\"\",VLOOKUP($C46,invullijst!$A$11:$M$196,2,FALSE))","v":0},{"$f":"IF(VLOOKUP($C46,invullijst!$A$11:$M$196,3,FALSE)=\"\",\"\",VLOOKUP($C46,invullijst!$A$11:$M$196,3,FALSE))","v":0},{"$f":"IF(VLOOKUP(C46,invullijst!$A$11:$M$196,6,FALSE)=\"\",\"\",VLOOKUP(C46,invullijst!$A$11:$M$196,6,FALSE))","v":0},{"$f":"IF(VLOOKUP($C46,invullijst!$A$11:$M$196,7,FALSE)=\"\",\"\",VLOOKUP($C46,invullijst!$A$11:$M$196,7,FALSE))","v":0},{"$f":"IF(VLOOKUP($C46,invullijst!$A$11:$M$196,8,FALSE)=\"\",\"\",VLOOKUP($C46,invullijst!$A$11:$M$196,8,FALSE))","v":0},{"$f":"IF(VLOOKUP($C46,invullijst!$A$11:$M$196,9,FALSE)=\"\",\"\",VLOOKUP($C46,invullijst!$A$11:$M$196,9,FALSE))","v":0},{"$f":"IF(VLOOKUP($C46,invullijst!$A$11:$M$196,10,FALSE)=\"\",\"\",VLOOKUP($C46,invullijst!$A$11:$M$196,10,FALSE))","v":0},0,{"$f":"IF(VLOOKUP($C46,invullijst!$A$11:$M$196,11,FALSE)=\"\",\"\",VLOOKUP($C46,invullijst!$A$11:$M$196,11,FALSE))","v":0}]
[{"$nulls":3},{"$f":"IF(VLOOKUP($C47,invullijst!$A$11:$M$196,4,FALSE)=\"\",\"\",VLOOKUP($C47,invullijst!$A$11:$M$196,4,FALSE))","v":0},{"$f":"IF(VLOOKUP($C47,invullijst!$A$11:$M$196,2,FALSE)=\"\",\"\",VLOOKUP($C47,invullijst!$A$11:$M$196,2,FALSE))","v":0},{"$f":"IF(VLOOKUP($C47,invullijst!$A$11:$M$196,3,FALSE)=\"\",\"\",VLOOKUP($C47,invullijst!$A$11:$M$196,3,FALSE))","v":0},{"$f":"IF(VLOOKUP(C47,invullijst!$A$11:$M$196,6,FALSE)=\"\",\"\",VLOOKUP(C47,invullijst!$A$11:$M$196,6,FALSE))","v":0},{"$f":"IF(VLOOKUP($C47,invullijst!$A$11:$M$196,7,FALSE)=\"\",\"\",VLOOKUP($C47,invullijst!$A$11:$M$196,7,FALSE))","v":0},{"$f":"IF(VLOOKUP($C47,invullijst!$A$11:$M$196,8,FALSE)=\"\",\"\",VLOOKUP($C47,invullijst!$A$11:$M$196,8,FALSE))","v":0},{"$f":"IF(VLOOKUP($C47,invullijst!$A$11:$M$196,9,FALSE)=\"\",\"\",VLOOKUP($C47,invullijst!$A$11:$M$196,9,FALSE))","v":0},{"$f":"IF(VLOOKUP($C47,invullijst!$A$11:$M$196,10,FALSE)=\"\",\"\",VLOOKUP($C47,invullijst!$A$11:$M$196,10,FALSE))","v":0},0,{"$f":"IF(VLOOKUP($C47,invullijst!$A$11:$M$196,11,FALSE)=\"\",\"\",VLOOKUP($C47,invullijst!$A$11:$M$196,11,FALSE))","v":0}]
[{"$nulls":3},{"$f":"IF(VLOOKUP($C48,invullijst!$A$11:$M$196,4,FALSE)=\"\",\"\",VLOOKUP($C48,invullijst!$A$11:$M$196,4,FALSE))","v":0},{"$f":"IF(VLOOKUP($C48,invullijst!$A$11:$M$196,2,FALSE)=\"\",\"\",VLOOKUP($C48,invullijst!$A$11:$M$196,2,FALSE))","v":0},{"$f":"IF(VLOOKUP($C48,invullijst!$A$11:$M$196,3,FALSE)=\"\",\"\",VLOOKUP($C48,invullijst!$A$11:$M$196,3,FALSE))","v":0},{"$f":"IF(VLOOKUP(C48,invullijst!$A$11:$M$196,6,FALSE)=\"\",\"\",VLOOKUP(C48,invullijst!$A$11:$M$196,6,FALSE))","v":0},{"$f":"IF(VLOOKUP($C48,invullijst!$A$11:$M$196,7,FALSE)=\"\",\"\",VLOOKUP($C48,invullijst!$A$11:$M$196,7,FALSE))","v":0},{"$f":"IF(VLOOKUP($C48,invullijst!$A$11:$M$196,8,FALSE)=\"\",\"\",VLOOKUP($C48,invullijst!$A$11:$M$196,8,FALSE))","v":0},{"$f":"IF(VLOOKUP($C48,invullijst!$A$11:$M$196,9,FALSE)=\"\",\"\",VLOOKUP($C48,invullijst!$A$11:$M$196,9,FALSE))","v":0},{"$f":"IF(VLOOKUP($C48,invullijst!$A$11:$M$196,10,FALSE)=\"\",\"\",VLOOKUP($C48,invullijst!$A$11:$M$196,10,FALSE))","v":0},0,{"$f":"IF(VLOOKUP($C48,invullijst!$A$11:$M$196,11,FALSE)=\"\",\"\",VLOOKUP($C48,invullijst!$A$11:$M$196,11,FALSE))","v":0}]
[{"$nulls":3},{"$f":"IF(VLOOKUP($C49,invullijst!$A$11:$M$196,4,FALSE)=\"\",\"\",VLOOKUP($C49,invullijst!$A$11:$M$196,4,FALSE))","v":0},{"$f":"IF(VLOOKUP($C49,invullijst!$A$11:$M$196,2,FALSE)=\"\",\"\",VLOOKUP($C49,invullijst!$A$11:$M$196,2,FALSE))","v":0},{"$f":"IF(VLOOKUP($C49,invullijst!$A$11:$M$196,3,FALSE)=\"\",\"\",VLOOKUP($C49,invullijst!$A$11:$M$196,3,FALSE))","v":0},{"$f":"IF(VLOOKUP(C49,invullijst!$A$11:$M$196,6,FALSE)=\"\",\"\",VLOOKUP(C49,invullijst!$A$11:$M$196,6,FALSE))","v":0},{"$f":"IF(VLOOKUP($C49,invullijst!$A$11:$M$196,7,FALSE)=\"\",\"\",VLOOKUP($C49,invullijst!$A$11:$M$196,7,FALSE))","v":0},{"$f":"IF(VLOOKUP($C49,invullijst!$A$11:$M$196,8,FALSE)=\"\",\"\",VLOOKUP($C49,invullijst!$A$11:$M$196,8,FALSE))","v":0},{"$f":"IF(VLOOKUP($C49,invullijst!$A$11:$M$196,9,FALSE)=\"\",\"\",VLOOKUP($C49,invullijst!$A$11:$M$196,9,FALSE))","v":0},{"$f":"IF(VLOOKUP($C49,invullijst!$A$11:$M$196,10,FALSE)=\"\",\"\",VLOOKUP($C49,invullijst!$A$11:$M$196,10,FALSE))","v":0},0,{"$f":"IF(VLOOKUP($C49,invullijst!$A$11:$M$196,11,FALSE)=\"\",\"\",VLOOKUP($C49,invullijst!$A$11:$M$196,11,FALSE))","v":0}]
[{"$nulls":3},{"$f":"IF(VLOOKUP($C50,invullijst!$A$11:$M$196,4,FALSE)=\"\",\"\",VLOOKUP($C50,invullijst!$A$11:$M$196,4,FALSE))","v":0},{"$f":"IF(VLOOKUP($C50,invullijst!$A$11:$M$196,2,FALSE)=\"\",\"\",VLOOKUP($C50,invullijst!$A$11:$M$196,2,FALSE))","v":0},{"$f":"IF(VLOOKUP($C50,invullijst!$A$11:$M$196,3,FALSE)=\"\",\"\",VLOOKUP($C50,invullijst!$A$11:$M$196,3,FALSE))","v":0},{"$f":"IF(VLOOKUP(C50,invullijst!$A$11:$M$196,6,FALSE)=\"\",\"\",VLOOKUP(C50,invullijst!$A$11:$M$196,6,FALSE))","v":0},{"$f":"IF(VLOOKUP($C50,invullijst!$A$11:$M$196,7,FALSE)=\"\",\"\",VLOOKUP($C50,invullijst!$A$11:$M$196,7,FALSE))","v":0},{"$f":"IF(VLOOKUP($C50,invullijst!$A$11:$M$196,8,FALSE)=\"\",\"\",VLOOKUP($C50,invullijst!$A$11:$M$196,8,FALSE))","v":0},{"$f":"IF(VLOOKUP($C50,invullijst!$A$11:$M$196,9,FALSE)=\"\",\"\",VLOOKUP($C50,invullijst!$A$11:$M$196,9,FALSE))","v":0},{"$f":"IF(VLOOKUP($C50,invullijst!$A$11:$M$196,10,FALSE)=\"\",\"\",VLOOKUP($C50,invullijst!$A$11:$M$196,10,FALSE))","v":0},0,{"$f":"IF(VLOOKUP($C50,invullijst!$A$11:$M$196,11,FALSE)=\"\",\"\",VLOOKUP($C50,invullijst!$A$11:$M$196,11,FALSE))","v":0}]
[{"$nulls":3},{"$f":"IF(VLOOKUP($C51,invullijst!$A$11:$M$196,4,FALSE)=\"\",\"\",VLOOKUP($C51,invullijst!$A$11:$M$196,4,FALSE))","v":0}]
[{"$nulls":3},{"$f":"IF(VLOOKUP($C52,invullijst!$A$11:$M$196,4,FALSE)=\"\",\"\",VLOOKUP($C52,invullijst!$A$11:$M$196,4,FALSE))","v":0}]
[{"$nulls":3},{"$f":"IF(VLOOKUP($C53,invullijst!$A$11:$M$196,4,FALSE)=\"\",\"\",VLOOKUP($C53,invullijst!$A$11:$M$196,4,FALSE))","v":0}]
[{"$nulls":3},{"$f":"IF(VLOOKUP($C54,invullijst!$A$11:$M$196,4,FALSE)=\"\",\"\",VLOOKUP($C54,invullijst!$A$11:$M$196,4,FALSE))","v":0}]
[{"$nulls":3},{"$f":"IF(VLOOKUP($C55,invullijst!$A$11:$M$196,4,FALSE)=\"\",\"\",VLOOKUP($C55,invullijst!$A$11:$M$196,4,FALSE))","v":0}]

{"sheet":"Jeugd","index":2,"n_rows":14,"n_cols":13,"rows_kept":14,"merged":[[0,0,1,5],[0,6,0,9],[0,10,0,12],[1,6,1,12],[2,0,2,5],[2,6,2,10]]}
["JEUGD",{"$nulls":5},{"$f":"invullijst!F1","v":"Organistatie"},{"$nulls":3},{"$f":"invullijst!H2","v":"2025 - 2026"}]
[{"$nulls":6},{"$f":"invullijst!F3","v":"Sint Ambrosius Baardwijk"}]
["alleen in de gele kolom nummer schutter invullen",{"$nulls":5},"wedstrijd",{"$nulls":5},"KAMP-"]
["KL",null,"schutter",null,"NAAM","PLAATS",1,2,3,4,5,"TOTAAL","KAART"]
["A",1,221,{"$f":"IF(VLOOKUP($C5,invullijst!$A$11:$M$196,4,FALSE)=\"\",\"\",VLOOKUP($C5,invullijst!$A$11:$M$196,4,FALSE))","v":"J"},{"$f":"IF(VLOOKUP($C5,invullijst!$A$11:$M$196,2,FALSE)=\"\",\"\",VLOOKUP($C5,invullijst!$A$11:$M$196,2,FALSE))","v":"Mees Huijben"},{"$f":"IF(VLOOKUP($C5,invullijst!$A$11:$M$196,3,FALSE)=\"\",\"\",VLOOKUP($C5,invullijst!$A$11:$M$196,3,FALSE))","v":"Besoijen"},{"$f":"IF(VLOOKUP($C5,invullijst!$A$11:$M$196,6,FALSE)=\"\",\"\",VLOOKUP($C5,invullijst!$A$11:$M$196,6,FALSE))","v":86},{"$f":"IF(VLOOKUP($C5,invullijst!$A$11:$M$196,7,FALSE)=\"\",\"\",VLOOKUP($C5,invullijst!$A$11:$M$196,7,FALSE))","v":83},{"$f":"IF(VLOOKUP($C5,invullijst!$A$11:$M$196,8,FALSE)=\"\",\"\",VLOOKUP($C5,invullijst!$A$11:$M$196,8,FALSE))","v":89},{"$f":"IF(VLOOKUP($C5,invullijst!$A$11:$M$196,9,FALSE)=\"\",\"\",VLOOKUP($C5,invullijst!$A$11:$M$196,9,FALSE))","v":"x"},{"$f":"IF(VLOOKUP($C5,invullijst!$A$11:$M$196,10,FALSE)=\"\",\"\",VLOOKUP($C5,invullijst!$A$11:$M$196,10,FALSE))","v":""},{"$f":"SUM(G5:K5)","v":258},{"$f":"IF(VLOOKUP($C5,invullijst!$A$11:$M$196,11,FALSE)=\"\",\"\",VLOOKUP($C5,invullijst!$A$11:$M$196,11,FALSE))","v":43}]
[null,2,312,{"$f":"IF(VLOOKUP($C6,invullijst!$A$11:$M$196,4,FALSE)=\"\",\"\",VLOOKUP($C6,invullijst!$A$11:$M$196,4,FALSE))","v":"J"},{"$f":"IF(VLOOKUP($C6,invullijst!$A$11:$M$196,2,FALSE)=\"\",\"\",VLOOKUP($C6,invullijst!$A$11:$M$196,2,FALSE))","v":"Floor de Jong"},{"$f":"IF(VLOOKUP($C6,invullijst!$A$11:$M$196,3,FALSE)=\"\",\"\",VLOOKUP($C6,invullijst!$A$11:$M$196,3,FALSE))","v":"Elshout"},{"$f":"IF(VLOOKUP($C6,invullijst!$A$11:$M$196,6,FALSE)=\"\",\"\",VLOOKUP($C6,invullijst!$A$11:$M$196,6,FALSE))","v":"x"},{"$f":"IF(VLOOKUP($C6,invullijst!$A$11:$M$196,7,FALSE)=\"\",\"\",VLOOKUP($C6,invullijst!$A$11:$M$196,7,FALSE))","v":90},{"$f":"IF(VLOOKUP($C6,invullijst!$A$11:$M$196,8,FALSE)=\"\",\"\",VLOOKUP($C6,invullijst!$A$11:$M$196,8,FALSE))","v":97},{"$f":"IF(VLOOKUP($C6,invullijst!$A$11:$M$196,9,FALSE)=\"\",\"\",VLOOKUP($C6,invullijst!$A$11:$M$196,9,FALSE))","v":""},{"$f":"IF(VLOOKUP($C6,invullijst!$A$11:$M$196,10,FALSE)=\"\",\"\",VLOOKUP($C6,invullijst!$A$11:$M$196,10,FALSE))","v":""},{"$f":"SUM(G6:K6)","v":187},{"$f":"IF(VLOOKUP($C6,invullijst!$A$11:$M$196,11,FALSE)=\"\",\"\",VLOOKUP($C6,invullijst!$A$11:$M$196,11,FALSE))","v":""}]
[null,3,502,{"$f":"IF(VLOOKUP($C7,invullijst!$A$11:$M$196,4,FALSE)=\"\",\"\",VLOOKUP($C7,invullijst!$A$11:$M$196,4,FALSE))","v":"J"},{"$f":"IF(VLOOKUP($C7,invullijst!$A$11:$M$196,2,FALSE)=\"\",\"\",VLOOKUP($C7,invullijst!$A$11:$M$196,2,FALSE))","v":"Djody Wagemakers"},{"$f":"IF(VLOOKUP($C7,invullijst!$A$11:$M$196,3,FALSE)=\"\",\"\",VLOOKUP($C7,invullijst!$A$11:$M$196,3,FALSE))","v":"Kaatsheuvel"},{"$f":"IF(VLOOKUP($C7,invullijst!$A$11:$M$196,6,FALSE)=\"\",\"\",VLOOKUP($C7,invullijst!$A$11:$M$196,6,FALSE))","v":93},{"$f":"IF(VLOOKUP($C7,invullijst!$A$11:$M$196,7,FALSE)=\"\",\"\",VLOOKUP($C7,invullijst!$A$11:$M$196,7,FALSE))","v":91},{"$f":"IF(VLOOKUP($C7,invullijst!$A$11:$M$196,8,FALSE)=\"\",\"\",VLOOKUP($C7,invullijst!$A$11:$M$196,8,FALSE))","v":"x"},{"$f":"IF(VLOOKUP($C7,invullijst!$A$11:$M$196,9,FALSE)=\"\",\"\",VLOOKUP($C7,invullijst!$A$11:$M$196,9,FALSE))","v":""},{"$f":"IF(VLOOKUP($C7,invullijst!$A$11:$M$196,10,FALSE)=\"\",\"\",VLOOKUP($C7,invullijst!$A$11:$M$196,10,FALSE))","v":""},{"$f":"SUM(G7:K7)","v":184},{"$f":"IF(VLOOKUP($C7,invullijst!$A$11:$M$196,11,FALSE)=\"\",\"\",VLOOKUP($C7,invullijst!$A$11:$M$196,11,FALSE))","v":""}]
[{"$nulls":3},{"$f":"IF(VLOOKUP($C8,invullijst!$A$11:$M$196,4,FALSE)=\"\",\"\",VLOOKUP($C8,invullijst!$A$11:$M$196,4,FALSE))","v":0},{"$f":"IF(VLOOKUP($C8,invullijst!$A$11:$M$196,2,FALSE)=\"\",\"\",VLOOKUP($C8,invullijst!$A$11:$M$196,2,FALSE))","v":0},{"$f":"IF(VLOOKUP($C8,invullijst!$A$11:$M$196,3,FALSE)=\"\",\"\",VLOOKUP($C8,invullijst!$A$11:$M$196,3,FALSE))","v":0},{"$f":"IF(VLOOKUP($C8,invullijst!$A$11:$M$196,6,FALSE)=\"\",\"\",VLOOKUP($C8,invullijst!$A$11:$M$196,6,FALSE))","v":0},{"$f":"IF(VLOOKUP($C8,invullijst!$A$11:$M$196,7,FALSE)=\"\",\"\",VLOOKUP($C8,invullijst!$A$11:$M$196,7,FALSE))","v":0},{"$f":"IF(VLOOKUP($C8,invullijst!$A$11:$M$196,8,FALSE)=\"\",\"\",VLOOKUP($C8,invullijst!$A$11:$M$196,8,FALSE))","v":0},{"$f":"IF(VLOOKUP($C8,invullijst!$A$11:$M$196,9,FALSE)=\"\",\"\",VLOOKUP($C8,invullijst!$A$11:$M$196,9,FALSE))","v":0},{"$f":"IF(VLOOKUP($C8,invullijst!$A$11:$M$196,10,FALSE)=\"\",\"\",VLOOKUP($C8,invullijst!$A$11:$M$196,10,FALSE))","v":0},{"$f":"SUM(G8:K8)","v":0},{"$f":"IF(VLOOKUP($C8,invullijst!$A$11:$M$196,11,FALSE)=\"\",\"\",VLOOKUP($C8,invullijst!$A$11:$M$196,11,FALSE))","v":0}]
[{"$nulls":3},{"$f":"IF(VLOOKUP($C9,invullijst!$A$11:$M$196,4,FALSE)=\"\",\"\",VLOOKUP($C9,invullijst!$A$11:$M$196,4,FALSE))","v":0}]
[{"$nulls":3},{"$f":"IF(VLOOKUP($C10,invullijst!$A$11:$M$196,4,FALSE)=\"\",\"\",VLOOKUP($C10,invullijst!$A$11:$M$196,4,FALSE))","v":0}]
[{"$nulls":3},{"$f":"IF(VLOOKUP($C11,invullijst!$A$11:$M$196,4,FALSE)=\"\",\"\",VLOOKUP($C11,invullijst!$A$11:$M$196,4,FALSE))","v":0}]
[{"$nulls":3},{"$f":"IF(VLOOKUP($C12,invullijst!$A$11:$M$196,4,FALSE)=\"\",\"\",VLOOKUP($C12,invullijst!$A$11:$M$196,4,FALSE))","v":0}]
[{"$nulls":3},{"$f":"IF(VLOOKUP($C13,invullijst!$A$11:$M$196,4,FALSE)=\"\",\"\",VLOOKUP($C13,invullijst!$A$11:$M$196,4,FALSE))","v":0}]
[{"$nulls":3},{"$f":"IF(VLOOKUP($C14,invullijst!$A$11:$M$196,4,FALSE)=\"\",\"\",VLOOKUP($C14,invullijst!$A$11:$M$196,4,FALSE))","v":0}]

{"sheet":"65+","index":3,"n_rows":41,"n_cols":13,"rows_kept":41,"merged":[[0,0,1,5],[0,6,0,9],[0,10,0,12],[1,6,1,12],[2,0,2,5],[2,6,2,10]]}
["65+",{"$nulls":5},{"$f":"invullijst!F1","v":"Organistatie"},{"$nulls":3},{"$f":"invullijst!H2","v":"2025 - 2026"}]
[{"$nulls":6},{"$f":"invullijst!F3","v":"Sint Ambrosius Baardwijk"}]
["alleen in de gele kolom nummer schutter invullen",{"$nulls":5},"wedstrijd",{"$nulls":5},"KAMP-"]
["KL.",null,"schutter",null,"NAAM","PLAATS",1,2,3,4,5,"TOTAAL","KAART"]
["A",1,102,{"$f":"IF(VLOOKUP($C5,invullijst!$A$11:$M215,4,FALSE)=\"\",\"\",VLOOKUP($C5,invullijst!$A$11:$M215,4,FALSE))","v":"65+"},{"$f":"IF(VLOOKUP($C5,invullijst!$A$11:$M213,2,FALSE)=\"\",\"\",VLOOKUP($C5,invullijst!$A$11:$M213,2,FALSE))","v":"John de Jong (disp)"},{"$f":"IF(VLOOKUP($C5,invullijst!$A$11:$M$196,3,FALSE)=\"\",\"\",VLOOKUP($C5,invullijst!$A$11:$M$196,3,FALSE))","v":"Baardwijk"},{"$f":"IF(VLOOKUP($C5,invullijst!$A$11:$M$196,6,FALSE)=\"\",\"\",VLOOKUP($C5,invullijst!$A$11:$M$196,6,FALSE))","v":90},{"$f":"IF(VLOOKUP($C5,invullijst!$A$11:$M$196,7,FALSE)=\"\",\"\",VLOOKUP($C5,invullijst!$A$11:$M$196,7,FALSE))","v":84},{"$f":"IF(VLOOKUP($C5,invullijst!$A$11:$M$196,8,FALSE)=\"\",\"\",VLOOKUP($C5,invullijst!$A$11:$M$196,8,FALSE))","v":82},{"$f":"IF(VLOOKUP($C5,invullijst!$A$11:$M$196,9,FALSE)=\"\",\"\",VLOOKUP($C5,invullijst!$A$11:$M$196,9,FALSE))","v":""},{"$f":"IF(VLOOKUP($C5,invullijst!$A$11:$M$196,10,FALSE)=\"\",\"\",VLOOKUP($C5,invullijst!$A$11:$M$196,10,FALSE))","v":"x"},{"$f":"SUM(G5:K5)","v":256},{"$f":"IF(VLOOKUP($C5,invullijst!$A$11:$M$196,11,FALSE)=\"\",\"\",VLOOKUP($C5,invullijst!$A$11:$M$196,11,FALSE))","v":""}]
[null,2,104,{"$f":"IF(VLOOKUP($C6,invullijst!$A$11:$M207,4,FALSE)=\"\",\"\",VLOOKUP($C6,invullijst!$A$11:$M207,4,FALSE))","v":"65+"},{"$f":"IF(VLOOKUP($C6,invullijst!$A$11:$M198,2,FALSE)=\"\",\"\",VLOOKUP($C6,invullijst!$A$11:$M198,2,FALSE))","v":"Peter Brekelmans"},{"$f":"IF(VLOOKUP($C6,invullijst!$A$11:$M$196,3,FALSE)=\"\",\"\",VLOOKUP($C6,invullijst!$A$11:$M$196,3,FALSE))","v":"Baardwijk"},{"$f":"IF(VLOOKUP($C6,invullijst!$A$11:$M$196,6,FALSE)=\"\",\"\",VLOOKUP($C6,invullijst!$A$11:$M$196,6,FALSE))","v":75},{"$f":"IF(VLOOKUP($C6,invullijst!$A$11:$M$196,7,FALSE)=\"\",\"\",VLOOKUP($C6,invullijst!$A$11:$M$196,7,FALSE))","v":82},{"$f":"IF(VLOOKUP($C6,invullijst!$A$11:$M$196,8,FALSE)=\"\",\"\",VLOOKUP($C6,invullijst!$A$11:$M$196,8,FALSE))","v":"x"},{"$f":"IF(VLOOKUP($C6,invullijst!$A$11:$M$196,9,FALSE)=\"\",\"\",VLOOKUP($C6,invullijst!$A$11:$M$196,9,FALSE))","v":""},{"$f":"IF(VLOOKUP($C6,invullijst!$A$11:$M$196,10,FALSE)=\"\",\"\",VLOOKUP($C6,invullijst!$A$11:$M$196,10,FALSE))","v":"x"},{"$f":"SUM(G6:K6)","v":157},{"$f":"IF(VLOOKUP($C6,invullijst!$A$11:$M$196,11,FALSE)=\"\",\"\",VLOOKUP($C6,invullijst!$A$11:$M$196,11,FALSE))","v":""}]
[null,3,107,{"$f":"IF(VLOOKUP($C7,invullijst!$A$11:$M209,4,FALSE)=\"\",\"\",VLOOKUP($C7,invullijst!$A$11:$M209,4,FALSE))","v":"65+"},{"$f":"IF(VLOOKUP($C7,invullijst!$A$11:$M209,2,FALSE)=\"\",\"\",VLOOKUP($C7,invullijst!$A$11:$M209,2,FALSE))","v":"Cees Coppens"},{"$f":"IF(VLOOKUP($C7,invullijst!$A$11:$M$196,3,FALSE)=\"\",\"\",VLOOKUP($C7,invullijst!$A$11:$M$196,3,FALSE))","v":"Baardwijk"},{"$f":"IF(VLOOKUP($C7,invullijst!$A$11:$M$196,6,FALSE)=\"\",\"\",VLOOKUP($C7,invullijst!$A$11:$M$196,6,FALSE))","v":86},{"$f":"IF(VLOOKUP($C7,invullijst!$A$11:$M$196,7,FALSE)=\"\",\"\",VLOOKUP($C7,invullijst!$A$11:$M$196,7,FALSE))","v":"x"},{"$f":"IF(VLOOKUP($C7,invullijst!$A$11:$M$196,8,FALSE)=\"\",\"\",VLOOKUP($C7,invullijst!$A$11:$M$196,8,FALSE))","v":83},{"$f":"IF(VLOOKUP($C7,invullijst!$A$11:$M$196,9,FALSE)=\"\",\"\",VLOOKUP($C7,invullijst!$A$11:$M$196,9,FALSE))","v":""},{"$f":"IF(VLOOKUP($C7,invullijst!$A$11:$M$196,10,FALSE)=\"\",\"\",VLOOKUP($C7,invullijst!$A$11:$M$196,10,FALSE))","v":"x"},{"$f":"SUM(G7:K7)","v":169},{"$f":"IF(VLOOKUP($C7,invullijst!$A$11:$M$196,11,FALSE)=\"\",\"\",VLOOKUP($C7,invullijst!$A$11:$M$196,11,FALSE))","v":""}]
[null,4,112,{"$f":"IF(VLOOKUP($C8,invullijst!$A$11:$M205,4,FALSE)=\"\",\"\",VLOOKUP($C8,invullijst!$A$11:$M205,4,FALSE))","v":"65+"},{"$f":"IF(VLOOKUP($C8,invullijst!$A$11:$M203,2,FALSE)=\"\",\"\",VLOOKUP($C8,invullijst!$A$11:$M203,2,FALSE))","v":"Toon van Buul"},{"$f":"IF(VLOOKUP($C8,invullijst!$A$11:$M$196,3,FALSE)=\"\",\"\",VLOOKUP($C8,invullijst!$A$11:$M$196,3,FALSE))","v":"Baardwijk"},{"$f":"IF(VLOOKUP($C8,invullijst!$A$11:$M$196,6,FALSE)=\"\",\"\",VLOOKUP($C8,invullijst!$A$11:$M$196,6,FALSE))","v":54},{"$f":"IF(VLOOKUP($C8,invullijst!$A$11:$M$196,7,FALSE)=\"\",\"\",VLOOKUP($C8,invullijst!$A$11:$M$196,7,FALSE))","v":"x"},{"$f":"IF(VLOOKUP($C8,invullijst!$A$11:$M$196,8,FALSE)=\"\",\"\",VLOOKUP($C8,invullijst!$A$11:$M$196,8,FALSE))","v":"x"},{"$f":"IF(VLOOKUP($C8,invullijst!$A$11:$M$196,9,FALSE)=\"\",\"\",VLOOKUP($C8,invullijst!$A$11:$M$196,9,FALSE))","v":""},{"$f":"IF(VLOOKUP($C8,invullijst!$A$11:$M$196,10,FALSE)=\"\",\"\",VLOOKUP($C8,invullijst!$A$11:$M$196,10,FALSE))","v":"x"},{"$f":"SUM(G8:K8)","v":54},{"$f":"IF(VLOOKUP($C8,invullijst!$A$11:$M$196,11,FALSE)=\"\",\"\",VLOOKUP($C8,invullijst!$A$11:$M$196,11,FALSE))","v":""}]
[null,5,211,{"$f":"IF(VLOOKUP($C9,invullijst!$A$11:$M213,4,FALSE)=\"\",\"\",VLOOKUP($C9,invullijst!$A$11:$M213,4,FALSE))","v":"65+"},{"$f":"IF(VLOOKUP($C9,invullijst!$A$11:$M212,2,FALSE)=\"\",\"\",VLOOKUP($C9,invullijst!$A$11:$M212,2,FALSE))","v":"Ad van den houdt"},{"$f":"IF(VLOOKUP($C9,invullijst!$A$11:$M$196,3,FALSE)=\"\",\"\",VLOOKUP($C9,invullijst!$A$11:$M$196,3,FALSE))","v":"Besoijen"},{"$f":"IF(VLOOKUP($C9,invullijst!$A$11:$M$196,6,FALSE)=\"\",\"\",VLOOKUP($C9,invullijst!$A$11:$M$196,6,FALSE))","v":88},{"$f":"IF(VLOOKUP($C9,invullijst!$A$11:$M$196,7,FALSE)=\"\",\"\",VLOOKUP($C9,invullijst!$A$11:$M$196,7,FALSE))","v":"x"},{"$f":"IF(VLOOKUP($C9,invullijst!$A$11:$M$196,8,FALSE)=\"\",\"\",VLOOKUP($C9,invullijst!$A$11:$M$196,8,FALSE))","v":89},{"$f":"IF(VLOOKUP($C9,invullijst!$A$11:$M$196,9,FALSE)=\"\",\"\",VLOOKUP($C9,invullijst!$A$11:$M$196,9,FALSE))","v":"x"},{"$f":"IF(VLOOKUP($C9,invullijst!$A$11:$M$196,10,FALSE)=\"\",\"\",VLOOKUP($C9,invullijst!$A$11:$M$196,10,FALSE))","v":""},{"$f":"SUM(G9:K9)","v":177},{"$f":"IF(VLOOKUP($C9,invullijst!$A$11:$M$196,11,FALSE)=\"\",\"\",VLOOKUP($C9,invullijst!$A$11:$M$196,11,FALSE))","v":41}]
[null,6,212,{"$f":"IF(VLOOKUP($C10,invullijst!$A$11:$M217,4,FALSE)=\"\",\"\",VLOOKUP($C10,invullijst!$A$11:$M217,4,FALSE))","v":"65+"},{"$f":"IF(VLOOKUP($C10,invullijst!$A$11:$M213,2,FALSE)=\"\",\"\",VLOOKUP($C10,invullijst!$A$11:$M213,2,FALSE))","v":"René Duquesnoy"},{"$f":"IF(VLOOKUP($C10,invullijst!$A$11:$M$196,3,FALSE)=\"\",\"\",VLOOKUP($C10,invullijst!$A$11:$M$196,3,FALSE))","v":"Besoijen"},{"$f":"IF(VLOOKUP($C10,invullijst!$A$11:$M$196,6,FALSE)=\"\",\"\",VLOOKUP($C10,invullijst!$A$11:$M$196,6,FALSE))","v":88},{"$f":"IF(VLOOKUP($C10,invullijst!$A$11:$M$196,7,FALSE)=\"\",\"\",VLOOKUP($C10,invullijst!$A$11:$M$196,7,FALSE))","v":85},{"$f":"IF(VLOOKUP($C10,invullijst!$A$11:$M$196,8,FALSE)=\"\",\"\",VLOOKUP($C10,invullijst!$A$11:$M$196,8,FALSE))","v":90},{"$f":"IF(VLOOKUP($C10,invullijst!$A$11:$M$196,9,FALSE)=\"\",\"\",VLOOKUP($C10,invullijst!$A$11:$M$196,9,FALSE))","v":"x"},{"$f":"IF(VLOOKUP($C10,invullijst!$A$11:$M$196,10,FALSE)=\"\",\"\",VLOOKUP($C10,invullijst!$A$11:$M$196,10,FALSE))","v":""},{"$f":"SUM(G10:K10)","v":263},{"$f":"IF(VLOOKUP($C10,invullijst!$A$11:$M$196,11,FALSE)=\"\",\"\",VLOOKUP($C10,invullijst!$A$11:$M$196,11,FALSE))","v":37}]
[null,7,214,{"$f":"IF(VLOOKUP($C11,invullijst!$A$11:$M218,4,FALSE)=\"\",\"\",VLOOKUP($C11,invullijst!$A$11:$M218,4,FALSE))","v":"65+"},{"$f":"IF(VLOOKUP($C11,invullijst!$A$11:$M214,2,FALSE)=\"\",\"\",VLOOKUP($C11,invullijst!$A$11:$M214,2,FALSE))","v":"Andre de Vaan"},{"$f":"IF(VLOOKUP($C11,invullijst!$A$11:$M$196,3,FALSE)=\"\",\"\",VLOOKUP($C11,invullijst!$A$11:$M$196,3,FALSE))","v":"Besoijen"},{"$f":"IF(VLOOKUP($C11,invullijst!$A$11:$M$196,6,FALSE)=\"\",\"\",VLOOKUP($C11,invullijst!$A$11:$M$196,6,FALSE))","v":92},{"$f":"IF(VLOOKUP($C11,invullijst!$A$11:$M$196,7,FALSE)=\"\",\"\",VLOOKUP($C11,invullijst!$A$11:$M$196,7,FALSE))","v":93},{"$f":"IF(VLOOKUP($C11,invullijst!$A$11:$M$196,8,FALSE)=\"\",\"\",VLOOKUP($C11,invullijst!$A$11:$M$196,8,FALSE))","v":90},{"$f":"IF(VLOOKUP($C11,invullijst!$A$11:$M$196,9,FALSE)=\"\",\"\",VLOOKUP($C11,invullijst!$A$11:$M$196,9,FALSE))","v":"x"},{"$f":"IF(VLOOKUP($C11,invullijst!$A$11:$M$196,10,FALSE)=\"\",\"\",VLOOKUP($C11,invullijst!$A$11:$M$196,10,FALSE))","v":""},{"$f":"SUM(G11:K11)","v":275},{"$f":"IF(VLOOKUP($C11,invullijst!$A$11:$M$196,11,FALSE)=\"\",\"\",VLOOKUP($C11,invullijst!$A$11:$M$196,11,FALSE))","v":44}]
[null,8,218,{"$f":"IF(VLOOKUP($C12,invullijst!$A$11:$M214,4,FALSE)=\"\",\"\",VLOOKUP($C12,invullijst!$A$11:$M214,4,FALSE))","v":"65+"},{"$f":"IF(VLOOKUP($C12,invullijst!$A$11:$M208,2,FALSE)=\"\",\"\",VLOOKUP($C12,invullijst!$A$11:$M208,2,FALSE))","v":"Jacob van de Werken"},{"$f":"IF(VLOOKUP($C12,invullijst!$A$11:$M$196,3,FALSE)=\"\",\"\",VLOOKUP($C12,invullijst!$A$11:$M$196,3,FALSE))","v":"Besoijen"},{"$f":"IF(VLOOKUP($C12,invullijst!$A$11:$M$196,6,FALSE)=\"\",\"\",VLOOKUP($C12,invullijst!$A$11:$M$196,6,FALSE))","v":95},{"$f":"IF(VLOOKUP($C12,invullijst!$A$11:$M$196,7,FALSE)=\"\",\"\",VLOOKUP($C12,invullijst!$A$11:$M$196,7,FALSE))","v":96},{"$f":"IF(VLOOKUP($C12,invullijst!$A$11:$M$196,8,FALSE)=\"\",\"\",VLOOKUP($C12,invullijst!$A$11:$M$196,8,FALSE))","v":96},{"$f":"IF(VLOOKUP($C12,invullijst!$A$11:$M$196,9,FALSE)=\"\",\"\",VLOOKUP($C12,invullijst!$A$11:$M$196,9,FALSE))","v":"x"},{"$f":"IF(VLOOKUP($C12,invullijst!$A$11:$M$196,10,FALSE)=\"\",\"\",VLOOKUP($C12,invullijst!$A$11:$M$196,10,FALSE))","v":""},{"$f":"SUM(G12:K12)","v":287},{"$f":"IF(VLOOKUP($C12,invullijst!$A$11:$M$196,11,FALSE)=\"\",\"\",VLOOKUP($C12,invullijst!$A$11:$M$196,11,FALSE))","v":48}]
[null,9,219,{"$f":"IF(VLOOKUP($C13,invullijst!$A$11:$M203,4,FALSE)=\"\",\"\",VLOOKUP($C13,invullijst!$A$11:$M203,4,FALSE))","v":"65+"},{"$f":"IF(VLOOKUP($C13,invullijst!$A$11:$M204,2,FALSE)=\"\",\"\",VLOOKUP($C13,invullijst!$A$11:$M204,2,FALSE))","v":"Frans de Bont"},{"$f":"IF(VLOOKUP($C13,invullijst!$A$11:$M$196,3,FALSE)=\"\",\"\",VLOOKUP($C13,invullijst!$A$11:$M$196,3,FALSE))","v":"Besoijen"},{"$f":"IF(VLOOKUP($C13,invullijst!$A$11:$M$196,6,FALSE)=\"\",\"\",VLOOKUP($C13,invullijst!$A$11:$M$196,6,FALSE))","v":93},{"$f":"IF(VLOOKUP($C13,invullijst!$A$11:$M$196,7,FALSE)=\"\",\"\",VLOOKUP($C13,invullijst!$A$11:$M$196,7,FALSE))","v":96},{"$f":"IF(VLOOKUP($C13,invullijst!$A$11:$M$196,8,FALSE)=\"\",\"\",VLOOKUP($C13,invullijst!$A$11:$M$196,8,FALSE))","v":97},{"$f":"IF(VLOOKUP($C13,invullijst!$A$11:$M$196,9,FALSE)=\"\",\"\",VLOOKUP($C13,invullijst!$A$11:$M$196,9,FALSE))","v":"x"},{"$f":"IF(VLOOKUP($C13,invullijst!$A$11:$M$196,10,FALSE)=\"\",\"\",VLOOKUP($C13,invullijst!$A$11:$M$196,10,FALSE))","v":""},{"$f":"SUM(G13:K13)","v":286},{"$f":"IF(VLOOKUP($C13,invullijst!$A$11:$M$196,11,FALSE)=\"\",\"\",VLOOKUP($C13,invullijst!$A$11:$M$196,11,FALSE))","v":48}]
[null,10,220,{"$f":"IF(VLOOKUP($C14,invullijst!$A$11:$M202,4,FALSE)=\"\",\"\",VLOOKUP($C14,invullijst!$A$11:$M202,4,FALSE))","v":"65+"},{"$f":"IF(VLOOKUP($C14,invullijst!$A$11:$M202,2,FALSE)=\"\",\"\",VLOOKUP($C14,invullijst!$A$11:$M202,2,FALSE))","v":"Kees Vos"},{"$f":"IF(VLOOKUP($C14,invullijst!$A$11:$M$196,3,FALSE)=\"\",\"\",VLOOKUP($C14,invullijst!$A$11:$M$196,3,FALSE))","v":"Besoijen"},{"$f":"IF(VLOOKUP($C14,invullijst!$A$11:$M$196,6,FALSE)=\"\",\"\",VLOOKUP($C14,invullijst!$A$11:$M$196,6,FALSE))","v":88},{"$f":"IF(VLOOKUP($C14,invullijst!$A$11:$M$196,7,FALSE)=\"\",\"\",VLOOKUP($C14,invullijst!$A$11:$M$196,7,FALSE))","v":94},{"$f":"IF(VLOOKUP($C14,invullijst!$A$11:$M$196,8,FALSE)=\"\",\"\",VLOOKUP($C14,invullijst!$A$11:$M$196,8,FALSE))","v":93},{"$f":"IF(VLOOKUP($C14,invullijst!$A$11:$M$196,9,FALSE)=\"\",\"\",VLOOKUP($C14,invullijst!$A$11:$M$196,9,FALSE))","v":"x"},{"$f":"IF(VLOOKUP($C14,invullijst!$A$11:$M$196,10,FALSE)=\"\",\"\",VLOOKUP($C14,invullijst!$A$11:$M$196,10,FALSE))","v":""},{"$f":"SUM(G14:K14)","v":275},{"$f":"IF(VLOOKUP($C14,invullijst!$A$11:$M$196,11,FALSE)=\"\",\"\",VLOOKUP($C14,invullijst!$A$11:$M$196,11,FALSE))","v":48}]
[null,11,301,{"$f":"IF(VLOOKUP($C15,invullijst!$A$11:$M219,4,FALSE)=\"\",\"\",VLOOKUP($C15,invullijst!$A$11:$M219,4,FALSE))","v":"65+"},{"$f":"IF(VLOOKUP($C15,invullijst!$A$11:$M215,2,FALSE)=\"\",\"\",VLOOKUP($C15,invullijst!$A$11:$M215,2,FALSE))","v":"Arjen van Assem (disp)"},{"$f":"IF(VLOOKUP($C15,invullijst!$A$11:$M$196,3,FALSE)=\"\",\"\",VLOOKUP($C15,invullijst!$A$11:$M$196,3,FALSE))","v":"Elshout"},{"$f":"IF(VLOOKUP($C15,invullijst!$A$11:$M$196,6,FALSE)=\"\",\"\",VLOOKUP($C15,invullijst!$A$11:$M$196,6,FALSE))","v":"x"},{"$f":"IF(VLOOKUP($C15,invullijst!$A$11:$M$196,7,FALSE)=\"\",\"\",VLOOKUP($C15,invullijst!$A$11:$M$196,7,FALSE))","v":84},{"$f":"IF(VLOOKUP($C15,invullijst!$A$11:$M$196,8,FALSE)=\"\",\"\",VLOOKUP($C15,invullijst!$A$11:$M$196,8,FALSE))","v":88},{"$f":"IF(VLOOKUP($C15,invullijst!$A$11:$M$196,9,FALSE)=\"\",\"\",VLOOKUP($C15,invullijst!$A$11:$M$196,9,FALSE))","v":""},{"$f":"IF(VLOOKUP($C15,invullijst!$A$11:$M$196,10,FALSE)=\"\",\"\",VLOOKUP($C15,invullijst!$A$11:$M$196,10,FALSE))","v":""},{"$f":"SUM(G15:K15)","v":172},{"$f":"IF(VLOOKUP($C15,invullijst!$A$11:$M$196,11,FALSE)=\"\",\"\",VLOOKUP($C15,invullijst!$A$11:$M$196,11,FALSE))","v":""}]
[null,12,303,{"$f":"IF(VLOOKUP($C16,invullijst!$A$11:$M204,4,FALSE)=\"\",\"\",VLOOKUP($C16,invullijst!$A$11:$M204,4,FALSE))","v":"65+"},{"$f":"IF(VLOOKUP($C16,invullijst!$A$11:$M205,2,FALSE)=\"\",\"\",VLOOKUP($C16,invullijst!$A$11:$M205,2,FALSE))","v":"Hans van de Wiel"},{"$f":"IF(VLOOKUP($C16,invullijst!$A$11:$M$196,3,FALSE)=\"\",\"\",VLOOKUP($C16,invullijst!$A$11:$M$196,3,FALSE))","v":"Elshout"},{"$f":"IF(VLOOKUP($C16,invullijst!$A$11:$M$196,6,FALSE)=\"\",\"\",VLOOKUP($C16,invullijst!$A$11:$M$196,6,FALSE))","v":"x"},{"$f":"IF(VLOOKUP($C16,invullijst!$A$11:$M$196,7,FALSE)=\"\",\"\",VLOOKUP($C16,invullijst!$A$11:$M$196,7,FALSE))","v":96},{"$f":"IF(VLOOKUP($C16,invullijst!$A$11:$M$196,8,FALSE)=\"\",\"\",VLOOKUP($C16,invullijst!$A$11:$M$196,8,FALSE))","v":"x"},{"$f":"IF(VLOOKUP($C16,invullijst!$A$11:$M$196,9,FALSE)=\"\",\"\",VLOOKUP($C16,invullijst!$A$11:$M$196,9,FALSE))","v":""},{"$f":"IF(VLOOKUP($C16,invullijst!$A$11:$M$196,10,FALSE)=\"\",\"\",VLOOKUP($C16,invullijst!$A$11:$M$196,10,FALSE))","v":""},{"$f":"SUM(G16:K16)","v":96},{"$f":"IF(VLOOKUP($C16,invullijst!$A$11:$M$196,11,FALSE)=\"\",\"\",VLOOKUP($C16,invullijst!$A$11:$M$196,11,FALSE))","v":""}]
[null,13,307,{"$f":"IF(VLOOKUP($C17,invullijst!$A$11:$M206,4,FALSE)=\"\",\"\",VLOOKUP($C17,invullijst!$A$11:$M206,4,FALSE))","v":"65+"},{"$f":"IF(VLOOKUP($C17,invullijst!$A$11:$M196,2,FALSE)=\"\",\"\",VLOOKUP($C17,invullijst!$A$11:$M196,2,FALSE))","v":"Bert van Engelen"},{"$f":"IF(VLOOKUP($C17,invullijst!$A$11:$M$196,3,FALSE)=\"\",\"\",VLOOKUP($C17,invullijst!$A$11:$M$196,3,FALSE))","v":"Elshout"},{"$f":"IF(VLOOKUP($C17,invullijst!$A$11:$M$196,6,FALSE)=\"\",\"\",VLOOKUP($C17,invullijst!$A$11:$M$196,6,FALSE))","v":"x"},{"$f":"IF(VLOOKUP($C17,invullijst!$A$11:$M$196,7,FALSE)=\"\",\"\",VLOOKUP($C17,invullijst!$A$11:$M$196,7,FALSE))","v":93},{"$f":"IF(VLOOKUP($C17,invullijst!$A$11:$M$196,8,FALSE)=\"\",\"\",VLOOKUP($C17,invullijst!$A$11:$M$196,8,FALSE))","v":94},{"$f":"IF(VLOOKUP($C17,invullijst!$A$11:$M$196,9,FALSE)=\"\",\"\",VLOOKUP($C17,invullijst!$A$11:$M$196,9,FALSE))","v":""},{"$f":"IF(VLOOKUP($C17,invullijst!$A$11:$M$196,10,FALSE)=\"\",\"\",VLOOKUP($C17,invullijst!$A$11:$M$196,10,FALSE))","v":""},{"$f":"SUM(G17:K17)","v":187},{"$f":"IF(VLOOKUP($C17,invullijst!$A$11:$M$196,11,FALSE)=\"\",\"\",VLOOKUP($C17,invullijst!$A$11:$M$196,11,FALSE))","v":""}]
[null,14,309,{"$f":"IF(VLOOKUP($C18,invullijst!$A$11:$M224,4,FALSE)=\"\",\"\",VLOOKUP($C18,invullijst!$A$11:$M224,4,FALSE))","v":"65+"},{"$f":"IF(VLOOKUP($C18,invullijst!$A$11:$M220,2,FALSE)=\"\",\"\",VLOOKUP($C18,invullijst!$A$11:$M220,2,FALSE))","v":"René de Jong"},{"$f":"IF(VLOOKUP($C18,invullijst!$A$11:$M$196,3,FALSE)=\"\",\"\",VLOOKUP($C18,invullijst!$A$11:$M$196,3,FALSE))","v":"Elshout"},{"$f":"IF(VLOOKUP($C18,invullijst!$A$11:$M$196,6,FALSE)=\"\",\"\",VLOOKUP($C18,invullijst!$A$11:$M$196,6,FALSE))","v":"x"},{"$f":"IF(VLOOKUP($C18,invullijst!$A$11:$M$196,7,FALSE)=\"\",\"\",VLOOKUP($C18,invullijst!$A$11:$M$196,7,FALSE))","v":88},{"$f":"IF(VLOOKUP($C18,invullijst!$A$11:$M$196,8,FALSE)=\"\",\"\",VLOOKUP($C18,invullijst!$A$11:$M$196,8,FALSE))","v":"x"},{"$f":"IF(VLOOKUP($C18,invullijst!$A$11:$M$196,9,FALSE)=\"\",\"\",VLOOKUP($C18,invullijst!$A$11:$M$196,9,FALSE))","v":""},{"$f":"IF(VLOOKUP($C18,invullijst!$A$11:$M$196,10,FALSE)=\"\",\"\",VLOOKUP($C18,invullijst!$A$11:$M$196,10,FALSE))","v":""},{"$f":"SUM(G18:K18)","v":88},{"$f":"IF(VLOOKUP($C18,invullijst!$A$11:$M$196,11,FALSE)=\"\",\"\",VLOOKUP($C18,invullijst!$A$11:$M$196,11,FALSE))","v":""}]
[null,15,310,{"$f":"IF(VLOOKUP($C19,invullijst!$A$11:$M208,4,FALSE)=\"\",\"\",VLOOKUP($C19,invullijst!$A$11:$M208,4,FALSE))","v":"65+"},{"$f":"IF(VLOOKUP($C19,invullijst!$A$11:$M207,2,FALSE)=\"\",\"\",VLOOKUP($C19,invullijst!$A$11:$M207,2,FALSE))","v":"Tiny Boom"},{"$f":"IF(VLOOKUP($C19,invullijst!$A$11:$M$196,3,FALSE)=\"\",\"\",VLOOKUP($C19,invullijst!$A$11:$M$196,3,FALSE))","v":"Elshout"},{"$f":"IF(VLOOKUP($C19,invullijst!$A$11:$M$196,6,FALSE)=\"\",\"\",VLOOKUP($C19,invullijst!$A$11:$M$196,6,FALSE))","v":"x"},{"$f":"IF(VLOOKUP($C19,invullijst!$A$11:$M$196,7,FALSE)=\"\",\"\",VLOOKUP($C19,invullijst!$A$11:$M$196,7,FALSE))","v":92},{"$f":"IF(VLOOKUP($C19,invullijst!$A$11:$M$196,8,FALSE)=\"\",\"\",VLOOKUP($C19,invullijst!$A$11:$M$196,8,FALSE))","v":94},{"$f":"IF(VLOOKUP($C19,invullijst!$A$11:$M$196,9,FALSE)=\"\",\"\",VLOOKUP($C19,invullijst!$A$11:$M$196,9,FALSE))","v":""},{"$f":"IF(VLOOKUP($C19,invullijst!$A$11:$M$196,10,FALSE)=\"\",\"\",VLOOKUP($C19,invullijst!$A$11:$M$196,10,FALSE))","v":""},{"$f":"SUM(G19:K19)","v":186},{"$f":"IF(VLOOKUP($C19,invullijst!$A$11:$M$196,11,FALSE)=\"\",\"\",VLOOKUP($C19,invullijst!$A$11:$M$196,11,FALSE))","v":""}]
["B",1,401,{"$f":"IF(VLOOKUP($C20,invullijst!$A$11:$M211,4,FALSE)=\"\",\"\",VLOOKUP($C20,invullijst!$A$11:$M211,4,FALSE))","v":"65+"},{"$f":"IF(VLOOKUP($C20,invullijst!$A$11:$M211,2,FALSE)=\"\",\"\",VLOOKUP($C20,invullijst!$A$11:$M211,2,FALSE))","v":"Frans van Beurden"},{"$f":"IF(VLOOKUP($C20,invullijst!$A$11:$M$196,3,FALSE)=\"\",\"\",VLOOKUP($C20,invullijst!$A$11:$M$196,3,FALSE))","v":"Haarsteeg"},{"$f":"IF(VLOOKUP($C20,invullijst!$A$11:$M$196,6,FALSE)=\"\",\"\",VLOOKUP($C20,invullijst!$A$11:$M$196,6,FALSE))","v":96},{"$f":"IF(VLOOKUP($C20,invullijst!$A$11:$M$196,7,FALSE)=\"\",\"\",VLOOKUP($C20,invullijst!$A$11:$M$196,7,FALSE))","v":"x"},{"$f":"IF(VLOOKUP($C20,invullijst!$A$11:$M$196,8,FALSE)=\"\",\"\",VLOOKUP($C20,invullijst!$A$11:$M$196,8,FALSE))","v":96},{"$f":"IF(VLOOKUP($C20,invullijst!$A$11:$M$196,9,FALSE)=\"\",\"\",VLOOKUP($C20,invullijst!$A$11:$M$196,9,FALSE))","v":""},{"$f":"IF(VLOOKUP($C20,invullijst!$A$11:$M$196,10,FALSE)=\"\",\"\",VLOOKUP($C20,invullijst!$A$11:$M$196,10,FALSE))","v":""},{"$f":"SUM(G20:K20)","v":192},{"$f":"IF(VLOOKUP($C20,invullijst!$A$11:$M$196,11,FALSE)=\"\",\"\",VLOOKUP($C20,invullijst!$A$11:$M$196,11,FALSE))","v":""}]
[null,2,403,{"$f":"IF(VLOOKUP($C21,invullijst!$A$11:$M200,4,FALSE)=\"\",\"\",VLOOKUP($C21,invullijst!$A$11:$M200,4,FALSE))","v":"65+"},{"$f":"IF(VLOOKUP($C21,invullijst!$A$11:$M200,2,FALSE)=\"\",\"\",VLOOKUP($C21,invullijst!$A$11:$M200,2,FALSE))","v":"Dorien de Kort"},{"$f":"IF(VLOOKUP($C21,invullijst!$A$11:$M$196,3,FALSE)=\"\",\"\",VLOOKUP($C21,invullijst!$A$11:$M$196,3,FALSE))","v":"Haarsteeg"},{"$f":"IF(VLOOKUP($C21,invullijst!$A$11:$M$196,6,FALSE)=\"\",\"\",VLOOKUP($C21,invullijst!$A$11:$M$196,6,FALSE))","v":91},{"$f":"IF(VLOOKUP($C21,invullijst!$A$11:$M$196,7,FALSE)=\"\",\"\",VLOOKUP($C21,invullijst!$A$11:$M$196,7,FALSE))","v":"x"},{"$f":"IF(VLOOKUP($C21,invullijst!$A$11:$M$196,8,FALSE)=\"\",\"\",VLOOKUP($C21,invullijst!$A$11:$M$196,8,FALSE))","v":96},{"$f":"IF(VLOOKUP($C21,invullijst!$A$11:$M$196,9,FALSE)=\"\",\"\",VLOOKUP($C21,invullijst!$A$11:$M$196,9,FALSE))","v":""},{"$f":"IF(VLOOKUP($C21,invullijst!$A$11:$M$196,10,FALSE)=\"\",\"\",VLOOKUP($C21,invullijst!$A$11:$M$196,10,FALSE))","v":""},{"$f":"SUM(G21:K21)","v":187},{"$f":"IF(VLOOKUP($C21,invullijst!$A$11:$M$196,11,FALSE)=\"\",\"\",VLOOKUP($C21,invullijst!$A$11:$M$196,11,FALSE))","v":""}]
[null,3,404,{"$f":"IF(VLOOKUP($C22,invullijst!$A$11:$M212,4,FALSE)=\"\",\"\",VLOOKUP($C22,invullijst!$A$11:$M212,4,FALSE))","v":"65+"},{"$f":"IF(VLOOKUP($C22,invullijst!$A$11:$M206,2,FALSE)=\"\",\"\",VLOOKUP($C22,invullijst!$A$11:$M206,2,FALSE))","v":"Gerard van Beurden"},{"$f":"IF(VLOOKUP($C22,invullijst!$A$11:$M$196,3,FALSE)=\"\",\"\",VLOOKUP($C22,invullijst!$A$11:$M$196,3,FALSE))","v":"Haarsteeg"},{"$f":"IF(VLOOKUP($C22,invullijst!$A$11:$M$196,6,FALSE)=\"\",\"\",VLOOKUP($C22,invullijst!$A$11:$M$196,6,FALSE))","v":92},{"$f":"IF(VLOOKUP($C22,invullijst!$A$11:$M$196,7,FALSE)=\"\",\"\",VLOOKUP($C22,invullijst!$A$11:$M$196,7,FALSE))","v":"x"},{"$f":"IF(VLOOKUP($C22,invullijst!$A$11:$M$196,8,FALSE)=\"\",\"\",VLOOKUP($C22,invullijst!$A$11:$M$196,8,FALSE))","v":98},{"$f":"IF(VLOOKUP($C22,invullijst!$A$11:$M$196,9,FALSE)=\"\",\"\",VLOOKUP($C22,invullijst!$A$11:$M$196,9,FALSE))","v":""},{"$f":"IF(VLOOKUP($C22,invullijst!$A$11:$M$196,10,FALSE)=\"\",\"\",VLOOKUP($C22,invullijst!$A$11:$M$196,10,FALSE))","v":""},{"$f":"SUM(G22:K22)","v":190},{"$f":"IF(VLOOKUP($C22,invullijst!$A$11:$M$196,11,FALSE)=\"\",\"\",VLOOKUP($C22,invullijst!$A$11:$M$196,11,FALSE))","v":""}]
[null,4,405,{"$f":"IF(VLOOKUP($C23,invullijst!$A$11:$M225,4,FALSE)=\"\",\"\",VLOOKUP($C23,invullijst!$A$11:$M225,4,FALSE))","v":"65+"},{"$f":"IF(VLOOKUP($C23,invullijst!$A$11:$M221,2,FALSE)=\"\",\"\",VLOOKUP($C23,invullijst!$A$11:$M221,2,FALSE))","v":"Jan de Vaan"},{"$f":"IF(VLOOKUP($C23,invullijst!$A$11:$M$196,3,FALSE)=\"\",\"\",VLOOKUP($C23,invullijst!$A$11:$M$196,3,FALSE))","v":"Haarsteeg"},{"$f":"IF(VLOOKUP($C23,invullijst!$A$11:$M$196,6,FALSE)=\"\",\"\",VLOOKUP($C23,invullijst!$A$11:$M$196,6,FALSE))","v":95},{"$f":"IF(VLOOKUP($C23,invullijst!$A$11:$M$196,7,FALSE)=\"\",\"\",VLOOKUP($C23,invullijst!$A$11:$M$196,7,FALSE))","v":"x"},{"$f":"IF(VLOOKUP($C23,invullijst!$A$11:$M$196,8,FALSE)=\"\",\"\",VLOOKUP($C23,invullijst!$A$11:$M$196,8,FALSE))","v":96},{"$f":"IF(VLOOKUP($C23,invullijst!$A$11:$M$196,9,FALSE)=\"\",\"\",VLOOKUP($C23,invullijst!$A$11:$M$196,9,FALSE))","v":""},{"$f":"IF(VLOOKUP($C23,invullijst!$A$11:$M$196,10,FALSE)=\"\",\"\",VLOOKUP($C23,invullijst!$A$11:$M$196,10,FALSE))","v":""},{"$f":"SUM(G23:K23)","v":191},{"$f":"IF(VLOOKUP($C23,invullijst!$A$11:$M$196,11,FALSE)=\"\",\"\",VLOOKUP($C23,invullijst!$A$11:$M$196,11,FALSE))","v":""}]
[null,5,412,{"$f":"IF(VLOOKUP($C24,invullijst!$A$11:$M216,4,FALSE)=\"\",\"\",VLOOKUP($C24,invullijst!$A$11:$M216,4,FALSE))","v":"65+"},{"$f":"IF(VLOOKUP($C24,invullijst!$A$11:$M210,2,FALSE)=\"\",\"\",VLOOKUP($C24,invullijst!$A$11:$M210,2,FALSE))","v":"Francien v/d Wiel"},{"$f":"IF(VLOOKUP($C24,invullijst!$A$11:$M$196,3,FALSE)=\"\",\"\",VLOOKUP($C24,invullijst!$A$11:$M$196,3,FALSE))","v":"Haarsteeg"},{"$f":"IF(VLOOKUP($C24,invullijst!$A$11:$M$196,6,FALSE)=\"\",\"\",VLOOKUP($C24,invullijst!$A$11:$M$196,6,FALSE))","v":87},{"$f":"IF(VLOOKUP($C24,invullijst!$A$11:$M$196,7,FALSE)=\"\",\"\",VLOOKUP($C24,invullijst!$A$11:$M$196,7,FALSE))","v":"x"},{"$f":"IF(VLOOKUP($C24,invullijst!$A$11:$M$196,8,FALSE)=\"\",\"\",VLOOKUP($C24,invullijst!$A$11:$M$196,8,FALSE))","v":95},{"$f":"IF(VLOOKUP($C24,invullijst!$A$11:$M$196,9,FALSE)=\"\",\"\",VLOOKUP($C24,invullijst!$A$11:$M$196,9,FALSE))","v":""},{"$f":"IF(VLOOKUP($C24,invullijst!$A$11:$M$196,10,FALSE)=\"\",\"\",VLOOKUP($C24,invullijst!$A$11:$M$196,10,FALSE))","v":""},{"$f":"SUM(G24:K24)","v":182},{"$f":"IF(VLOOKUP($C24,invullijst!$A$11:$M$196,11,FALSE)=\"\",\"\",VLOOKUP($C24,invullijst!$A$11:$M$196,11,FALSE))","v":""}]
[null,6,413,{"$f":"IF(VLOOKUP($C25,invullijst!$A$11:$M201,4,FALSE)=\"\",\"\",VLOOKUP($C25,invullijst!$A$11:$M201,4,FALSE))","v":"65+"},{"$f":"IF(VLOOKUP($C25,invullijst!$A$11:$M212,2,FALSE)=\"\",\"\",VLOOKUP($C25,invullijst!$A$11:$M212,2,FALSE))","v":"Frans Mommersteeg"},{"$f":"IF(VLOOKUP($C25,invullijst!$A$11:$M$196,3,FALSE)=\"\",\"\",VLOOKUP($C25,invullijst!$A$11:$M$196,3,FALSE))","v":"Haarsteeg"},{"$f":"IF(VLOOKUP($C25,invullijst!$A$11:$M$196,6,FALSE)=\"\",\"\",VLOOKUP($C25,invullijst!$A$11:$M$196,6,FALSE))","v":93},{"$f":"IF(VLOOKUP($C25,invullijst!$A$11:$M$196,7,FALSE)=\"\",\"\",VLOOKUP($C25,invullijst!$A$11:$M$196,7,FALSE))","v":"x"},{"$f":"IF(VLOOKUP($C25,invullijst!$A$11:$M$196,8,FALSE)=\"\",\"\",VLOOKUP($C25,invullijst!$A$11:$M$196,8,FALSE))","v":97},{"$f":"IF(VLOOKUP($C25,invullijst!$A$11:$M$196,9,FALSE)=\"\",\"\",VLOOKUP($C25,invullijst!$A$11:$M$196,9,FALSE))","v":""},{"$f":"IF(VLOOKUP($C25,invullijst!$A$11:$M$196,10,FALSE)=\"\",\"\",VLOOKUP($C25,invullijst!$A$11:$M$196,10,FALSE))","v":""},{"$f":"SUM(G25:K25)","v":190},{"$f":"IF(VLOOKUP($C25,invullijst!$A$11:$M$196,11,FALSE)=\"\",\"\",VLOOKUP($C25,invullijst!$A$11:$M$196,11,FALSE))","v":""}]
[null,7,414,{"$f":"IF(VLOOKUP($C26,invullijst!$A$11:$M197,4,FALSE)=\"\",\"\",VLOOKUP($C26,invullijst!$A$11:$M197,4,FALSE))","v":"65+"},{"$f":"IF(VLOOKUP($C26,invullijst!$A$11:$M198,2,FALSE)=\"\",\"\",VLOOKUP($C26,invullijst!$A$11:$M198,2,FALSE))","v":"Alex Hus"},{"$f":"IF(VLOOKUP($C26,invullijst!$A$11:$M$196,3,FALSE)=\"\",\"\",VLOOKUP($C26,invullijst!$A$11:$M$196,3,FALSE))","v":"Haarsteeg"},{"$f":"IF(VLOOKUP($C26,invullijst!$A$11:$M$196,6,FALSE)=\"\",\"\",VLOOKUP($C26,invullijst!$A$11:$M$196,6,FALSE))","v":73},{"$f":"IF(VLOOKUP($C26,invullijst!$A$11:$M$196,7,FALSE)=\"\",\"\",VLOOKUP($C26,invullijst!$A$11:$M$196,7,FALSE))","v":"x"},{"$f":"IF(VLOOKUP($C26,invullijst!$A$11:$M$196,8,FALSE)=\"\",\"\",VLOOKUP($C26,invullijst!$A$11:$M$196,8,FALSE))","v":90},{"$f":"IF(VLOOKUP($C26,invullijst!$A$11:$M$196,9,FALSE)=\"\",\"\",VLOOKUP($C26,invullijst!$A$11:$M$196,9,FALSE))","v":""},{"$f":"IF(VLOOKUP($C26,invullijst!$A$11:$M$196,10,FALSE)=\"\",\"\",VLOOKUP($C26,invullijst!$A$11:$M$196,10,FALSE))","v":""},{"$f":"SUM(G26:K26)","v":163},{"$f":"IF(VLOOKUP($C26,invullijst!$A$11:$M$196,11,FALSE)=\"\",\"\",VLOOKUP($C26,invullijst!$A$11:$M$196,11,FALSE))","v":""}]
[null,8,415,{"$f":"IF(VLOOKUP($C27,invullijst!$A$11:$M199,4,FALSE)=\"\",\"\",VLOOKUP($C27,invullijst!$A$11:$M199,4,FALSE))","v":"65+"},{"$f":"IF(VLOOKUP($C27,invullijst!$A$11:$M201,2,FALSE)=\"\",\"\",VLOOKUP($C27,invullijst!$A$11:$M201,2,FALSE))","v":"Wim de Gouw"},{"$f":"IF(VLOOKUP($C27,invullijst!$A$11:$M$196,3,FALSE)=\"\",\"\",VLOOKUP($C27,invullijst!$A$11:$M$196,3,FALSE))","v":"Haarsteeg"},{"$f":"IF(VLOOKUP($C27,invullijst!$A$11:$M$196,6,FALSE)=\"\",\"\",VLOOKUP($C27,invullijst!$A$11:$M$196,6,FALSE))","v":96},{"$f":"IF(VLOOKUP($C27,invullijst!$A$11:$M$196,7,FALSE)=\"\",\"\",VLOOKUP($C27,invullijst!$A$11:$M$196,7,FALSE))","v":"x"},{"$f":"IF(VLOOKUP($C27,invullijst!$A$11:$M$196,8,FALSE)=\"\",\"\",VLOOKUP($C27,invullijst!$A$11:$M$196,8,FALSE))","v":97},{"$f":"IF(VLOOKUP($C27,invullijst!$A$11:$M$196,9,FALSE)=\"\",\"\",VLOOKUP($C27,invullijst!$A$11:$M$196,9,FALSE))","v":""},{"$f":"IF(VLOOKUP($C27,invullijst!$A$11:$M$196,10,FALSE)=\"\",\"\",VLOOKUP($C27,invullijst!$A$11:$M$196,10,FALSE))","v":""},{"$f":"SUM(G27:K27)","v":193},{"$f":"IF(VLOOKUP($C27,invullijst!$A$11:$M$196,11,FALSE)=\"\",\"\",VLOOKUP($C27,invullijst!$A$11:$M$196,11,FALSE))","v":""}]
[null,9,503,{"$f":"IF(VLOOKUP($C28,invullijst!$A$11:$M198,4,FALSE)=\"\",\"\",VLOOKUP($C28,invullijst!$A$11:$M198,4,FALSE))","v":"65+"},{"$f":"IF(VLOOKUP($C28,invullijst!$A$11:$M199,2,FALSE)=\"\",\"\",VLOOKUP($C28,invullijst!$A$11:$M199,2,FALSE))","v":"Kees Vos (disp)"},{"$f":"IF(VLOOKUP($C28,invullijst!$A$11:$M$196,3,FALSE)=\"\",\"\",VLOOKUP($C28,invullijst!$A$11:$M$196,3,FALSE))","v":"Kaatsheuvel"},{"$f":"IF(VLOOKUP($C28,invullijst!$A$11:$M$196,6,FALSE)=\"\",\"\",VLOOKUP($C28,invullijst!$A$11:$M$196,6,FALSE))","v":87},{"$f":"IF(VLOOKUP($C28,invullijst!$A$11:$M$196,7,FALSE)=\"\",\"\",VLOOKUP($C28,invullijst!$A$11:$M$196,7,FALSE))","v":82},{"$f":"IF(VLOOKUP($C28,invullijst!$A$11:$M$196,8,FALSE)=\"\",\"\",VLOOKUP($C28,invullijst!$A$11:$M$196,8,FALSE))","v":"x"},{"$f":"IF(VLOOKUP($C28,invullijst!$A$11:$M$196,9,FALSE)=\"\",\"\",VLOOKUP($C28,invullijst!$A$11:$M$196,9,FALSE))","v":""},{"$f":"IF(VLOOKUP($C28,invullijst!$A$11:$M$196,10,FALSE)=\"\",\"\",VLOOKUP($C28,invullijst!$A$11:$M$196,10,FALSE))","v":""},{"$f":"SUM(G28:K28)","v":169},{"$f":"IF(VLOOKUP($C28,invullijst!$A$11:$M$196,11,FALSE)=\"\",\"\",VLOOKUP($C28,invullijst!$A$11:$M$196,11,FALSE))","v":""}]
[null,10,509,{"$f":"IF(VLOOKUP($C29,invullijst!$A$11:$M210,4,FALSE)=\"\",\"\",VLOOKUP($C29,invullijst!$A$11:$M210,4,FALSE))","v":"65+"},{"$f":"IF(VLOOKUP($C29,invullijst!$A$11:$M211,2,FALSE)=\"\",\"\",VLOOKUP($C29,invullijst!$A$11:$M211,2,FALSE))","v":"Adwan de Pinth"},{"$f":"IF(VLOOKUP($C29,invullijst!$A$11:$M$196,3,FALSE)=\"\",\"\",VLOOKUP($C29,invullijst!$A$11:$M$196,3,FALSE))","v":"Kaatsheuvel"},{"$f":"IF(VLOOKUP($C29,invullijst!$A$11:$M$196,6,FALSE)=\"\",\"\",VLOOKUP($C29,invullijst!$A$11:$M$196,6,FALSE))","v":96},{"$f":"IF(VLOOKUP($C29,invullijst!$A$11:$M$196,7,FALSE)=\"\",\"\",VLOOKUP($C29,invullijst!$A$11:$M$196,7,FALSE))","v":96},{"$f":"IF(VLOOKUP($C29,invullijst!$A$11:$M$196,8,FALSE)=\"\",\"\",VLOOKUP($C29,invullijst!$A$11:$M$196,8,FALSE))","v":"x"},{"$f":"IF(VLOOKUP($C29,invullijst!$A$11:$M$196,9,FALSE)=\"\",\"\",VLOOKUP($C29,invullijst!$A$11:$M$196,9,FALSE))","v":""},{"$f":"IF(VLOOKUP($C29,invullijst!$A$11:$M$196,10,FALSE)=\"\",\"\",VLOOKUP($C29,invullijst!$A$11:$M$196,10,FALSE))","v":""},{"$f":"SUM(G29:K29)","v":192},{"$f":"IF(VLOOKUP($C29,invullijst!$A$11:$M$196,11,FALSE)=\"\",\"\",VLOOKUP($C29,invullijst!$A$11:$M$196,11,FALSE))","v":""}]
[null,11,515,{"$f":"IF(VLOOKUP($C30,invullijst!$A$11:$M220,4,FALSE)=\"\",\"\",VLOOKUP($C30,invullijst!$A$11:$M220,4,FALSE))","v":"65+"},{"$f":"IF(VLOOKUP($C30,invullijst!$A$11:$M216,2,FALSE)=\"\",\"\",VLOOKUP($C30,invullijst!$A$11:$M216,2,FALSE))","v":"Ilona Bergakker (disp)"},{"$f":"IF(VLOOKUP($C30,invullijst!$A$11:$M$196,3,FALSE)=\"\",\"\",VLOOKUP($C30,invullijst!$A$11:$M$196,3,FALSE))","v":"Kaatsheuvel"},{"$f":"IF(VLOOKUP($C30,invullijst!$A$11:$M$196,6,FALSE)=\"\",\"\",VLOOKUP($C30,invullijst!$A$11:$M$196,6,FALSE))","v":89},{"$f":"IF(VLOOKUP($C30,invullijst!$A$11:$M$196,7,FALSE)=\"\",\"\",VLOOKUP($C30,invullijst!$A$11:$M$196,7,FALSE))","v":87},{"$f":"IF(VLOOKUP($C30,invullijst!$A$11:$M$196,8,FALSE)=\"\",\"\",VLOOKUP($C30,invullijst!$A$11:$M$196,8,FALSE))","v":"x"},{"$f":"IF(VLOOKUP($C30,invullijst!$A$11:$M$196,9,FALSE)=\"\",\"\",VLOOKUP($C30,invullijst!$A$11:$M$196,9,FALSE))","v":""},{"$f":"IF(VLOOKUP($C30,invullijst!$A$11:$M$196,10,FALSE)=\"\",\"\",VLOOKUP($C30,invullijst!$A$11:$M$196,10,FALSE))","v":""},{"$f":"SUM(G30:K30)","v":176},{"$f":"IF(VLOOKUP($C30,invullijst!$A$11:$M$196,11,FALSE)=\"\",\"\",VLOOKUP($C30,invullijst!$A$11:$M$196,11,FALSE))","v":""}]
[null,12,516,{"$f":"IF(VLOOKUP($C31,invullijst!$A$11:$M221,4,FALSE)=\"\",\"\",VLOOKUP($C31,invullijst!$A$11:$M221,4,FALSE))","v":"65+"},{"$f":"IF(VLOOKUP($C31,invullijst!$A$11:$M217,2,FALSE)=\"\",\"\",VLOOKUP($C31,invullijst!$A$11:$M217,2,FALSE))","v":"Henry Bergakker (disp)"},{"$f":"IF(VLOOKUP($C31,invullijst!$A$11:$M$196,3,FALSE)=\"\",\"\",VLOOKUP($C31,invullijst!$A$11:$M$196,3,FALSE))","v":"Kaatsheuvel"},{"$f":"IF(VLOOKUP($C31,invullijst!$A$11:$M$196,6,FALSE)=\"\",\"\",VLOOKUP($C31,invullijst!$A$11:$M$196,6,FALSE))","v":93},{"$f":"IF(VLOOKUP($C31,invullijst!$A$11:$M$196,7,FALSE)=\"\",\"\",VLOOKUP($C31,invullijst!$A$11:$M$196,7,FALSE))","v":81},{"$f":"IF(VLOOKUP($C31,invullijst!$A$11:$M$196,8,FALSE)=\"\",\"\",VLOOKUP($C31,invullijst!$A$11:$M$196,8,FALSE))","v":"x"},{"$f":"IF(VLOOKUP($C31,invullijst!$A$11:$M$196,9,FALSE)=\"\",\"\",VLOOKUP($C31,invullijst!$A$11:$M$196,9,FALSE))","v":""},{"$f":"IF(VLOOKUP($C31,invullijst!$A$11:$M$196,10,FALSE)=\"\",\"\",VLOOKUP($C31,invullijst!$A$11:$M$196,10,FALSE))","v":""},{"$f":"SUM(G31:K31)","v":174},{"$f":"IF(VLOOKUP($C31,invullijst!$A$11:$M$196,11,FALSE)=\"\",\"\",VLOOKUP($C31,invullijst!$A$11:$M$196,11,FALSE))","v":""}]
[null,13,517,{"$f":"IF(VLOOKUP($C32,invullijst!$A$11:$M222,4,FALSE)=\"\",\"\",VLOOKUP($C32,invullijst!$A$11:$M222,4,FALSE))","v":"65+"},{"$f":"IF(VLOOKUP($C32,invullijst!$A$11:$M218,2,FALSE)=\"\",\"\",VLOOKUP($C32,invullijst!$A$11:$M218,2,FALSE))","v":"Diny Vos (disp)"},{"$f":"IF(VLOOKUP($C32,invullijst!$A$11:$M$196,3,FALSE)=\"\",\"\",VLOOKUP($C32,invullijst!$A$11:$M$196,3,FALSE))","v":"Kaatsheuvel"},{"$f":"IF(VLOOKUP($C32,invullijst!$A$11:$M$196,6,FALSE)=\"\",\"\",VLOOKUP($C32,invullijst!$A$11:$M$196,6,FALSE))","v":90},{"$f":"IF(VLOOKUP($C32,invullijst!$A$11:$M$196,7,FALSE)=\"\",\"\",VLOOKUP($C32,invullijst!$A$11:$M$196,7,FALSE))","v":95},{"$f":"IF(VLOOKUP($C32,invullijst!$A$11:$M$196,8,FALSE)=\"\",\"\",VLOOKUP($C32,invullijst!$A$11:$M$196,8,FALSE))","v":"x"},{"$f":"IF(VLOOKUP($C32,invullijst!$A$11:$M$196,9,FALSE)=\"\",\"\",VLOOKUP($C32,invullijst!$A$11:$M$196,9,FALSE))","v":""},{"$f":"IF(VLOOKUP($C32,invullijst!$A$11:$M$196,10,FALSE)=\"\",\"\",VLOOKUP($C32,invullijst!$A$11:$M$196,10,FALSE))","v":""},{"$f":"SUM(G32:K32)","v":185},{"$f":"IF(VLOOKUP($C32,invullijst!$A$11:$M$196,11,FALSE)=\"\",\"\",VLOOKUP($C32,invullijst!$A$11:$M$196,11,FALSE))","v":""}]
[null,14,518,{"$f":"IF(VLOOKUP($C33,invullijst!$A$11:$M223,4,FALSE)=\"\",\"\",VLOOKUP($C33,invullijst!$A$11:$M223,4,FALSE))","v":"65+"},{"$f":"IF(VLOOKUP($C33,invullijst!$A$11:$M219,2,FALSE)=\"\",\"\",VLOOKUP($C33,invullijst!$A$11:$M219,2,FALSE))","v":"Ton Stanz"},{"$f":"IF(VLOOKUP($C33,invullijst!$A$11:$M$196,3,FALSE)=\"\",\"\",VLOOKUP($C33,invullijst!$A$11:$M$196,3,FALSE))","v":"Kaatsheuvel"},{"$f":"IF(VLOOKUP($C33,invullijst!$A$11:$M$196,6,FALSE)=\"\",\"\",VLOOKUP($C33,invullijst!$A$11:$M$196,6,FALSE))","v":80},{"$f":"IF(VLOOKUP($C33,invullijst!$A$11:$M$196,7,FALSE)=\"\",\"\",VLOOKUP($C33,invullijst!$A$11:$M$196,7,FALSE))","v":88},{"$f":"IF(VLOOKUP($C33,invullijst!$A$11:$M$196,8,FALSE)=\"\",\"\",VLOOKUP($C33,invullijst!$A$11:$M$196,8,FALSE))","v":"x"},{"$f":"IF(VLOOKUP($C33,invullijst!$A$11:$M$196,9,FALSE)=\"\",\"\",VLOOKUP($C33,invullijst!$A$11:$M$196,9,FALSE))","v":""},{"$f":"IF(VLOOKUP($C33,invullijst!$A$11:$M$196,10,FALSE)=\"\",\"\",VLOOKUP($C33,invullijst!$A$11:$M$196,10,FALSE))","v":""},{"$f":"SUM(G33:K33)","v":168},{"$f":"IF(VLOOKUP($C33,invullijst!$A$11:$M$196,11,FALSE)=\"\",\"\",VLOOKUP($C33,invullijst!$A$11:$M$196,11,FALSE))","v":""}]
[{"$nulls":3},{"$f":"IF(VLOOKUP($C34,invullijst!$A$11:$M226,4,FALSE)=\"\",\"\",VLOOKUP($C34,invullijst!$A$11:$M226,4,FALSE))","v":0},{"$f":"IF(VLOOKUP($C34,invullijst!$A$11:$M222,2,FALSE)=\"\",\"\",VLOOKUP($C34,invullijst!$A$11:$M222,2,FALSE))","v":0},{"$f":"IF(VLOOKUP($C34,invullijst!$A$11:$M$196,3,FALSE)=\"\",\"\",VLOOKUP($C34,invullijst!$A$11:$M$196,3,FALSE))","v":0},{"$f":"IF(VLOOKUP($C34,invullijst!$A$11:$M$196,6,FALSE)=\"\",\"\",VLOOKUP($C34,invullijst!$A$11:$M$196,6,FALSE))","v":0},{"$f":"IF(VLOOKUP($C34,invullijst!$A$11:$M$196,7,FALSE)=\"\",\"\",VLOOKUP($C34,invullijst!$A$11:$M$196,7,FALSE))","v":0},{"$f":"IF(VLOOKUP($C34,invullijst!$A$11:$M$196,8,FALSE)=\"\",\"\",VLOOKUP($C34,invullijst!$A$11:$M$196,8,FALSE))","v":0},{"$f":"IF(VLOOKUP($C34,invullijst!$A$11:$M$196,9,FALSE)=\"\",\"\",VLOOKUP($C34,invullijst!$A$11:$M$196,9,FALSE))","v":0},{"$f":"IF(VLOOKUP($C34,invullijst!$A$11:$M$196,10,FALSE)=\"\",\"\",VLOOKUP($C34,invullijst!$A$11:$M$196,10,FALSE))","v":0},{"$f":"SUM(G34:K34)","v":0},{"$f":"IF(VLOOKUP($C34,invullijst!$A$11:$M$196,11,FALSE)=\"\",\"\",VLOOKUP($C34,invullijst!$A$11:$M$196,11,FALSE))","v":0}]
[{"$nulls":3},{"$f":"IF(VLOOKUP($C35,invullijst!$A$11:$M227,4,FALSE)=\"\",\"\",VLOOKUP($C35,invullijst!$A$11:$M227,4,FALSE))","v":0},{"$f":"IF(VLOOKUP($C35,invullijst!$A$11:$M223,2,FALSE)=\"\",\"\",VLOOKUP($C35,invullijst!$A$11:$M223,2,FALSE))","v":0},{"$f":"IF(VLOOKUP($C35,invullijst!$A$11:$M$196,3,FALSE)=\"\",\"\",VLOOKUP($C35,invullijst!$A$11:$M$196,3,FALSE))","v":0},{"$f":"IF(VLOOKUP($C35,invullijst!$A$11:$M$196,6,FALSE)=\"\",\"\",VLOOKUP($C35,invullijst!$A$11:$M$196,6,FALSE))","v":0},{"$f":"IF(VLOOKUP($C35,invullijst!$A$11:$M$196,7,FALSE)=\"\",\"\",VLOOKUP($C35,invullijst!$A$11:$M$196,7,FALSE))","v":0},{"$f":"IF(VLOOKUP($C35,invullijst!$A$11:$M$196,8,FALSE)=\"\",\"\",VLOOKUP($C35,invullijst!$A$11:$M$196,8,FALSE))","v":0},{"$f":"IF(VLOOKUP($C35,invullijst!$A$11:$M$196,9,FALSE)=\"\",\"\",VLOOKUP($C35,invullijst!$A$11:$M$196,9,FALSE))","v":0},{"$f":"IF(VLOOKUP($C35,invullijst!$A$11:$M$196,10,FALSE)=\"\",\"\",VLOOKUP($C35,invullijst!$A$11:$M$196,10,FALSE))","v":0},{"$f":"SUM(G35:K35)","v":0},{"$f":"IF(VLOOKUP($C35,invullijst!$A$11:$M$196,11,FALSE)=\"\",\"\",VLOOKUP($C35,invullijst!$A$11:$M$196,11,FALSE))","v":0}]
[{"$nulls":3},{"$f":"IF(VLOOKUP($C36,invullijst!$A$11:$M228,4,FALSE)=\"\",\"\",VLOOKUP($C36,invullijst!$A$11:$M228,4,FALSE))","v":0},{"$f":"IF(VLOOKUP($C36,invullijst!$A$11:$M224,2,FALSE)=\"\",\"\",VLOOKUP($C36,invullijst!$A$11:$M224,2,FALSE))","v":0},{"$f":"IF(VLOOKUP($C36,invullijst!$A$11:$M$196,3,FALSE)=\"\",\"\",VLOOKUP($C36,invullijst!$A$11:$M$196,3,FALSE))","v":0},{"$f":"IF(VLOOKUP($C36,invullijst!$A$11:$M$196,6,FALSE)=\"\",\"\",VLOOKUP($C36,invullijst!$A$11:$M$196,6,FALSE))","v":0},{"$f":"IF(VLOOKUP($C36,invullijst!$A$11:$M$196,7,FALSE)=\"\",\"\",VLOOKUP($C36,invullijst!$A$11:$M$196,7,FALSE))","v":0},{"$f":"IF(VLOOKUP($C36,invullijst!$A$11:$M$196,8,FALSE)=\"\",\"\",VLOOKUP($C36,invullijst!$A$11:$M$196,8,FALSE))","v":0},{"$f":"IF(VLOOKUP($C36,invullijst!$A$11:$M$196,9,FALSE)=\"\",\"\",VLOOKUP($C36,invullijst!$A$11:$M$196,9,FALSE))","v":0},{"$f":"IF(VLOOKUP($C36,invullijst!$A$11:$M$196,10,FALSE)=\"\",\"\",VLOOKUP($C36,invullijst!$A$11:$M$196,10,FALSE))","v":0},{"$f":"SUM(G36:K36)","v":0},{"$f":"IF(VLOOKUP($C36,invullijst!$A$11:$M$196,11,FALSE)=\"\",\"\",VLOOKUP($C36,invullijst!$A$11:$M$196,11,FALSE))","v":0}]
[{"$nulls":3},{"$f":"IF(VLOOKUP($C37,invullijst!$A$11:$M229,4,FALSE)=\"\",\"\",VLOOKUP($C37,invullijst!$A$11:$M229,4,FALSE))","v":0},{"$f":"IF(VLOOKUP($C37,invullijst!$A$11:$M225,2,FALSE)=\"\",\"\",VLOOKUP($C37,invullijst!$A$11:$M225,2,FALSE))","v":0},{"$f":"IF(VLOOKUP($C37,invullijst!$A$11:$M$196,3,FALSE)=\"\",\"\",VLOOKUP($C37,invullijst!$A$11:$M$196,3,FALSE))","v":0},{"$f":"IF(VLOOKUP($C37,invullijst!$A$11:$M$196,6,FALSE)=\"\",\"\",VLOOKUP($C37,invullijst!$A$11:$M$196,6,FALSE))","v":0},{"$f":"IF(VLOOKUP($C37,invullijst!$A$11:$M$196,7,FALSE)=\"\",\"\",VLOOKUP($C37,invullijst!$A$11:$M$196,7,FALSE))","v":0},{"$f":"IF(VLOOKUP($C37,invullijst!$A$11:$M$196,8,FALSE)=\"\",\"\",VLOOKUP($C37,invullijst!$A$11:$M$196,8,FALSE))","v":0},{"$f":"IF(VLOOKUP($C37,invullijst!$A$11:$M$196,9,FALSE)=\"\",\"\",VLOOKUP($C37,invullijst!$A$11:$M$196,9,FALSE))","v":0},{"$f":"IF(VLOOKUP($C37,invullijst!$A$11:$M$196,10,FALSE)=\"\",\"\",VLOOKUP($C37,invullijst!$A$11:$M$196,10,FALSE))","v":0},{"$f":"SUM(G37:K37)","v":0},{"$f":"IF(VLOOKUP($C37,invullijst!$A$11:$M$196,11,FALSE)=\"\",\"\",VLOOKUP($C37,invullijst!$A$11:$M$196,11,FALSE))","v":0}]
[{"$nulls":3},{"$f":"IF(VLOOKUP($C38,invullijst!$A$11:$M230,4,FALSE)=\"\",\"\",VLOOKUP($C38,invullijst!$A$11:$M230,4,FALSE))","v":0},{"$f":"IF(VLOOKUP($C38,invullijst!$A$11:$M226,2,FALSE)=\"\",\"\",VLOOKUP($C38,invullijst!$A$11:$M226,2,FALSE))","v":0},{"$f":"IF(VLOOKUP($C38,invullijst!$A$11:$M$196,3,FALSE)=\"\",\"\",VLOOKUP($C38,invullijst!$A$11:$M$196,3,FALSE))","v":0},{"$f":"IF(VLOOKUP($C38,invullijst!$A$11:$M$196,6,FALSE)=\"\",\"\",VLOOKUP($C38,invullijst!$A$11:$M$196,6,FALSE))","v":0},{"$f":"IF(VLOOKUP($C38,invullijst!$A$11:$M$196,7,FALSE)=\"\",\"\",VLOOKUP($C38,invullijst!$A$11:$M$196,7,FALSE))","v":0},{"$f":"IF(VLOOKUP($C38,invullijst!$A$11:$M$196,8,FALSE)=\"\",\"\",VLOOKUP($C38,invullijst!$A$11:$M$196,8,FALSE))","v":0},{"$f":"IF(VLOOKUP($C38,invullijst!$A$11:$M$196,9,FALSE)=\"\",\"\",VLOOKUP($C38,invullijst!$A$11:$M$196,9,FALSE))","v":0},{"$f":"IF(VLOOKUP($C38,invullijst!$A$11:$M$196,10,FALSE)=\"\",\"\",VLOOKUP($C38,invullijst!$A$11:$M$196,10,FALSE))","v":0},{"$f":"SUM(G38:K38)","v":0},{"$f":"IF(VLOOKUP($C38,invullijst!$A$11:$M$196,11,FALSE)=\"\",\"\",VLOOKUP($C38,invullijst!$A$11:$M$196,11,FALSE))","v":0}]
[{"$nulls":3},{"$f":"IF(VLOOKUP($C39,invullijst!$A$11:$M231,4,FALSE)=\"\",\"\",VLOOKUP($C39,invullijst!$A$11:$M231,4,FALSE))","v":0},{"$f":"IF(VLOOKUP($C39,invullijst!$A$11:$M227,2,FALSE)=\"\",\"\",VLOOKUP($C39,invullijst!$A$11:$M227,2,FALSE))","v":0},{"$f":"IF(VLOOKUP($C39,invullijst!$A$11:$M$196,3,FALSE)=\"\",\"\",VLOOKUP($C39,invullijst!$A$11:$M$196,3,FALSE))","v":0},{"$f":"IF(VLOOKUP($C39,invullijst!$A$11:$M$196,6,FALSE)=\"\",\"\",VLOOKUP($C39,invullijst!$A$11:$M$196,6,FALSE))","v":0},{"$f":"IF(VLOOKUP($C39,invullijst!$A$11:$M$196,7,FALSE)=\"\",\"\",VLOOKUP($C39,invullijst!$A$11:$M$196,7,FALSE))","v":0},{"$f":"IF(VLOOKUP($C39,invullijst!$A$11:$M$196,8,FALSE)=\"\",\"\",VLOOKUP($C39,invullijst!$A$11:$M$196,8,FALSE))","v":0},{"$f":"IF(VLOOKUP($C39,invullijst!$A$11:$M$196,9,FALSE)=\"\",\"\",VLOOKUP($C39,invullijst!$A$11:$M$196,9,FALSE))","v":0},{"$f":"IF(VLOOKUP($C39,invullijst!$A$11:$M$196,10,FALSE)=\"\",\"\",VLOOKUP($C39,invullijst!$A$11:$M$196,10,FALSE))","v":0},{"$f":"SUM(G39:K39)","v":0},{"$f":"IF(VLOOKUP($C39,invullijst!$A$11:$M$196,11,FALSE)=\"\",\"\",VLOOKUP($C39,invullijst!$A$11:$M$196,11,FALSE))","v":0}]
[{"$nulls":3},{"$f":"IF(VLOOKUP($C40,invullijst!$A$11:$M232,4,FALSE)=\"\",\"\",VLOOKUP($C40,invullijst!$A$11:$M232,4,FALSE))","v":0},{"$f":"IF(VLOOKUP($C40,invullijst!$A$11:$M228,2,FALSE)=\"\",\"\",VLOOKUP($C40,invullijst!$A$11:$M228,2,FALSE))","v":0},{"$f":"IF(VLOOKUP($C40,invullijst!$A$11:$M$196,3,FALSE)=\"\",\"\",VLOOKUP($C40,invullijst!$A$11:$M$196,3,FALSE))","v":0},{"$f":"IF(VLOOKUP($C40,invullijst!$A$11:$M$196,6,FALSE)=\"\",\"\",VLOOKUP($C40,invullijst!$A$11:$M$196,6,FALSE))","v":0},{"$f":"IF(VLOOKUP($C40,invullijst!$A$11:$M$196,7,FALSE)=\"\",\"\",VLOOKUP($C40,invullijst!$A$11:$M$196,7,FALSE))","v":0},{"$f":"IF(VLOOKUP($C40,invullijst!$A$11:$M$196,8,FALSE)=\"\",\"\",VLOOKUP($C40,invullijst!$A$11:$M$196,8,FALSE))","v":0},{"$f":"IF(VLOOKUP($C40,invullijst!$A$11:$M$196,9,FALSE)=\"\",\"\",VLOOKUP($C40,invullijst!$A$11:$M$196,9,FALSE))","v":0},{"$f":"IF(VLOOKUP($C40,invullijst!$A$11:$M$196,10,FALSE)=\"\",\"\",VLOOKUP($C40,invullijst!$A$11:$M$196,10,FALSE))","v":0},{"$f":"SUM(G40:K40)","v":0},{"$f":"IF(VLOOKUP($C40,invullijst!$A$11:$M$196,11,FALSE)=\"\",\"\",VLOOKUP($C40,invullijst!$A$11:$M$196,11,FALSE))","v":0}]
[{"$nulls":3},{"$f":"IF(VLOOKUP($C41,invullijst!$A$11:$M233,4,FALSE)=\"\",\"\",VLOOKUP($C41,invullijst!$A$11:$M233,4,FALSE))","v":0},{"$f":"IF(VLOOKUP($C41,invullijst!$A$11:$M229,2,FALSE)=\"\",\"\",VLOOKUP($C41,invullijst!$A$11:$M229,2,FALSE))","v":0},{"$f":"IF(VLOOKUP($C41,invullijst!$A$11:$M$196,3,FALSE)=\"\",\"\",VLOOKUP($C41,invullijst!$A$11:$M$196,3,FALSE))","v":0},{"$f":"IF(VLOOKUP($C41,invullijst!$A$11:$M$196,6,FALSE)=\"\",\"\",VLOOKUP($C41,invullijst!$A$11:$M$196,6,FALSE))","v":0},{"$f":"IF(VLOOKUP($C41,invullijst!$A$11:$M$196,7,FALSE)=\"\",\"\",VLOOKUP($C41,invullijst!$A$11:$M$196,7,FALSE))","v":0},{"$f":"IF(VLOOKUP($C41,invullijst!$A$11:$M$196,8,FALSE)=\"\",\"\",VLOOKUP($C41,invullijst!$A$11:$M$196,8,FALSE))","v":0},{"$f":"IF(VLOOKUP($C41,invullijst!$A$11:$M$196,9,FALSE)=\"\",\"\",VLOOKUP($C41,invullijst!$A$11:$M$196,9,FALSE))","v":0},{"$f":"IF(VLOOKUP($C41,invullijst!$A$11:$M$196,10,FALSE)=\"\",\"\",VLOOKUP($C41,invullijst!$A$11:$M$196,10,FALSE))","v":0},{"$f":"SUM(G41:K41)","v":0},{"$f":"IF(VLOOKUP($C41,invullijst!$A$11:$M$196,11,FALSE)=\"\",\"\",VLOOKUP($C41,invullijst!$A$11:$M$196,11,FALSE))","v":0}]

{"sheet":"Korps","index":4,"n_rows":57,"n_cols":34,"rows_kept":57,"merged":[[0,2,0,3],[0,4,0,7],[0,9,0,13],[4,2,4,13],[4,16,4,31],[6,2,6,6],[6,9,6,13],[20,2,20,5],[20,9,20,12],[31,2,31,13],[31,16,31,31],[33,2,33,6],[33,9,33,13],[47,2,47,5],[47,9,47,12],[56,2,56,13]]}
[null,null,{"$f":"invullijst!F1","v":"Organistatie"},null,{"$f":"invullijst!H2","v":"2025 - 2026"},{"$nulls":4},{"$f":"invullijst!F3","v":"Sint Ambrosius Baardwijk"}]
[]
[]
[]
[null,null,"UITSLAGEN  O.V.L.B. KORPS VRIJE-HAND",{"$nulls":13},"Hieronder niets wijzigen"]
[]
[null,null,"A-Korps Vrije-hand",{"$nulls":6},"B-Korps Vrije-hand",{"$nulls":18},"A-Korps",null,null,"B-Korps"]
[null,null,"Baardwijk",321,"-",335,"Besoijen",null,null,"Baardwijk",0,"-",305,"Besoijen",null,null,{"$f":"D8","v":321},"ba",{"$f":"IF(ISBLANK(D8),\"\",IF(D8=F8,1,IF(D8>F8,2,0)))","v":0},{"$f":"IF(ISBLANK(F8),\"\",IF(F8=D8,1,IF(F8>D8,2,0)))","v":2},"be",{"$f":"F8","v":335},{"$f":"K8","v":0},"ba",{"$f":"IF(ISBLANK(K8),\"\",IF(K8=M8,1,IF(K8>M8,2,0)))","v":0},{"$f":"IF(ISBLANK(M8),\"\",IF(M8=K8,1,IF(M8>K8,2,0)))","v":2},"be",{"$f":"M8","v":305},"Baardwijk",{"$f":"SUM(S8:S11)","v":0},{"$f":"SUM(Q8:Q11)","v":949},"Baardwijk",{"$f":"SUM(Y8:Y11)","v":1},{"$f":"SUM(W8:W11)","v":53}]
[null,null,"Baardwijk",309,"-",346,"Elshout",null,null,"Baardwijk",0,"-",0,"Elshout",null,null,309,"ba",0,2,"el",346,{"$f":"K9","v":0},"ba",{"$f":"IF(ISBLANK(K9),\"\",IF(K9=M9,1,IF(K9>M9,2,0)))","v":1},{"$f":"IF(ISBLANK(M9),\"\",IF(M9=K9,1,IF(M9>K9,2,0)))","v":1},"el",{"$f":"M9","v":0},"Besoijen",{"$f":"SUM(T8,S12:S14)","v":6},{"$f":"SUM(V8,Q12:Q14)","v":1014},"Besoijen",{"$f":"SUM(Z8,Y12:Y14)","v":6},{"$f":"SUM(AB8,W12:W14)","v":938}]
[null,null,"Baardwijk",null,"-",null,"Haarsteeg",null,null,"Baardwijk",null,"-",null,"Haarsteeg",null,null,0,"ba","","","ha",0,0,"ba","","","ha",0,"Elshout",{"$f":"SUM(T9,T12,S15:S16)","v":4},{"$f":"SUM(V9,V12,Q15:Q16)","v":677},"Elshout",{"$f":"SUM(Z9,Z12,Y15:Y16)","v":1},{"$f":"SUM(AB9,AB12,W15:W16)","v":0}]
[null,null,"Baardwijk",319,"-",325,"Kaatsheuvel",null,null,"Baardwijk",53,"-",234,"Kaatsheuvel",null,null,319,"ba",0,2,"ka",325,53,"ba",0,2,"ka",234,"Haarsteeg",{"$f":"SUM(T10,T13,T15,S17)","v":0},{"$f":"SUM(V10,V13,V15,Q17)","v":648},"Haarsteeg",{"$f":"SUM(Z10,Z13,Z15,Y17)","v":2},{"$f":"SUM(AB10,AB13,AB15,W17)","v":311}]
[null,null,"Besoijen",null,"-",null,"Elshout",null,null,"Besoijen",null,"-",null,"Elshout",null,null,0,"be","","","el",0,0,"be","","","el",0,"Kaatsheuvel",{"$f":"SUM(T11,T14,T16,T17)","v":2},{"$f":"SUM(V11,V14,V16,V17)","v":642},"Kaatsheuvel",{"$f":"SUM(Z11,Z14,Z16,Z17)","v":2},{"$f":"SUM(AB11,AB14,AB16,AB17)","v":390}]
[null,null,"Besoijen",332,"-",320,"Haarsteeg",null,null,"Besoijen",313,"-",159,"Haarsteeg",null,null,332,"be",2,0,"ha",320,313,"be",2,0,"ha",159]
[null,null,"Besoijen",347,"-",317,"Kaatsheuvel",null,null,"Besoijen",320,"-",156,"Kaatsheuvel",null,null,347,"be",2,0,"ka",317,320,"be",2,0,"ka",156]
[null,null,"Elshout",331,"-",328,"Haarsteeg",null,null,"Elshout",0,"-",152,"Haarsteeg",null,null,331,"el",2,0,"ha",328,0,"el",0,2,"ha",152]
[null,null,"Elshout",null,"-",null,"Kaatsheuvel",null,null,"Elshout",null,"-",null,"Kaatsheuvel",null,null,0,"el","","","ka",0,0,"el","","","ka",0]
[null,null,"Haarsteeg",null,"-",null,"Kaatsheuvel",null,null,"Haarsteeg",null,"-",null,"Kaatsheuvel",null,null,0,"ha","","","ka",0,0,"ha","","","ka",0]
[null,null,"(*): de wedstrijden kunnen zowel uit- als thuiswedstrijden zijn; dus b.v. zowel Besoijen-Elshout als Elshout- Besoijen... "]
[]
[]
[null,null,"EINDSTAND A-KORPS VRIJE-HAND",{"$nulls":6},"EINDSTAND B-KORPS VRIJE-HAND"]
[{"$nulls":3},"Matchpunten","-","Totaalpunten",{"$nulls":4},"Matchpunten","-","Totaalpunten"]
[]
[1,null,"Baardwijk",{"$f":"IF(ISTEXT(C24),VLOOKUP(C24,$AC$8:$AE$12,2,FALSE),\" \")","v":0},"-",{"$f":"IF(ISTEXT(C24),VLOOKUP(C24,$AC$8:$AE$12,3,FALSE),\" \")","v":949},null,1,null,"Baardwijk",{"$f":"IF(ISTEXT(J24),VLOOKUP(J24,$AF$8:$AH$12,2,FALSE),\" \")","v":1},"-",{"$f":"IF(ISTEXT(J24),VLOOKUP(J24,$AF$8:$AH$12,3,FALSE),\" \")","v":53}]
[2,null,"Besoijen",{"$f":"IF(ISTEXT(C25),VLOOKUP(C25,$AC$8:$AE$12,2,FALSE),\" \")","v":6},"-",{"$f":"IF(ISTEXT(C25),VLOOKUP(C25,$AC$8:$AE$12,3,FALSE),\" \")","v":1014},null,2,null,"Besoijen",{"$f":"IF(ISTEXT(J25),VLOOKUP(J25,$AF$8:$AH$12,2,FALSE),\" \")","v":6},"-",{"$f":"IF(ISTEXT(J25),VLOOKUP(J25,$AF$8:$AH$12,3,FALSE),\" \")","v":938}]
[3,null,"Elshout",{"$f":"IF(ISTEXT(C26),VLOOKUP(C26,$AC$8:$AE$12,2,FALSE),\" \")","v":4},"-",{"$f":"IF(ISTEXT(C26),VLOOKUP(C26,$AC$8:$AE$12,3,FALSE),\" \")","v":677},null,3,null,"Elshout",{"$f":"IF(ISTEXT(J26),VLOOKUP(J26,$AF$8:$AH$12,2,FALSE),\" \")","v":1},"-",{"$f":"IF(ISTEXT(J26),VLOOKUP(J26,$AF$8:$AH$12,3,FALSE),\" \")","v":0}]
[4,null,"Haarsteeg",{"$f":"IF(ISTEXT(C27),VLOOKUP(C27,$AC$8:$AE$12,2,FALSE),\" \")","v":0},"-",{"$f":"IF(ISTEXT(C27),VLOOKUP(C27,$AC$8:$AE$12,3,FALSE),\" \")","v":648},null,4,null,"Haarsteeg",{"$f":"IF(ISTEXT(J27),VLOOKUP(J27,$AF$8:$AH$12,2,FALSE),\" \")","v":2},"-",{"$f":"IF(ISTEXT(J27),VLOOKUP(J27,$AF$8:$AH$12,3,FALSE),\" \")","v":311}]
[5,null,"Kaatsheuvel",{"$f":"IF(ISTEXT(C28),VLOOKUP(C28,$AC$8:$AE$12,2,FALSE),\" \")","v":2},"-",{"$f":"IF(ISTEXT(C28),VLOOKUP(C28,$AC$8:$AE$12,3,FALSE),\" \")","v":642},null,5,null,"Kaatsheuvel",{"$f":"IF(ISTEXT(J28),VLOOKUP(J28,$AF$8:$AH$12,2,FALSE),\" \")","v":2},"-",{"$f":"IF(ISTEXT(J28),VLOOKUP(J28,$AF$8:$AH$12,3,FALSE),\" \")","v":390}]
[]
[]
[]
[null,null,"UITSLAGEN  O.V.L.B. KORPS OPGELEGD",{"$nulls":13},"Hieronder niets wijzigen"]
[]
[null,null,"A-KORPS OPGELEGD",{"$nulls":6},"B-KORPS OPGELEGD",{"$nulls":18},"A-Korps",null,null,"B-Korps"]
[null,null,"Baardwijk",165,"-",286,"Besoijen",null,null,"Baardwijk",0,"-",269,"Besoijen",null,null,{"$f":"D35","v":165},"ba",{"$f":"IF(ISBLANK(D35),\"\",IF(D35=F35,1,IF(D35>F35,2,0)))","v":0},{"$f":"IF(ISBLANK(F35),\"\",IF(F35=D35,1,IF(F35>D35,2,0)))","v":2},"be",{"$f":"F35","v":286},{"$f":"K35","v":0},"ba",{"$f":"IF(ISBLANK(K35),\"\",IF(K35=M35,1,IF(K35>M35,2,0)))","v":0},{"$f":"IF(ISBLANK(M35),\"\",IF(M35=K35,1,IF(M35>K35,2,0)))","v":2},"be",{"$f":"M35","v":269},"Baardwijk",{"$f":"SUM(S35:S38)","v":0},{"$f":"SUM(Q35:Q38)","v":582},"Baardwijk",{"$f":"SUM(Y35:Y38)","v":0},{"$f":"SUM(W35:W38)","v":54}]
[null,null,"Baardwijk",166,"-",281,"Elshout",null,null,"Baardwijk",0,"-",262,"Elshout",null,null,166,"ba",0,2,"el",281,{"$f":"K36","v":0},"ba",{"$f":"IF(ISBLANK(K36),\"\",IF(K36=M36,1,IF(K36>M36,2,0)))","v":0},{"$f":"IF(ISBLANK(M36),\"\",IF(M36=K36,1,IF(M36>K36,2,0)))","v":2},"el",{"$f":"M36","v":262},"Besoijen",{"$f":"SUM(T35,S39:S41)","v":4},{"$f":"SUM(V35,Q39:Q41)","v":848},"Besoijen",{"$f":"SUM(Z35,Y39:Y41)","v":4},{"$f":"SUM(AB35,W39:W41)","v":798}]
[null,null,"Baardwijk",null,"-",null,"Haarsteeg",null,null,"Baardwijk",null,"-",null,"Haarsteeg",null,null,0,"ba","","","ha",0,0,"ba","","","ha",0,"Elshout",{"$f":"SUM(T36,T39,S42:S43)","v":2},{"$f":"SUM(V36,V39,Q42:Q43)","v":566},"Elshout",{"$f":"SUM(Z36,Z39,Y42:Y43)","v":2},{"$f":"SUM(AB36,AB39,W42:W43)","v":350}]
[null,null,"Baardwijk",251,"-",273,"Kaatsheuvel",null,null,"Baardwijk",54,"-",262,"Kaatsheuvel",null,null,251,"ba",0,2,"ka",273,54,"ba",0,2,"ka",262,"Haarsteeg",{"$f":"SUM(T37,T40,T42,S44)","v":4},{"$f":"SUM(V37,V40,V42,Q44)","v":575},"Haarsteeg",{"$f":"SUM(Z37,Z40,Z42,Y44)","v":4},{"$f":"SUM(AB37,AB40,AB42,W44)","v":560}]
[null,null,"Besoijen",null,"-",null,"Elshout",null,null,"Besoijen",null,"-",null,"Elshout",null,null,0,"be","","","el",0,0,"be","","","el",0,"Kaatsheuvel",{"$f":"SUM(T38,T41,T43,T44)","v":2},{"$f":"SUM(V38,V41,V43,V44)","v":545},"Kaatsheuvel",{"$f":"SUM(Z38,Z41,Z43,Z44)","v":2},{"$f":"SUM(AB38,AB41,AB43,AB44)","v":519}]
[null,null,"Besoijen",276,"-",284,"Haarsteeg",null,null,"Besoijen",268,"-",271,"Haarsteeg",null,null,276,"be",0,2,"ha",284,268,"be",0,2,"ha",271]
[null,null,"Besoijen",286,"-",272,"Kaatsheuvel",null,null,"Besoijen",261,"-",257,"Kaatsheuvel",null,null,286,"be",2,0,"ka",272,261,"be",2,0,"ka",257]
[null,null,"Elshout",285,"-",291,"Haarsteeg",null,null,"Elshout",88,"-",289,"Haarsteeg",null,null,285,"el",0,2,"ha",291,88,"el",0,2,"ha",289]
[null,null,"Elshout",null,"-",null,"Kaatsheuvel",null,null,"Elshout",null,"-",null,"Kaatsheuvel",null,null,0,"el","","","ka",0,0,"el","","","ka",0]
[null,null,"Haarsteeg",null,"-",null,"Kaatsheuvel",null,null,"Haarsteeg",null,"-",null,"Kaatsheuvel",null,null,0,"ha","","","ka",0,0,"ha","","","ka",0]
[null,null,"(*): de wedstrijden kunnen zowel uit- als thuiswedstrijden zijn; dus b.v. zowel Besoijen-Elshout als Elshout- Besoijen... "]
[]
[]
[null,null,"EINDSTAND A-KORPS OPGELEGD",{"$nulls":6},"EINDSTAND B-KORPS OPGELEGD"]
[{"$nulls":3},"Matchpunten","-","Totaalpunten",{"$nulls":4},"Matchpunten","-","Totaalpunten"]
[]
[1,null,"Baardwijk",{"$f":"IF(ISTEXT(C51),VLOOKUP(C51,$AC$35:$AE$39,2,FALSE),\" \")","v":0},"-",{"$f":"IF(ISTEXT(C51),VLOOKUP(C51,$AC$35:$AE$39,3,FALSE),\" \")","v":582},null,1,null,"Baardwijk",{"$f":"IF(ISTEXT(J51),VLOOKUP(J51,$AF$35:$AH$39,2,FALSE),\" \")","v":0},"-",{"$f":"IF(ISTEXT(J51),VLOOKUP(J51,$AF$35:$AH$39,3,FALSE),\" \")","v":54}]
[2,null,"Besoijen",{"$f":"IF(ISTEXT(C52),VLOOKUP(C52,$AC$35:$AE$39,2,FALSE),\" \")","v":4},"-",{"$f":"IF(ISTEXT(C52),VLOOKUP(C52,$AC$35:$AE$39,3,FALSE),\" \")","v":848},null,2,null,"Besoijen",{"$f":"IF(ISTEXT(J52),VLOOKUP(J52,$AF$35:$AH$39,2,FALSE),\" \")","v":4},"-",{"$f":"IF(ISTEXT(J52),VLOOKUP(J52,$AF$35:$AH$39,3,FALSE),\" \")","v":798}]
[3,null,"Elshout",{"$f":"IF(ISTEXT(C53),VLOOKUP(C53,$AC$35:$AE$39,2,FALSE),\" \")","v":2},"-",{"$f":"IF(ISTEXT(C53),VLOOKUP(C53,$AC$35:$AE$39,3,FALSE),\" \")","v":566},null,3,null,"Elshout",{"$f":"IF(ISTEXT(J53),VLOOKUP(J53,$AF$35:$AH$39,2,FALSE),\" \")","v":2},"-",{"$f":"IF(ISTEXT(J53),VLOOKUP(J53,$AF$35:$AH$39,3,FALSE),\" \")","v":350}]
[4,null,"Haarsteeg",{"$f":"IF(ISTEXT(C54),VLOOKUP(C54,$AC$35:$AE$39,2,FALSE),\" \")","v":4},"-",{"$f":"IF(ISTEXT(C54),VLOOKUP(C54,$AC$35:$AE$39,3,FALSE),\" \")","v":575},null,4,null,"Haarsteeg",{"$f":"IF(ISTEXT(J54),VLOOKUP(J54,$AF$35:$AH$39,2,FALSE),\" \")","v":4},"-",{"$f":"IF(ISTEXT(J54),VLOOKUP(J54,$AF$35:$AH$39,3,FALSE),\" \")","v":560}]
[5,null,"Kaatsheuvel",{"$f":"IF(ISTEXT(C55),VLOOKUP(C55,$AC$35:$AE$39,2,FALSE),\" \")","v":2},"-",{"$f":"IF(ISTEXT(C55),VLOOKUP(C55,$AC$35:$AE$39,3,FALSE),\" \")","v":545},null,5,null,"Kaatsheuvel",{"$f":"IF(ISTEXT(J55),VLOOKUP(J55,$AF$35:$AH$39,2,FALSE),\" \")","v":2},"-",{"$f":"IF(ISTEXT(J55),VLOOKUP(J55,$AF$35:$AH$39,3,FALSE),\" \")","v":519}]
[]
[null,null,"alleen in de groene kolom punten korps invullen"]

{"sheet":"wedstrijd 1A","index":5,"n_rows":38,"n_cols":15,"rows_kept":38,"merged":[[0,0,0,4],[0,5,0,7],[0,8,0,14],[1,0,1,11],[1,12,1,14],[2,1,2,5],[2,9,2,13],[4,0,4,14],[5,4,5,5],[5,12,5,13],[6,4,6,5],[6,12,6,13],[7,4,7,5],[7,12,7,13],[8,4,8,5],[8,12,8,13],[9,0,9,5],[9,8,9,13],[11,4,11,5],[11,12,11,13],[12,4,12,5],[12,12,12,13],[13,4,13,5],[13,12,13,13],[14,4,14,5],[14,12,14,13],[15,0,15,5],[15,8,15,13],[17,4,17,5],[17,12,17,13],[18,4,18,5],[18,12,18,13],[19,4,19,5],[19,12,19,13],[20,4,20,5],[20,12,20,13],[21,0,21,5],[21,8,21,13],[23,0,23,14],[24,4,24,5],[24,12,24,13],[25,4,25,5],[25,12,25,13],[26,4,26,5],[26,12,26,13],[27,0,27,5],[27,8,27,13],[29,4,29,5],[29,12,29,13],[30,4,30,5],[30,12,30,13],[31,4,31,5],[31,12,31,13],[32,0,32,5],[32,8,32,13],[34,4,34,5],[34,12,34,13],[35,4,35,5],[35,12,35,13],[36,4,36,5],[36,12,36,13],[37,0,37,5],[37,8,37,13]]}
[{"$f":"invullijst!F1","v":"Organistatie"},{"$nulls":4},{"$f":"invullijst!H2","v":"2025 - 2026"},null,null,{"$f":"invullijst!F3","v":"Sint Ambrosius Baardwijk"}]
["Datum: ",{"$nulls":11},"2025-12-07"]
[5,{"$f":"IF(VLOOKUP(A3,invullijst!A1:F5,2,FALSE)=\"\",\"\",VLOOKUP(A3,invullijst!A1:F5,2,FALSE))","v":"Sint Jan Baptist Kaatsheuvel"},{"$nulls":6},1,{"$f":"IF(VLOOKUP(I3,invullijst!A1:C5,2,FALSE)=\"\",\"\",VLOOKUP(I3,invullijst!A1:C5,2,FALSE))","v":"Sint Ambrosius Baardwijk"}]
[]
["vrijehand"]
[1,{"$f":"IF($G$3=\"k\",IF(VLOOKUP($D6,invullijst!$A$11:$M$196,11,FALSE)=0,\" \",VLOOKUP($D6,invullijst!$A$11:$M$196,11,FALSE)),\"\")","v":""},{"$f":"IF(VLOOKUP(D6,invullijst!A$11:F$237,4,FALSE)=\"\",\"\",VLOOKUP(D6,invullijst!A$11:D$237,4,FALSE))","v":"vr"},504,{"$f":"IF(VLOOKUP($D6,invullijst!$A$11:$M$196,2,FALSE)=\"\",\"\",VLOOKUP($D6,invullijst!$A$11:$M$196,2,FALSE))","v":"Koen v/d Ven"},null,{"$f":"IF(VLOOKUP($D6,invullijst!$A$11:$M$196,6,FALSE)=0,\"\",VLOOKUP($D6,invullijst!$A$11:$M$196,6,FALSE))","v":87},null,1,{"$f":"IF($O$3=\"k\",IF(VLOOKUP($L6,invullijst!$A$11:$M$196,11,FALSE)=0,\" \",VLOOKUP($L6,invullijst!$A$11:$M$196,11,FALSE)),\"\")","v":""},{"$f":"IF(VLOOKUP($L6,invullijst!$A$11:$M$237,4,FALSE)=\"\",\"\",VLOOKUP($L6,invullijst!$A$11:$M$237,4,FALSE))","v":"vr"},105,{"$f":"IF(VLOOKUP($L6,invullijst!$A$11:$M$196,2,FALSE)=\"\",\"\",VLOOKUP($L6,invullijst!$A$11:$M$196,2,FALSE))","v":"René Klijn"},null,{"$f":"IF(VLOOKUP($L6,invullijst!$A$11:$M$196,6,FALSE)=0,\"\",VLOOKUP($L6,invullijst!$A$11:$M$196,6,FALSE))","v":86}]
[2,{"$f":"IF($G$3=\"k\",IF(VLOOKUP($D7,invullijst!$A$11:$M$196,11,FALSE)=0,\" \",VLOOKUP($D7,invullijst!$A$11:$M$196,11,FALSE)),\"\")","v":""},{"$f":"IF(VLOOKUP(D7,invullijst!A$11:F$237,4,FALSE)=\"\",\"\",VLOOKUP(D7,invullijst!A$11:D$237,4,FALSE))","v":"vr"},501,{"$f":"IF(VLOOKUP($D7,invullijst!$A$11:$M$196,2,FALSE)=\"\",\"\",VLOOKUP($D7,invullijst!$A$11:$M$196,2,FALSE))","v":"Annette Vos"},null,{"$f":"IF(VLOOKUP($D7,invullijst!$A$11:$M$196,6,FALSE)=0,\"\",VLOOKUP($D7,invullijst!$A$11:$M$196,6,FALSE))","v":81},null,2,{"$f":"IF($O$3=\"k\",IF(VLOOKUP($L7,invullijst!$A$11:$M$196,11,FALSE)=0,\" \",VLOOKUP($L7,invullijst!$A$11:$M$196,11,FALSE)),\"\")","v":""},{"$f":"IF(VLOOKUP($L7,invullijst!$A$11:$M$237,4,FALSE)=\"\",\"\",VLOOKUP($L7,invullijst!$A$11:$M$237,4,FALSE))","v":"vr"},106,{"$f":"IF(VLOOKUP($L7,invullijst!$A$11:$M$196,2,FALSE)=\"\",\"\",VLOOKUP($L7,invullijst!$A$11:$M$196,2,FALSE))","v":"René Pullens"},null,{"$f":"IF(VLOOKUP($L7,invullijst!$A$11:$M$196,6,FALSE)=0,\"\",VLOOKUP($L7,invullijst!$A$11:$M$196,6,FALSE))","v":82}]
[3,{"$f":"IF($G$3=\"k\",IF(VLOOKUP($D8,invullijst!$A$11:$M$196,11,FALSE)=0,\" \",VLOOKUP($D8,invullijst!$A$11:$M$196,11,FALSE)),\"\")","v":""},{"$f":"IF(VLOOKUP(D8,invullijst!A$11:F$237,4,FALSE)=\"\",\"\",VLOOKUP(D8,invullijst!A$11:D$237,4,FALSE))","v":"vr"},507,{"$f":"IF(VLOOKUP($D8,invullijst!$A$11:$M$196,2,FALSE)=\"\",\"\",VLOOKUP($D8,invullijst!$A$11:$M$196,2,FALSE))","v":"Michael Blaauwbroek"},null,{"$f":"IF(VLOOKUP($D8,invullijst!$A$11:$M$196,6,FALSE)=0,\"\",VLOOKUP($D8,invullijst!$A$11:$M$196,6,FALSE))","v":76},null,3,{"$f":"IF($O$3=\"k\",IF(VLOOKUP($L8,invullijst!$A$11:$M$196,11,FALSE)=0,\" \",VLOOKUP($L8,invullijst!$A$11:$M$196,11,FALSE)),\"\")","v":""},{"$f":"IF(VLOOKUP($L8,invullijst!$A$11:$M$237,4,FALSE)=\"\",\"\",VLOOKUP($L8,invullijst!$A$11:$M$237,4,FALSE))","v":"vr"},108,{"$f":"IF(VLOOKUP($L8,invullijst!$A$11:$M$196,2,FALSE)=\"\",\"\",VLOOKUP($L8,invullijst!$A$11:$M$196,2,FALSE))","v":"Bram Pullens"},null,{"$f":"IF(VLOOKUP($L8,invullijst!$A$11:$M$196,6,FALSE)=0,\"\",VLOOKUP($L8,invullijst!$A$11:$M$196,6,FALSE))","v":80}]
[4,{"$f":"IF($G$3=\"k\",IF(VLOOKUP($D9,invullijst!$A$11:$M$196,11,FALSE)=0,\" \",VLOOKUP($D9,invullijst!$A$11:$M$196,11,FALSE)),\"\")","v":""},{"$f":"IF(VLOOKUP(D9,invullijst!A$11:F$237,4,FALSE)=\"\",\"\",VLOOKUP(D9,invullijst!A$11:D$237,4,FALSE))","v":"vr"},506,{"$f":"IF(VLOOKUP($D9,invullijst!$A$11:$M$196,2,FALSE)=\"\",\"\",VLOOKUP($D9,invullijst!$A$11:$M$196,2,FALSE))","v":"Maikel Monden"},null,{"$f":"IF(VLOOKUP($D9,invullijst!$A$11:$M$196,6,FALSE)=0,\"\",VLOOKUP($D9,invullijst!$A$11:$M$196,6,FALSE))","v":81},null,4,{"$f":"IF($O$3=\"k\",IF(VLOOKUP($L9,invullijst!$A$11:$M$196,11,FALSE)=0,\" \",VLOOKUP($L9,invullijst!$A$11:$M$196,11,FALSE)),\"\")","v":""},{"$f":"IF(VLOOKUP($L9,invullijst!$A$11:$M$237,4,FALSE)=\"\",\"\",VLOOKUP($L9,invullijst!$A$11:$M$237,4,FALSE))","v":"vr"},109,{"$f":"IF(VLOOKUP($L9,invullijst!$A$11:$M$196,2,FALSE)=\"\",\"\",VLOOKUP($L9,invullijst!$A$11:$M$196,2,FALSE))","v":"Gijs Pullens"},null,{"$f":"IF(VLOOKUP($L9,invullijst!$A$11:$M$196,6,FALSE)=0,\"\",VLOOKUP($L9,invullijst!$A$11:$M$196,6,FALSE))","v":71}]
["Totaal A korps",{"$nulls":5},{"$f":"SUM(G6:G9)","v":325},null,"Totaal A korps",{"$nulls":5},{"$f":"SUM(O6:O9)","v":319}]
[]
[1,{"$f":"IF($G$3=\"k\",IF(VLOOKUP($D12,invullijst!$A$11:$M$196,11,FALSE)=0,\" \",VLOOKUP($D12,invullijst!$A$11:$M$196,11,FALSE)),\"\")","v":""},{"$f":"IF(VLOOKUP(D12,invullijst!A$11:F$237,4,FALSE)=\"\",\"\",VLOOKUP(D12,invullijst!A$11:D$237,4,FALSE))","v":"vr"},508,{"$f":"IF(VLOOKUP($D12,invullijst!$A$11:$M$196,2,FALSE)=\"\",\"\",VLOOKUP($D12,invullijst!$A$11:$M$196,2,FALSE))","v":"Rowan Dobbelsteen"},null,{"$f":"IF(VLOOKUP($D12,invullijst!$A$11:$M$196,6,FALSE)=0,\"\",VLOOKUP($D12,invullijst!$A$11:$M$196,6,FALSE))","v":80},null,1,{"$f":"IF($O$3=\"k\",IF(VLOOKUP($L12,invullijst!$A$11:$M$196,11,FALSE)=0,\" \",VLOOKUP($L12,invullijst!$A$11:$M$196,11,FALSE)),\"\")","v":""},{"$f":"IF(VLOOKUP($L12,invullijst!$A$11:$M$237,4,FALSE)=\"\",\"\",VLOOKUP($L12,invullijst!$A$11:$M$237,4,FALSE))","v":"vr"},101,{"$f":"IF(VLOOKUP($L12,invullijst!$A$11:$M$196,2,FALSE)=\"\",\"\",VLOOKUP($L12,invullijst!$A$11:$M$196,2,FALSE))","v":"Antwan van Buul"},null,{"$f":"IF(VLOOKUP($L12,invullijst!$A$11:$M$196,6,FALSE)=0,\"\",VLOOKUP($L12,invullijst!$A$11:$M$196,6,FALSE))","v":53}]
[2,{"$f":"IF($G$3=\"k\",IF(VLOOKUP($D13,invullijst!$A$11:$M$196,11,FALSE)=0,\" \",VLOOKUP($D13,invullijst!$A$11:$M$196,11,FALSE)),\"\")","v":""},{"$f":"IF(VLOOKUP(D13,invullijst!A$11:F$237,4,FALSE)=\"\",\"\",VLOOKUP(D13,invullijst!A$11:D$237,4,FALSE))","v":"vr"},512,{"$f":"IF(VLOOKUP($D13,invullijst!$A$11:$M$196,2,FALSE)=\"\",\"\",VLOOKUP($D13,invullijst!$A$11:$M$196,2,FALSE))","v":"Hans Bergakker"},null,{"$f":"IF(VLOOKUP($D13,invullijst!$A$11:$M$196,6,FALSE)=0,\"\",VLOOKUP($D13,invullijst!$A$11:$M$196,6,FALSE))","v":72},null,2,{"$f":"IF($O$3=\"k\",IF(VLOOKUP($L13,invullijst!$A$11:$M$196,11,FALSE)=0,\" \",VLOOKUP($L13,invullijst!$A$11:$M$196,11,FALSE)),\"\")","v":""},{"$f":"IF(VLOOKUP($L13,invullijst!$A$11:$M$237,4,FALSE)=\"\",\"\",VLOOKUP($L13,invullijst!$A$11:$M$237,4,FALSE))","v":0},null,{"$f":"IF(VLOOKUP($L13,invullijst!$A$11:$M$196,2,FALSE)=\"\",\"\",VLOOKUP($L13,invullijst!$A$11:$M$196,2,FALSE))","v":0},null,{"$f":"IF(VLOOKUP($L13,invullijst!$A$11:$M$196,6,FALSE)=0,\"\",VLOOKUP($L13,invullijst!$A$11:$M$196,6,FALSE))","v":""}]
[3,{"$f":"IF($G$3=\"k\",IF(VLOOKUP($D14,invullijst!$A$11:$M$196,11,FALSE)=0,\" \",VLOOKUP($D14,invullijst!$A$11:$M$196,11,FALSE)),\"\")","v":""},{"$f":"IF(VLOOKUP(D14,invullijst!A$11:F$237,4,FALSE)=\"\",\"\",VLOOKUP(D14,invullijst!A$11:D$237,4,FALSE))","v":"vr"},513,{"$f":"IF(VLOOKUP($D14,invullijst!$A$11:$M$196,2,FALSE)=\"\",\"\",VLOOKUP($D14,invullijst!$A$11:$M$196,2,FALSE))","v":"Mark van Delft"},null,{"$f":"IF(VLOOKUP($D14,invullijst!$A$11:$M$196,6,FALSE)=0,\"\",VLOOKUP($D14,invullijst!$A$11:$M$196,6,FALSE))","v":82},null,3,{"$f":"IF($O$3=\"k\",IF(VLOOKUP($L14,invullijst!$A$11:$M$196,11,FALSE)=0,\" \",VLOOKUP($L14,invullijst!$A$11:$M$196,11,FALSE)),\"\")","v":""},{"$f":"IF(VLOOKUP($L14,invullijst!$A$11:$M$237,4,FALSE)=\"\",\"\",VLOOKUP($L14,invullijst!$A$11:$M$237,4,FALSE))","v":0},null,{"$f":"IF(VLOOKUP($L14,invullijst!$A$11:$M$196,2,FALSE)=\"\",\"\",VLOOKUP($L14,invullijst!$A$11:$M$196,2,FALSE))","v":0},null,{"$f":"IF(VLOOKUP($L14,invullijst!$A$11:$M$196,6,FALSE)=0,\"\",VLOOKUP($L14,invullijst!$A$11:$M$196,6,FALSE))","v":""}]
[4,{"$f":"IF($G$3=\"k\",IF(VLOOKUP($D15,invullijst!$A$11:$M$196,11,FALSE)=0,\" \",VLOOKUP($D15,invullijst!$A$11:$M$196,11,FALSE)),\"\")","v":""},{"$f":"IF(VLOOKUP(D15,invullijst!A$11:F$237,4,FALSE)=\"\",\"\",VLOOKUP(D15,invullijst!A$11:D$237,4,FALSE))","v":0},null,{"$f":"IF(VLOOKUP($D15,invullijst!$A$11:$M$196,2,FALSE)=\"\",\"\",VLOOKUP($D15,invullijst!$A$11:$M$196,2,FALSE))","v":0},null,{"$f":"IF(VLOOKUP($D15,invullijst!$A$11:$M$196,6,FALSE)=0,\"\",VLOOKUP($D15,invullijst!$A$11:$M$196,6,FALSE))","v":""},null,4,{"$f":"IF($O$3=\"k\",IF(VLOOKUP($L15,invullijst!$A$11:$M$196,11,FALSE)=0,\" \",VLOOKUP($L15,invullijst!$A$11:$M$196,11,FALSE)),\"\")","v":""},{"$f":"IF(VLOOKUP($L15,invullijst!$A$11:$M$237,4,FALSE)=\"\",\"\",VLOOKUP($L15,invullijst!$A$11:$M$237,4,FALSE))","v":0},null,{"$f":"IF(VLOOKUP($L15,invullijst!$A$11:$M$196,2,FALSE)=\"\",\"\",VLOOKUP($L15,invullijst!$A$11:$M$196,2,FALSE))","v":0},null,{"$f":"IF(VLOOKUP($L15,invullijst!$A$11:$M$196,6,FALSE)=0,\"\",VLOOKUP($L15,invullijst!$A$11:$M$196,6,FALSE))","v":""}]
["Totaal B1 korps",{"$nulls":5},{"$f":"SUM(G12:G15)","v":234},null,"Totaal B1 korps",{"$nulls":5},{"$f":"SUM(O12:O15)","v":53}]
[]
[1,{"$f":"IF($G$3=\"k\",IF(VLOOKUP($D18,invullijst!$A$11:$M$196,11,FALSE)=0,\" \",VLOOKUP($D18,invullijst!$A$11:$M$196,11,FALSE)),\"\")","v":""},{"$f":"IF(VLOOKUP(D18,invullijst!A$11:F$237,4,FALSE)=\"\",\"\",VLOOKUP(D18,invullijst!A$11:D$237,4,FALSE))","v":0},null,{"$f":"IF(VLOOKUP($D18,invullijst!$A$11:$M$196,2,FALSE)=\"\",\"\",VLOOKUP($D18,invullijst!$A$11:$M$196,2,FALSE))","v":0},null,{"$f":"IF(VLOOKUP($D18,invullijst!$A$11:$M$196,6,FALSE)=0,\"\",VLOOKUP($D18,invullijst!$A$11:$M$196,6,FALSE))","v":""},null,1,{"$f":"IF($O$3=\"k\",IF(VLOOKUP($L18,invullijst!$A$11:$M$196,11,FALSE)=0,\" \",VLOOKUP($L18,invullijst!$A$11:$M$196,11,FALSE)),\"\")","v":""},{"$f":"IF(VLOOKUP($L18,invullijst!$A$11:$M$237,4,FALSE)=\"\",\"\",VLOOKUP($L18,invullijst!$A$11:$M$237,4,FALSE))","v":0},null,{"$f":"IF(VLOOKUP($L18,invullijst!$A$11:$M$196,2,FALSE)=\"\",\"\",VLOOKUP($L18,invullijst!$A$11:$M$196,2,FALSE))","v":0},null,{"$f":"IF(VLOOKUP($L18,invullijst!$A$11:$M$196,6,FALSE)=0,\"\",VLOOKUP($L18,invullijst!$A$11:$M$196,6,FALSE))","v":""}]
[2,{"$f":"IF($G$3=\"k\",IF(VLOOKUP($D19,invullijst!$A$11:$M$196,11,FALSE)=0,\" \",VLOOKUP($D19,invullijst!$A$11:$M$196,11,FALSE)),\"\")","v":""},{"$f":"IF(VLOOKUP(D19,invullijst!A$11:F$237,4,FALSE)=\"\",\"\",VLOOKUP(D19,invullijst!A$11:D$237,4,FALSE))","v":0},null,{"$f":"IF(VLOOKUP($D19,invullijst!$A$11:$M$196,2,FALSE)=\"\",\"\",VLOOKUP($D19,invullijst!$A$11:$M$196,2,FALSE))","v":0},null,{"$f":"IF(VLOOKUP($D19,invullijst!$A$11:$M$196,6,FALSE)=0,\"\",VLOOKUP($D19,invullijst!$A$11:$M$196,6,FALSE))","v":""},null,2,{"$f":"IF($O$3=\"k\",IF(VLOOKUP($L19,invullijst!$A$11:$M$196,11,FALSE)=0,\" \",VLOOKUP($L19,invullijst!$A$11:$M$196,11,FALSE)),\"\")","v":""},{"$f":"IF(VLOOKUP($L19,invullijst!$A$11:$M$237,4,FALSE)=\"\",\"\",VLOOKUP($L19,invullijst!$A$11:$M$237,4,FALSE))","v":0},null,{"$f":"IF(VLOOKUP($L19,invullijst!$A$11:$M$196,2,FALSE)=\"\",\"\",VLOOKUP($L19,invullijst!$A$11:$M$196,2,FALSE))","v":0},null,{"$f":"IF(VLOOKUP($L19,invullijst!$A$11:$M$196,6,FALSE)=0,\"\",VLOOKUP($L19,invullijst!$A$11:$M$196,6,FALSE))","v":""}]
[3,{"$f":"IF($G$3=\"k\",IF(VLOOKUP($D20,invullijst!$A$11:$M$196,11,FALSE)=0,\" \",VLOOKUP($D20,invullijst!$A$11:$M$196,11,FALSE)),\"\")","v":""},{"$f":"IF(VLOOKUP(D20,invullijst!A$11:F$237,4,FALSE)=\"\",\"\",VLOOKUP(D20,invullijst!A$11:D$237,4,FALSE))","v":0},null,{"$f":"IF(VLOOKUP($D20,invullijst!$A$11:$M$196,2,FALSE)=\"\",\"\",VLOOKUP($D20,invullijst!$A$11:$M$196,2,FALSE))","v":0},null,{"$f":"IF(VLOOKUP($D20,invullijst!$A$11:$M$196,6,FALSE)=0,\"\",VLOOKUP($D20,invullijst!$A$11:$M$196,6,FALSE))","v":""},null,3,{"$f":"IF($O$3=\"k\",IF(VLOOKUP($L20,invullijst!$A$11:$M$196,11,FALSE)=0,\" \",VLOOKUP($L20,invullijst!$A$11:$M$196,11,FALSE)),\"\")","v":""},{"$f":"IF(VLOOKUP($L20,invullijst!$A$11:$M$237,4,FALSE)=\"\",\"\",VLOOKUP($L20,invullijst!$A$11:$M$237,4,FALSE))","v":0},null,{"$f":"IF(VLOOKUP($L20,invullijst!$A$11:$M$196,2,FALSE)=\"\",\"\",VLOOKUP($L20,invullijst!$A$11:$M$196,2,FALSE))","v":0},null,{"$f":"IF(VLOOKUP($L20,invullijst!$A$11:$M$196,6,FALSE)=0,\"\",VLOOKUP($L20,invullijst!$A$11:$M$196,6,FALSE))","v":""}]
[4,{"$f":"IF($G$3=\"k\",IF(VLOOKUP($D21,invullijst!$A$11:$M$196,11,FALSE)=0,\" \",VLOOKUP($D21,invullijst!$A$11:$M$196,11,FALSE)),\"\")","v":""},{"$f":"IF(VLOOKUP(D21,invullijst!A$11:F$237,4,FALSE)=\"\",\"\",VLOOKUP(D21,invullijst!A$11:D$237,4,FALSE))","v":0},null,{"$f":"IF(VLOOKUP($D21,invullijst!$A$11:$M$196,2,FALSE)=\"\",\"\",VLOOKUP($D21,invullijst!$A$11:$M$196,2,FALSE))","v":0},null,{"$f":"IF(VLOOKUP($D21,invullijst!$A$11:$M$196,6,FALSE)=0,\"\",VLOOKUP($D21,invullijst!$A$11:$M$196,6,FALSE))","v":""},null,4,{"$f":"IF($O$3=\"k\",IF(VLOOKUP($L21,invullijst!$A$11:$M$196,11,FALSE)=0,\" \",VLOOKUP($L21,invullijst!$A$11:$M$196,11,FALSE)),\"\")","v":""},{"$f":"IF(VLOOKUP($L21,invullijst!$A$11:$M$237,4,FALSE)=\"\",\"\",VLOOKUP($L21,invullijst!$A$11:$M$237,4,FALSE))","v":0},null,{"$f":"IF(VLOOKUP($L21,invullijst!$A$11:$M$196,2,FALSE)=\"\",\"\",VLOOKUP($L21,invullijst!$A$11:$M$196,2,FALSE))","v":0},null,{"$f":"IF(VLOOKUP($L21,invullijst!$A$11:$M$196,6,FALSE)=0,\"\",VLOOKUP($L21,invullijst!$A$11:$M$196,6,FALSE))","v":""}]
["DIVERSEN / INHAAL",{"$nulls":5},{"$f":"+SUM(G18:G21)","v":0},null,"DIVERSEN / INHAAL",{"$nulls":5},{"$f":"SUM(O18:O21)","v":0}]
[]
["OPGELEGD (Jeugd <16 en 65+)"]
[1,{"$f":"IF($G$3=\"k\",IF(VLOOKUP($D25,invullijst!$A$11:$M$196,11,FALSE)=0,\" \",VLOOKUP($D25,invullijst!$A$11:$M$196,11,FALSE)),\"\")","v":""},{"$f":"IF(VLOOKUP(D25,invullijst!A$11:F$237,4,FALSE)=\"\",\"\",VLOOKUP(D25,invullijst!A$11:D$237,4,FALSE))","v":"65+"},509,{"$f":"IF(VLOOKUP($D25,invullijst!$A$11:$M$196,2,FALSE)=\"\",\"\",VLOOKUP($D25,invullijst!$A$11:$M$196,2,FALSE))","v":"Adwan de Pinth"},null,{"$f":"IF(VLOOKUP($D25,invullijst!$A$11:$M$196,6,FALSE)=0,\"\",VLOOKUP($D25,invullijst!$A$11:$M$196,6,FALSE))","v":96},null,1,{"$f":"IF($O$3=\"k\",IF(VLOOKUP($L25,invullijst!$A$11:$M$196,11,FALSE)=0,\" \",VLOOKUP($L25,invullijst!$A$11:$M$196,11,FALSE)),\"\")","v":""},{"$f":"IF(VLOOKUP($L25,invullijst!$A$11:$M$237,4,FALSE)=\"\",\"\",VLOOKUP($L25,invullijst!$A$11:$M$237,4,FALSE))","v":"65+"},107,{"$f":"IF(VLOOKUP($L25,invullijst!$A$11:$M$196,2,FALSE)=\"\",\"\",VLOOKUP($L25,invullijst!$A$11:$M$196,2,FALSE))","v":"Cees Coppens"},null,{"$f":"IF(VLOOKUP($L25,invullijst!$A$11:$M$196,6,FALSE)=0,\"\",VLOOKUP($L25,invullijst!$A$11:$M$196,6,FALSE))","v":86}]
[2,{"$f":"IF($G$3=\"k\",IF(VLOOKUP($D26,invullijst!$A$11:$M$196,11,FALSE)=0,\" \",VLOOKUP($D26,invullijst!$A$11:$M$196,11,FALSE)),\"\")","v":""},{"$f":"IF(VLOOKUP(D26,invullijst!A$11:F$237,4,FALSE)=\"\",\"\",VLOOKUP(D26,invullijst!A$11:D$237,4,FALSE))","v":"65+"},517,{"$f":"IF(VLOOKUP($D26,invullijst!$A$11:$M$196,2,FALSE)=\"\",\"\",VLOOKUP($D26,invullijst!$A$11:$M$196,2,FALSE))","v":"Diny Vos (disp)"},null,{"$f":"IF(VLOOKUP($D26,invullijst!$A$11:$M$196,6,FALSE)=0,\"\",VLOOKUP($D26,invullijst!$A$11:$M$196,6,FALSE))","v":90},null,2,{"$f":"IF($O$3=\"k\",IF(VLOOKUP($L26,invullijst!$A$11:$M$196,11,FALSE)=0,\" \",VLOOKUP($L26,invullijst!$A$11:$M$196,11,FALSE)),\"\")","v":""},{"$f":"IF(VLOOKUP($L26,invullijst!$A$11:$M$237,4,FALSE)=\"\",\"\",VLOOKUP($L26,invullijst!$A$11:$M$237,4,FALSE))","v":"65+"},102,{"$f":"IF(VLOOKUP($L26,invullijst!$A$11:$M$196,2,FALSE)=\"\",\"\",VLOOKUP($L26,invullijst!$A$11:$M$196,2,FALSE))","v":"John de Jong (disp)"},null,{"$f":"IF(VLOOKUP($L26,invullijst!$A$11:$M$196,6,FALSE)=0,\"\",VLOOKUP($L26,invullijst!$A$11:$M$196,6,FALSE))","v":90}]
[3,{"$f":"IF($G$3=\"k\",IF(VLOOKUP($D27,invullijst!$A$11:$M$196,11,FALSE)=0,\" \",VLOOKUP($D27,invullijst!$A$11:$M$196,11,FALSE)),\"\")","v":""},{"$f":"IF(VLOOKUP(D27,invullijst!A$11:F$237,4,FALSE)=\"\",\"\",VLOOKUP(D27,invullijst!A$11:D$237,4,FALSE))","v":"65+"},503,{"$f":"IF(VLOOKUP($D27,invullijst!$A$11:$M$196,2,FALSE)=\"\",\"\",VLOOKUP($D27,invullijst!$A$11:$M$196,2,FALSE))","v":"Kees Vos (disp)"},null,{"$f":"IF(VLOOKUP($D27,invullijst!$A$11:$M$196,6,FALSE)=0,\"\",VLOOKUP($D27,invullijst!$A$11:$M$196,6,FALSE))","v":87},null,3,{"$f":"IF($O$3=\"k\",IF(VLOOKUP($L27,invullijst!$A$11:$M$196,11,FALSE)=0,\" \",VLOOKUP($L27,invullijst!$A$11:$M$196,11,FALSE)),\"\")","v":""},{"$f":"IF(VLOOKUP($L27,invullijst!$A$11:$M$237,4,FALSE)=\"\",\"\",VLOOKUP($L27,invullijst!$A$11:$M$237,4,FALSE))","v":"65+"},104,{"$f":"IF(VLOOKUP($L27,invullijst!$A$11:$M$196,2,FALSE)=\"\",\"\",VLOOKUP($L27,invullijst!$A$11:$M$196,2,FALSE))","v":"Peter Brekelmans"},null,{"$f":"IF(VLOOKUP($L27,invullijst!$A$11:$M$196,6,FALSE)=0,\"\",VLOOKUP($L27,invullijst!$A$11:$M$196,6,FALSE))","v":75}]
["Totaal korps opgelegd A1",{"$nulls":5},{"$f":"SUM(G25:G27)","v":273},null,"Totaal korps opgelegd A1",{"$nulls":5},{"$f":"SUM(O25:O27)","v":251}]
[]
[1,{"$f":"IF($G$3=\"k\",IF(VLOOKUP($D30,invullijst!$A$11:$M$196,11,FALSE)=0,\" \",VLOOKUP($D30,invullijst!$A$11:$M$196,11,FALSE)),\"\")","v":""},{"$f":"IF(VLOOKUP(D30,invullijst!A$11:F$237,4,FALSE)=\"\",\"\",VLOOKUP(D30,invullijst!A$11:D$237,4,FALSE))","v":"65+"},515,{"$f":"IF(VLOOKUP($D30,invullijst!$A$11:$M$196,2,FALSE)=\"\",\"\",VLOOKUP($D30,invullijst!$A$11:$M$196,2,FALSE))","v":"Ilona Bergakker (disp)"},null,{"$f":"IF(VLOOKUP($D30,invullijst!$A$11:$M$196,6,FALSE)=0,\"\",VLOOKUP($D30,invullijst!$A$11:$M$196,6,FALSE))","v":89},null,1,{"$f":"IF($O$3=\"k\",IF(VLOOKUP($L30,invullijst!$A$11:$M$196,11,FALSE)=0,\" \",VLOOKUP($L30,invullijst!$A$11:$M$196,11,FALSE)),\"\")","v":""},{"$f":"IF(VLOOKUP($L30,invullijst!$A$11:$M$237,4,FALSE)=\"\",\"\",VLOOKUP($L30,invullijst!$A$11:$M$237,4,FALSE))","v":"65+"},112,{"$f":"IF(VLOOKUP($L30,invullijst!$A$11:$M$196,2,FALSE)=\"\",\"\",VLOOKUP($L30,invullijst!$A$11:$M$196,2,FALSE))","v":"Toon van Buul"},null,{"$f":"IF(VLOOKUP($L30,invullijst!$A$11:$M$196,6,FALSE)=0,\"\",VLOOKUP($L30,invullijst!$A$11:$M$196,6,FALSE))","v":54}]
[2,{"$f":"IF($G$3=\"k\",IF(VLOOKUP($D31,invullijst!$A$11:$M$196,11,FALSE)=0,\" \",VLOOKUP($D31,invullijst!$A$11:$M$196,11,FALSE)),\"\")","v":""},{"$f":"IF(VLOOKUP(D31,invullijst!A$11:F$237,4,FALSE)=\"\",\"\",VLOOKUP(D31,invullijst!A$11:D$237,4,FALSE))","v":"65+"},516,{"$f":"IF(VLOOKUP($D31,invullijst!$A$11:$M$196,2,FALSE)=\"\",\"\",VLOOKUP($D31,invullijst!$A$11:$M$196,2,FALSE))","v":"Henry Bergakker (disp)"},null,{"$f":"IF(VLOOKUP($D31,invullijst!$A$11:$M$196,6,FALSE)=0,\"\",VLOOKUP($D31,invullijst!$A$11:$M$196,6,FALSE))","v":93},null,2,{"$f":"IF($O$3=\"k\",IF(VLOOKUP($L31,invullijst!$A$11:$M$196,11,FALSE)=0,\" \",VLOOKUP($L31,invullijst!$A$11:$M$196,11,FALSE)),\"\")","v":""},{"$f":"IF(VLOOKUP($L31,invullijst!$A$11:$M$237,4,FALSE)=\"\",\"\",VLOOKUP($L31,invullijst!$A$11:$M$237,4,FALSE))","v":0},null,{"$f":"IF(VLOOKUP($L31,invullijst!$A$11:$M$196,2,FALSE)=\"\",\"\",VLOOKUP($L31,invullijst!$A$11:$M$196,2,FALSE))","v":0},null,{"$f":"IF(VLOOKUP($L31,invullijst!$A$11:$M$196,6,FALSE)=0,\"\",VLOOKUP($L31,invullijst!$A$11:$M$196,6,FALSE))","v":""}]
[3,{"$f":"IF($G$3=\"k\",IF(VLOOKUP($D32,invullijst!$A$11:$M$196,11,FALSE)=0,\" \",VLOOKUP($D32,invullijst!$A$11:$M$196,11,FALSE)),\"\")","v":""},{"$f":"IF(VLOOKUP(D32,invullijst!A$11:F$237,4,FALSE)=\"\",\"\",VLOOKUP(D32,invullijst!A$11:D$237,4,FALSE))","v":"65+"},518,{"$f":"IF(VLOOKUP($D32,invullijst!$A$11:$M$196,2,FALSE)=\"\",\"\",VLOOKUP($D32,invullijst!$A$11:$M$196,2,FALSE))","v":"Ton Stanz"},null,{"$f":"IF(VLOOKUP($D32,invullijst!$A$11:$M$196,6,FALSE)=0,\"\",VLOOKUP($D32,invullijst!$A$11:$M$196,6,FALSE))","v":80},null,3,{"$f":"IF($O$3=\"k\",IF(VLOOKUP($L32,invullijst!$A$11:$M$196,11,FALSE)=0,\" \",VLOOKUP($L32,invullijst!$A$11:$M$196,11,FALSE)),\"\")","v":""},{"$f":"IF(VLOOKUP($L32,invullijst!$A$11:$M$237,4,FALSE)=\"\",\"\",VLOOKUP($L32,invullijst!$A$11:$M$237,4,FALSE))","v":0},null,{"$f":"IF(VLOOKUP($L32,invullijst!$A$11:$M$196,2,FALSE)=\"\",\"\",VLOOKUP($L32,invullijst!$A$11:$M$196,2,FALSE))","v":0},null,{"$f":"IF(VLOOKUP($L32,invullijst!$A$11:$M$196,6,FALSE)=0,\"\",VLOOKUP($L32,invullijst!$A$11:$M$196,6,FALSE))","v":""}]
["Totaal korps opgelegd A2",{"$nulls":5},{"$f":"SUM(G30:G32)","v":262},null,"Totaal korps opgelegd A2",{"$nulls":5},{"$f":"SUM(O30:O32)","v":54}]
[]
[1,{"$f":"IF($G$3=\"k\",IF(VLOOKUP($D35,invullijst!$A$11:$M$196,11,FALSE)=0,\" \",VLOOKUP($D35,invullijst!$A$11:$M$196,11,FALSE)),\"\")","v":""},{"$f":"IF(VLOOKUP(D35,invullijst!A$11:F$237,4,FALSE)=\"\",\"\",VLOOKUP(D35,invullijst!A$11:D$237,4,FALSE))","v":"J"},502,{"$f":"IF(VLOOKUP($D35,invullijst!$A$11:$M$196,2,FALSE)=\"\",\"\",VLOOKUP($D35,invullijst!$A$11:$M$196,2,FALSE))","v":"Djody Wagemakers"},null,{"$f":"IF(VLOOKUP($D35,invullijst!$A$11:$M$196,6,FALSE)=0,\"\",VLOOKUP($D35,invullijst!$A$11:$M$196,6,FALSE))","v":93},null,1,{"$f":"IF($O$3=\"k\",IF(VLOOKUP($L35,invullijst!$A$11:$M$196,11,FALSE)=0,\" \",VLOOKUP($L35,invullijst!$A$11:$M$196,11,FALSE)),\"\")","v":""},{"$f":"IF(VLOOKUP($L35,invullijst!$A$11:$M$237,4,FALSE)=\"\",\"\",VLOOKUP($L35,invullijst!$A$11:$M$237,4,FALSE))","v":0},null,{"$f":"IF(VLOOKUP($L35,invullijst!$A$11:$M$196,2,FALSE)=\"\",\"\",VLOOKUP($L35,invullijst!$A$11:$M$196,2,FALSE))","v":0},null,{"$f":"IF(VLOOKUP($L35,invullijst!$A$11:$M$196,6,FALSE)=0,\"\",VLOOKUP($L35,invullijst!$A$11:$M$196,6,FALSE))","v":""}]
[2,{"$f":"IF($G$3=\"k\",IF(VLOOKUP($D36,invullijst!$A$11:$M$196,11,FALSE)=0,\" \",VLOOKUP($D36,invullijst!$A$11:$M$196,11,FALSE)),\"\")","v":""},{"$f":"IF(VLOOKUP(D36,invullijst!A$11:F$237,4,FALSE)=\"\",\"\",VLOOKUP(D36,invullijst!A$11:D$237,4,FALSE))","v":0},null,{"$f":"IF(VLOOKUP($D36,invullijst!$A$11:$M$196,2,FALSE)=\"\",\"\",VLOOKUP($D36,invullijst!$A$11:$M$196,2,FALSE))","v":0},null,{"$f":"IF(VLOOKUP($D36,invullijst!$A$11:$M$196,6,FALSE)=0,\"\",VLOOKUP($D36,invullijst!$A$11:$M$196,6,FALSE))","v":""},null,2,{"$f":"IF($O$3=\"k\",IF(VLOOKUP($L36,invullijst!$A$11:$M$196,11,FALSE)=0,\" \",VLOOKUP($L36,invullijst!$A$11:$M$196,11,FALSE)),\"\")","v":""},{"$f":"IF(VLOOKUP($L36,invullijst!$A$11:$M$237,4,FALSE)=\"\",\"\",VLOOKUP($L36,invullijst!$A$11:$M$237,4,FALSE))","v":0},null,{"$f":"IF(VLOOKUP($L36,invullijst!$A$11:$M$196,2,FALSE)=\"\",\"\",VLOOKUP($L36,invullijst!$A$11:$M$196,2,FALSE))","v":0},null,{"$f":"IF(VLOOKUP($L36,invullijst!$A$11:$M$196,6,FALSE)=0,\"\",VLOOKUP($L36,invullijst!$A$11:$M$196,6,FALSE))","v":""}]
[3,{"$f":"IF($G$3=\"k\",IF(VLOOKUP($D37,invullijst!$A$11:$M$196,11,FALSE)=0,\" \",VLOOKUP($D37,invullijst!$A$11:$M$196,11,FALSE)),\"\")","v":""},{"$f":"IF(VLOOKUP(D37,invullijst!A$11:F$237,4,FALSE)=\"\",\"\",VLOOKUP(D37,invullijst!A$11:D$237,4,FALSE))","v":0},null,{"$f":"IF(VLOOKUP($D37,invullijst!$A$11:$M$196,2,FALSE)=\"\",\"\",VLOOKUP($D37,invullijst!$A$11:$M$196,2,FALSE))","v":0},null,{"$f":"IF(VLOOKUP($D37,invullijst!$A$11:$M$196,6,FALSE)=0,\"\",VLOOKUP($D37,invullijst!$A$11:$M$196,6,FALSE))","v":""},null,3,{"$f":"IF($O$3=\"k\",IF(VLOOKUP($L37,invullijst!$A$11:$M$196,11,FALSE)=0,\" \",VLOOKUP($L37,invullijst!$A$11:$M$196,11,FALSE)),\"\")","v":""},{"$f":"IF(VLOOKUP($L37,invullijst!$A$11:$M$237,4,FALSE)=\"\",\"\",VLOOKUP($L37,invullijst!$A$11:$M$237,4,FALSE))","v":0},null,{"$f":"IF(VLOOKUP($L37,invullijst!$A$11:$M$196,2,FALSE)=\"\",\"\",VLOOKUP($L37,invullijst!$A$11:$M$196,2,FALSE))","v":0},null,{"$f":"IF(VLOOKUP($L37,invullijst!$A$11:$M$196,6,FALSE)=0,\"\",VLOOKUP($L37,invullijst!$A$11:$M$196,6,FALSE))","v":""}]
["Totaal korps opgelegd A3",{"$nulls":5},{"$f":"SUM(G35:G37)","v":93},null,"Totaal korps opgelegd A3",{"$nulls":5},{"$f":"SUM(O35:O37)","v":0}]

{"sheet":"wedstrijd 1B","index":6,"n_rows":38,"n_cols":15,"rows_kept":38,"merged":[[0,0,0,4],[0,5,0,7],[0,8,0,14],[1,0,1,11],[1,12,1,14],[2,1,2,5],[2,9,2,13],[4,0,4,14],[5,4,5,5],[5,12,5,13],[6,4,6,5],[6,12,6,13],[7,4,7,5],[7,12,7,13],[8,4,8,5],[8,12,8,13],[9,0,9,5],[9,8,9,13],[11,4,11,5],[11,12,11,13],[12,4,12,5],[12,12,12,13],[13,4,13,5],[13,12,13,13],[14,4,14,5],[14,12,14,13],[15,0,15,5],[15,8,15,13],[17,4,17,5],[17,12,17,13],[18,4,18,5],[18,12,18,13],[19,4,19,5],[19,12,19,13],[20,4,20,5],[20,12,20,13],[21,0,21,5],[21,8,21,13],[23,0,23,14],[24,4,24,5],[24,12,24,13],[25,4,25,5],[25,12,25,13],[26,4,26,5],[26,12,26,13],[27,0,27,5],[27,8,27,13],[29,4,29,5],[29,12,29,13],[30,4,30,5],[30,12,30,13],[31,4,31,5],[31,12,31,13],[32,0,32,5],[32,8,32,13],[34,4,34,5],[34,12,34,13],[35,4,35,5],[35,12,35,13],[36,4,36,5],[36,12,36,13],[37,0,37,5],[37,8,37,13]]}
[{"$f":"invullijst!F1","v":"Organistatie"},{"$nulls":4},{"$f":"invullijst!H2","v":"2025 - 2026"},null,null,{"$f":"invullijst!F3","v":"Sint Ambrosius Baardwijk"}]
["Datum: ",{"$nulls":11},"2025-12-07"]
[2,{"$f":"IF(VLOOKUP(A3,invullijst!A1:F5,2,FALSE)=\"\",\"\",VLOOKUP(A3,invullijst!A1:F5,2,FALSE))","v":"St. Crispinus & Crispinianus Besoijen"},{"$nulls":6},4,{"$f":"IF(VLOOKUP(I3,invullijst!A1:C5,2,FALSE)=\"\",\"\",VLOOKUP(I3,invullijst!A1:C5,2,FALSE))","v":"Sint Ambrosius Haarsteeg"}]
[]
["vrijehand"]
[1,{"$f":"IF($G$3=\"k\",IF(VLOOKUP($D6,invullijst!$A$11:$M$196,11,FALSE)=0,\" \",VLOOKUP($D6,invullijst!$A$11:$M$196,11,FALSE)),\"\")","v":""},{"$f":"IF(VLOOKUP(D6,invullijst!A$11:F$237,4,FALSE)=\"\",\"\",VLOOKUP(D6,invullijst!A$11:D$237,4,FALSE))","v":"vr"},210,{"$f":"IF(VLOOKUP($D6,invullijst!$A$11:$M$196,2,FALSE)=\"\",\"\",VLOOKUP($D6,invullijst!$A$11:$M$196,2,FALSE))","v":"Sander Oome"},null,{"$f":"IF(VLOOKUP($D6,invullijst!$A$11:$M$196,6,FALSE)=0,\"\",VLOOKUP($D6,invullijst!$A$11:$M$196,6,FALSE))","v":83},null,1,{"$f":"IF($O$3=\"k\",IF(VLOOKUP($L6,invullijst!$A$11:$M$196,11,FALSE)=0,\" \",VLOOKUP($L6,invullijst!$A$11:$M$196,11,FALSE)),\"\")","v":""},{"$f":"IF(VLOOKUP($L6,invullijst!$A$11:$M$237,4,FALSE)=\"\",\"\",VLOOKUP($L6,invullijst!$A$11:$M$237,4,FALSE))","v":"vr"},406,{"$f":"IF(VLOOKUP($L6,invullijst!$A$11:$M$196,2,FALSE)=\"\",\"\",VLOOKUP($L6,invullijst!$A$11:$M$196,2,FALSE))","v":"Jeroen van Oss"},null,{"$f":"IF(VLOOKUP($L6,invullijst!$A$11:$M$196,6,FALSE)=0,\"\",VLOOKUP($L6,invullijst!$A$11:$M$196,6,FALSE))","v":77}]
[2,{"$f":"IF($G$3=\"k\",IF(VLOOKUP($D7,invullijst!$A$11:$M$196,11,FALSE)=0,\" \",VLOOKUP($D7,invullijst!$A$11:$M$196,11,FALSE)),\"\")","v":""},{"$f":"IF(VLOOKUP(D7,invullijst!A$11:F$237,4,FALSE)=\"\",\"\",VLOOKUP(D7,invullijst!A$11:D$237,4,FALSE))","v":"vr"},216,{"$f":"IF(VLOOKUP($D7,invullijst!$A$11:$M$196,2,FALSE)=\"\",\"\",VLOOKUP($D7,invullijst!$A$11:$M$196,2,FALSE))","v":"Pieter Laghuwitz"},null,{"$f":"IF(VLOOKUP($D7,invullijst!$A$11:$M$196,6,FALSE)=0,\"\",VLOOKUP($D7,invullijst!$A$11:$M$196,6,FALSE))","v":92},null,2,{"$f":"IF($O$3=\"k\",IF(VLOOKUP($L7,invullijst!$A$11:$M$196,11,FALSE)=0,\" \",VLOOKUP($L7,invullijst!$A$11:$M$196,11,FALSE)),\"\")","v":""},{"$f":"IF(VLOOKUP($L7,invullijst!$A$11:$M$237,4,FALSE)=\"\",\"\",VLOOKUP($L7,invullijst!$A$11:$M$237,4,FALSE))","v":"vr"},409,{"$f":"IF(VLOOKUP($L7,invullijst!$A$11:$M$196,2,FALSE)=\"\",\"\",VLOOKUP($L7,invullijst!$A$11:$M$196,2,FALSE))","v":"Thijs Koks"},null,{"$f":"IF(VLOOKUP($L7,invullijst!$A$11:$M$196,6,FALSE)=0,\"\",VLOOKUP($L7,invullijst!$A$11:$M$196,6,FALSE))","v":84}]
[3,{"$f":"IF($G$3=\"k\",IF(VLOOKUP($D8,invullijst!$A$11:$M$196,11,FALSE)=0,\" \",VLOOKUP($D8,invullijst!$A$11:$M$196,11,FALSE)),\"\")","v":""},{"$f":"IF(VLOOKUP(D8,invullijst!A$11:F$237,4,FALSE)=\"\",\"\",VLOOKUP(D8,invullijst!A$11:D$237,4,FALSE))","v":"vr"},203,{"$f":"IF(VLOOKUP($D8,invullijst!$A$11:$M$196,2,FALSE)=\"\",\"\",VLOOKUP($D8,invullijst!$A$11:$M$196,2,FALSE))","v":"Frank van den Houdt"},null,{"$f":"IF(VLOOKUP($D8,invullijst!$A$11:$M$196,6,FALSE)=0,\"\",VLOOKUP($D8,invullijst!$A$11:$M$196,6,FALSE))","v":87},null,3,{"$f":"IF($O$3=\"k\",IF(VLOOKUP($L8,invullijst!$A$11:$M$196,11,FALSE)=0,\" \",VLOOKUP($L8,invullijst!$A$11:$M$196,11,FALSE)),\"\")","v":""},{"$f":"IF(VLOOKUP($L8,invullijst!$A$11:$M$237,4,FALSE)=\"\",\"\",VLOOKUP($L8,invullijst!$A$11:$M$237,4,FALSE))","v":"vr"},410,{"$f":"IF(VLOOKUP($L8,invullijst!$A$11:$M$196,2,FALSE)=\"\",\"\",VLOOKUP($L8,invullijst!$A$11:$M$196,2,FALSE))","v":"Tonnie Koks"},null,{"$f":"IF(VLOOKUP($L8,invullijst!$A$11:$M$196,6,FALSE)=0,\"\",VLOOKUP($L8,invullijst!$A$11:$M$196,6,FALSE))","v":79}]
[4,{"$f":"IF($G$3=\"k\",IF(VLOOKUP($D9,invullijst!$A$11:$M$196,11,FALSE)=0,\" \",VLOOKUP($D9,invullijst!$A$11:$M$196,11,FALSE)),\"\")","v":""},{"$f":"IF(VLOOKUP(D9,invullijst!A$11:F$237,4,FALSE)=\"\",\"\",VLOOKUP(D9,invullijst!A$11:D$237,4,FALSE))","v":"vr"},205,{"$f":"IF(VLOOKUP($D9,invullijst!$A$11:$M$196,2,FALSE)=\"\",\"\",VLOOKUP($D9,invullijst!$A$11:$M$196,2,FALSE))","v":"Jos v/d Snepscheut"},null,{"$f":"IF(VLOOKUP($D9,invullijst!$A$11:$M$196,6,FALSE)=0,\"\",VLOOKUP($D9,invullijst!$A$11:$M$196,6,FALSE))","v":70},null,4,{"$f":"IF($O$3=\"k\",IF(VLOOKUP($L9,invullijst!$A$11:$M$196,11,FALSE)=0,\" \",VLOOKUP($L9,invullijst!$A$11:$M$196,11,FALSE)),\"\")","v":""},{"$f":"IF(VLOOKUP($L9,invullijst!$A$11:$M$237,4,FALSE)=\"\",\"\",VLOOKUP($L9,invullijst!$A$11:$M$237,4,FALSE))","v":"vr"},408,{"$f":"IF(VLOOKUP($L9,invullijst!$A$11:$M$196,2,FALSE)=\"\",\"\",VLOOKUP($L9,invullijst!$A$11:$M$196,2,FALSE))","v":"Rudy van Falier"},null,{"$f":"IF(VLOOKUP($L9,invullijst!$A$11:$M$196,6,FALSE)=0,\"\",VLOOKUP($L9,invullijst!$A$11:$M$196,6,FALSE))","v":80}]
["Totaal A korps",{"$nulls":5},{"$f":"SUM(G6:G9)","v":332},null,"Totaal A korps",{"$nulls":5},{"$f":"SUM(O6:O9)","v":320}]
[]
[1,{"$f":"IF($G$3=\"k\",IF(VLOOKUP($D12,invullijst!$A$11:$M$196,11,FALSE)=0,\" \",VLOOKUP($D12,invullijst!$A$11:$M$196,11,FALSE)),\"\")","v":""},{"$f":"IF(VLOOKUP(D12,invullijst!A$11:F$237,4,FALSE)=\"\",\"\",VLOOKUP(D12,invullijst!A$11:D$237,4,FALSE))","v":"vr"},209,{"$f":"IF(VLOOKUP($D12,invullijst!$A$11:$M$196,2,FALSE)=\"\",\"\",VLOOKUP($D12,invullijst!$A$11:$M$196,2,FALSE))","v":"René van Kuijk"},null,{"$f":"IF(VLOOKUP($D12,invullijst!$A$11:$M$196,6,FALSE)=0,\"\",VLOOKUP($D12,invullijst!$A$11:$M$196,6,FALSE))","v":76},null,1,{"$f":"IF($O$3=\"k\",IF(VLOOKUP($L12,invullijst!$A$11:$M$196,11,FALSE)=0,\" \",VLOOKUP($L12,invullijst!$A$11:$M$196,11,FALSE)),\"\")","v":""},{"$f":"IF(VLOOKUP($L12,invullijst!$A$11:$M$237,4,FALSE)=\"\",\"\",VLOOKUP($L12,invullijst!$A$11:$M$237,4,FALSE))","v":"vr"},402,{"$f":"IF(VLOOKUP($L12,invullijst!$A$11:$M$196,2,FALSE)=\"\",\"\",VLOOKUP($L12,invullijst!$A$11:$M$196,2,FALSE))","v":"Daniëlle v/d Lee"},null,{"$f":"IF(VLOOKUP($L12,invullijst!$A$11:$M$196,6,FALSE)=0,\"\",VLOOKUP($L12,invullijst!$A$11:$M$196,6,FALSE))","v":81}]
[2,{"$f":"IF($G$3=\"k\",IF(VLOOKUP($D13,invullijst!$A$11:$M$196,11,FALSE)=0,\" \",VLOOKUP($D13,invullijst!$A$11:$M$196,11,FALSE)),\"\")","v":""},{"$f":"IF(VLOOKUP(D13,invullijst!A$11:F$237,4,FALSE)=\"\",\"\",VLOOKUP(D13,invullijst!A$11:D$237,4,FALSE))","v":"vr"},217,{"$f":"IF(VLOOKUP($D13,invullijst!$A$11:$M$196,2,FALSE)=\"\",\"\",VLOOKUP($D13,invullijst!$A$11:$M$196,2,FALSE))","v":"Hans Laghuwitz"},null,{"$f":"IF(VLOOKUP($D13,invullijst!$A$11:$M$196,6,FALSE)=0,\"\",VLOOKUP($D13,invullijst!$A$11:$M$196,6,FALSE))","v":76},null,2,{"$f":"IF($O$3=\"k\",IF(VLOOKUP($L13,invullijst!$A$11:$M$196,11,FALSE)=0,\" \",VLOOKUP($L13,invullijst!$A$11:$M$196,11,FALSE)),\"\")","v":""},{"$f":"IF(VLOOKUP($L13,invullijst!$A$11:$M$237,4,FALSE)=\"\",\"\",VLOOKUP($L13,invullijst!$A$11:$M$237,4,FALSE))","v":"vr"},411,{"$f":"IF(VLOOKUP($L13,invullijst!$A$11:$M$196,2,FALSE)=\"\",\"\",VLOOKUP($L13,invullijst!$A$11:$M$196,2,FALSE))","v":"Wilma v/d Lee"},null,{"$f":"IF(VLOOKUP($L13,invullijst!$A$11:$M$196,6,FALSE)=0,\"\",VLOOKUP($L13,invullijst!$A$11:$M$196,6,FALSE))","v":78}]
[3,{"$f":"IF($G$3=\"k\",IF(VLOOKUP($D14,invullijst!$A$11:$M$196,11,FALSE)=0,\" \",VLOOKUP($D14,invullijst!$A$11:$M$196,11,FALSE)),\"\")","v":""},{"$f":"IF(VLOOKUP(D14,invullijst!A$11:F$237,4,FALSE)=\"\",\"\",VLOOKUP(D14,invullijst!A$11:D$237,4,FALSE))","v":"vr"},204,{"$f":"IF(VLOOKUP($D14,invullijst!$A$11:$M$196,2,FALSE)=\"\",\"\",VLOOKUP($D14,invullijst!$A$11:$M$196,2,FALSE))","v":"Harry de Louw"},null,{"$f":"IF(VLOOKUP($D14,invullijst!$A$11:$M$196,6,FALSE)=0,\"\",VLOOKUP($D14,invullijst!$A$11:$M$196,6,FALSE))","v":84},null,3,{"$f":"IF($O$3=\"k\",IF(VLOOKUP($L14,invullijst!$A$11:$M$196,11,FALSE)=0,\" \",VLOOKUP($L14,invullijst!$A$11:$M$196,11,FALSE)),\"\")","v":""},{"$f":"IF(VLOOKUP($L14,invullijst!$A$11:$M$237,4,FALSE)=\"\",\"\",VLOOKUP($L14,invullijst!$A$11:$M$237,4,FALSE))","v":0},null,{"$f":"IF(VLOOKUP($L14,invullijst!$A$11:$M$196,2,FALSE)=\"\",\"\",VLOOKUP($L14,invullijst!$A$11:$M$196,2,FALSE))","v":0},null,{"$f":"IF(VLOOKUP($L14,invullijst!$A$11:$M$196,6,FALSE)=0,\"\",VLOOKUP($L14,invullijst!$A$11:$M$196,6,FALSE))","v":""}]
[4,{"$f":"IF($G$3=\"k\",IF(VLOOKUP($D15,invullijst!$A$11:$M$196,11,FALSE)=0,\" \",VLOOKUP($D15,invullijst!$A$11:$M$196,11,FALSE)),\"\")","v":""},{"$f":"IF(VLOOKUP(D15,invullijst!A$11:F$237,4,FALSE)=\"\",\"\",VLOOKUP(D15,invullijst!A$11:D$237,4,FALSE))","v":"vr"},206,{"$f":"IF(VLOOKUP($D15,invullijst!$A$11:$M$196,2,FALSE)=\"\",\"\",VLOOKUP($D15,invullijst!$A$11:$M$196,2,FALSE))","v":"Kees van Hulten"},null,{"$f":"IF(VLOOKUP($D15,invullijst!$A$11:$M$196,6,FALSE)=0,\"\",VLOOKUP($D15,invullijst!$A$11:$M$196,6,FALSE))","v":77},null,4,{"$f":"IF($O$3=\"k\",IF(VLOOKUP($L15,invullijst!$A$11:$M$196,11,FALSE)=0,\" \",VLOOKUP($L15,invullijst!$A$11:$M$196,11,FALSE)),\"\")","v":""},{"$f":"IF(VLOOKUP($L15,invullijst!$A$11:$M$237,4,FALSE)=\"\",\"\",VLOOKUP($L15,invullijst!$A$11:$M$237,4,FALSE))","v":0},null,{"$f":"IF(VLOOKUP($L15,invullijst!$A$11:$M$196,2,FALSE)=\"\",\"\",VLOOKUP($L15,invullijst!$A$11:$M$196,2,FALSE))","v":0},null,{"$f":"IF(VLOOKUP($L15,invullijst!$A$11:$M$196,6,FALSE)=0,\"\",VLOOKUP($L15,invullijst!$A$11:$M$196,6,FALSE))","v":""}]
["Totaal B1 korps",{"$nulls":5},{"$f":"SUM(G12:G15)","v":313},null,"Totaal B1 korps",{"$nulls":5},{"$f":"SUM(O12:O15)","v":159}]
[]
[1,{"$f":"IF($G$3=\"k\",IF(VLOOKUP($D18,invullijst!$A$11:$M$196,11,FALSE)=0,\" \",VLOOKUP($D18,invullijst!$A$11:$M$196,11,FALSE)),\"\")","v":""},{"$f":"IF(VLOOKUP(D18,invullijst!A$11:F$237,4,FALSE)=\"\",\"\",VLOOKUP(D18,invullijst!A$11:D$237,4,FALSE))","v":"vr"},213,{"$f":"IF(VLOOKUP($D18,invullijst!$A$11:$M$196,2,FALSE)=\"\",\"\",VLOOKUP($D18,invullijst!$A$11:$M$196,2,FALSE))","v":"Roland van Delft"},null,{"$f":"IF(VLOOKUP($D18,invullijst!$A$11:$M$196,6,FALSE)=0,\"\",VLOOKUP($D18,invullijst!$A$11:$M$196,6,FALSE))","v":52},null,1,{"$f":"IF($O$3=\"k\",IF(VLOOKUP($L18,invullijst!$A$11:$M$196,11,FALSE)=0,\" \",VLOOKUP($L18,invullijst!$A$11:$M$196,11,FALSE)),\"\")","v":""},{"$f":"IF(VLOOKUP($L18,invullijst!$A$11:$M$237,4,FALSE)=\"\",\"\",VLOOKUP($L18,invullijst!$A$11:$M$237,4,FALSE))","v":0},null,{"$f":"IF(VLOOKUP($L18,invullijst!$A$11:$M$196,2,FALSE)=\"\",\"\",VLOOKUP($L18,invullijst!$A$11:$M$196,2,FALSE))","v":0},null,{"$f":"IF(VLOOKUP($L18,invullijst!$A$11:$M$196,6,FALSE)=0,\"\",VLOOKUP($L18,invullijst!$A$11:$M$196,6,FALSE))","v":""}]
[2,{"$f":"IF($G$3=\"k\",IF(VLOOKUP($D19,invullijst!$A$11:$M$196,11,FALSE)=0,\" \",VLOOKUP($D19,invullijst!$A$11:$M$196,11,FALSE)),\"\")","v":""},{"$f":"IF(VLOOKUP(D19,invullijst!A$11:F$237,4,FALSE)=\"\",\"\",VLOOKUP(D19,invullijst!A$11:D$237,4,FALSE))","v":"vr"},222,{"$f":"IF(VLOOKUP($D19,invullijst!$A$11:$M$196,2,FALSE)=\"\",\"\",VLOOKUP($D19,invullijst!$A$11:$M$196,2,FALSE))","v":"Nick de Vaan"},null,{"$f":"IF(VLOOKUP($D19,invullijst!$A$11:$M$196,6,FALSE)=0,\"\",VLOOKUP($D19,invullijst!$A$11:$M$196,6,FALSE))","v":80},null,2,{"$f":"IF($O$3=\"k\",IF(VLOOKUP($L19,invullijst!$A$11:$M$196,11,FALSE)=0,\" \",VLOOKUP($L19,invullijst!$A$11:$M$196,11,FALSE)),\"\")","v":""},{"$f":"IF(VLOOKUP($L19,invullijst!$A$11:$M$237,4,FALSE)=\"\",\"\",VLOOKUP($L19,invullijst!$A$11:$M$237,4,FALSE))","v":0},null,{"$f":"IF(VLOOKUP($L19,invullijst!$A$11:$M$196,2,FALSE)=\"\",\"\",VLOOKUP($L19,invullijst!$A$11:$M$196,2,FALSE))","v":0},null,{"$f":"IF(VLOOKUP($L19,invullijst!$A$11:$M$196,6,FALSE)=0,\"\",VLOOKUP($L19,invullijst!$A$11:$M$196,6,FALSE))","v":""}]
[3,{"$f":"IF($G$3=\"k\",IF(VLOOKUP($D20,invullijst!$A$11:$M$196,11,FALSE)=0,\" \",VLOOKUP($D20,invullijst!$A$11:$M$196,11,FALSE)),\"\")","v":""},{"$f":"IF(VLOOKUP(D20,invullijst!A$11:F$237,4,FALSE)=\"\",\"\",VLOOKUP(D20,invullijst!A$11:D$237,4,FALSE))","v":0},null,{"$f":"IF(VLOOKUP($D20,invullijst!$A$11:$M$196,2,FALSE)=\"\",\"\",VLOOKUP($D20,invullijst!$A$11:$M$196,2,FALSE))","v":0},null,{"$f":"IF(VLOOKUP($D20,invullijst!$A$11:$M$196,6,FALSE)=0,\"\",VLOOKUP($D20,invullijst!$A$11:$M$196,6,FALSE))","v":""},null,3,{"$f":"IF($O$3=\"k\",IF(VLOOKUP($L20,invullijst!$A$11:$M$196,11,FALSE)=0,\" \",VLOOKUP($L20,invullijst!$A$11:$M$196,11,FALSE)),\"\")","v":""},{"$f":"IF(VLOOKUP($L20,invullijst!$A$11:$M$237,4,FALSE)=\"\",\"\",VLOOKUP($L20,invullijst!$A$11:$M$237,4,FALSE))","v":0},null,{"$f":"IF(VLOOKUP($L20,invullijst!$A$11:$M$196,2,FALSE)=\"\",\"\",VLOOKUP($L20,invullijst!$A$11:$M$196,2,FALSE))","v":0},null,{"$f":"IF(VLOOKUP($L20,invullijst!$A$11:$M$196,6,FALSE)=0,\"\",VLOOKUP($L20,invullijst!$A$11:$M$196,6,FALSE))","v":""}]
[4,{"$f":"IF($G$3=\"k\",IF(VLOOKUP($D21,invullijst!$A$11:$M$196,11,FALSE)=0,\" \",VLOOKUP($D21,invullijst!$A$11:$M$196,11,FALSE)),\"\")","v":""},{"$f":"IF(VLOOKUP(D21,invullijst!A$11:F$237,4,FALSE)=\"\",\"\",VLOOKUP(D21,invullijst!A$11:D$237,4,FALSE))","v":0},null,{"$f":"IF(VLOOKUP($D21,invullijst!$A$11:$M$196,2,FALSE)=\"\",\"\",VLOOKUP($D21,invullijst!$A$11:$M$196,2,FALSE))","v":0},null,{"$f":"IF(VLOOKUP($D21,invullijst!$A$11:$M$196,6,FALSE)=0,\"\",VLOOKUP($D21,invullijst!$A$11:$M$196,6,FALSE))","v":""},null,4,{"$f":"IF($O$3=\"k\",IF(VLOOKUP($L21,invullijst!$A$11:$M$196,11,FALSE)=0,\" \",VLOOKUP($L21,invullijst!$A$11:$M$196,11,FALSE)),\"\")","v":""},{"$f":"IF(VLOOKUP($L21,invullijst!$A$11:$M$237,4,FALSE)=\"\",\"\",VLOOKUP($L21,invullijst!$A$11:$M$237,4,FALSE))","v":0},null,{"$f":"IF(VLOOKUP($L21,invullijst!$A$11:$M$196,2,FALSE)=\"\",\"\",VLOOKUP($L21,invullijst!$A$11:$M$196,2,FALSE))","v":0},null,{"$f":"IF(VLOOKUP($L21,invullijst!$A$11:$M$196,6,FALSE)=0,\"\",VLOOKUP($L21,invullijst!$A$11:$M$196,6,FALSE))","v":""}]
["DIVERSEN / INHAAL",{"$nulls":5},{"$f":"SUM(G18:G21)","v":132},null,"DIVERSEN / INHAAL",{"$nulls":5},{"$f":"SUM(O12:O21)","v":318}]
[]
["OPGELEGD (Jeugd <16 en 65+)"]
[1,{"$f":"IF($G$3=\"k\",IF(VLOOKUP($D25,invullijst!$A$11:$M$196,11,FALSE)=0,\" \",VLOOKUP($D25,invullijst!$A$11:$M$196,11,FALSE)),\"\")","v":""},{"$f":"IF(VLOOKUP(D25,invullijst!A$11:F$237,4,FALSE)=\"\",\"\",VLOOKUP(D25,invullijst!A$11:D$237,4,FALSE))","v":"65+"},219,{"$f":"IF(VLOOKUP($D25,invullijst!$A$11:$M$196,2,FALSE)=\"\",\"\",VLOOKUP($D25,invullijst!$A$11:$M$196,2,FALSE))","v":"Frans de Bont"},null,{"$f":"IF(VLOOKUP($D25,invullijst!$A$11:$M$196,6,FALSE)=0,\"\",VLOOKUP($D25,invullijst!$A$11:$M$196,6,FALSE))","v":93},null,1,{"$f":"IF($O$3=\"k\",IF(VLOOKUP($L25,invullijst!$A$11:$M$196,11,FALSE)=0,\" \",VLOOKUP($L25,invullijst!$A$11:$M$196,11,FALSE)),\"\")","v":""},{"$f":"IF(VLOOKUP($L25,invullijst!$A$11:$M$237,4,FALSE)=\"\",\"\",VLOOKUP($L25,invullijst!$A$11:$M$237,4,FALSE))","v":"65+"},404,{"$f":"IF(VLOOKUP($L25,invullijst!$A$11:$M$196,2,FALSE)=\"\",\"\",VLOOKUP($L25,invullijst!$A$11:$M$196,2,FALSE))","v":"Gerard van Beurden"},null,{"$f":"IF(VLOOKUP($L25,invullijst!$A$11:$M$196,6,FALSE)=0,\"\",VLOOKUP($L25,invullijst!$A$11:$M$196,6,FALSE))","v":92}]
[2,{"$f":"IF($G$3=\"k\",IF(VLOOKUP($D26,invullijst!$A$11:$M$196,11,FALSE)=0,\" \",VLOOKUP($D26,invullijst!$A$11:$M$196,11,FALSE)),\"\")","v":""},{"$f":"IF(VLOOKUP(D26,invullijst!A$11:F$237,4,FALSE)=\"\",\"\",VLOOKUP(D26,invullijst!A$11:D$237,4,FALSE))","v":"65+"},218,{"$f":"IF(VLOOKUP($D26,invullijst!$A$11:$M$196,2,FALSE)=\"\",\"\",VLOOKUP($D26,invullijst!$A$11:$M$196,2,FALSE))","v":"Jacob van de Werken"},null,{"$f":"IF(VLOOKUP($D26,invullijst!$A$11:$M$196,6,FALSE)=0,\"\",VLOOKUP($D26,invullijst!$A$11:$M$196,6,FALSE))","v":95},null,2,{"$f":"IF($O$3=\"k\",IF(VLOOKUP($L26,invullijst!$A$11:$M$196,11,FALSE)=0,\" \",VLOOKUP($L26,invullijst!$A$11:$M$196,11,FALSE)),\"\")","v":""},{"$f":"IF(VLOOKUP($L26,invullijst!$A$11:$M$237,4,FALSE)=\"\",\"\",VLOOKUP($L26,invullijst!$A$11:$M$237,4,FALSE))","v":"65+"},401,{"$f":"IF(VLOOKUP($L26,invullijst!$A$11:$M$196,2,FALSE)=\"\",\"\",VLOOKUP($L26,invullijst!$A$11:$M$196,2,FALSE))","v":"Frans van Beurden"},null,{"$f":"IF(VLOOKUP($L26,invullijst!$A$11:$M$196,6,FALSE)=0,\"\",VLOOKUP($L26,invullijst!$A$11:$M$196,6,FALSE))","v":96}]
[3,{"$f":"IF($G$3=\"k\",IF(VLOOKUP($D27,invullijst!$A$11:$M$196,11,FALSE)=0,\" \",VLOOKUP($D27,invullijst!$A$11:$M$196,11,FALSE)),\"\")","v":""},{"$f":"IF(VLOOKUP(D27,invullijst!A$11:F$237,4,FALSE)=\"\",\"\",VLOOKUP(D27,invullijst!A$11:D$237,4,FALSE))","v":"65+"},220,{"$f":"IF(VLOOKUP($D27,invullijst!$A$11:$M$196,2,FALSE)=\"\",\"\",VLOOKUP($D27,invullijst!$A$11:$M$196,2,FALSE))","v":"Kees Vos"},null,{"$f":"IF(VLOOKUP($D27,invullijst!$A$11:$M$196,6,FALSE)=0,\"\",VLOOKUP($D27,invullijst!$A$11:$M$196,6,FALSE))","v":88},null,3,{"$f":"IF($O$3=\"k\",IF(VLOOKUP($L27,invullijst!$A$11:$M$196,11,FALSE)=0,\" \",VLOOKUP($L27,invullijst!$A$11:$M$196,11,FALSE)),\"\")","v":""},{"$f":"IF(VLOOKUP($L27,invullijst!$A$11:$M$237,4,FALSE)=\"\",\"\",VLOOKUP($L27,invullijst!$A$11:$M$237,4,FALSE))","v":"65+"},415,{"$f":"IF(VLOOKUP($L27,invullijst!$A$11:$M$196,2,FALSE)=\"\",\"\",VLOOKUP($L27,invullijst!$A$11:$M$196,2,FALSE))","v":"Wim de Gouw"},null,{"$f":"IF(VLOOKUP($L27,invullijst!$A$11:$M$196,6,FALSE)=0,\"\",VLOOKUP($L27,invullijst!$A$11:$M$196,6,FALSE))","v":96}]
["Totaal korps opgelegd A1",{"$nulls":5},{"$f":"SUM(G25:G27)","v":276},null,"Totaal korps opgelegd A1",{"$nulls":5},{"$f":"SUM(O25:O27)","v":284}]
[]
[1,{"$f":"IF($G$3=\"k\",IF(VLOOKUP($D30,invullijst!$A$11:$M$196,11,FALSE)=0,\" \",VLOOKUP($D30,invullijst!$A$11:$M$196,11,FALSE)),\"\")","v":""},{"$f":"IF(VLOOKUP(D30,invullijst!A$11:F$237,4,FALSE)=\"\",\"\",VLOOKUP(D30,invullijst!A$11:D$237,4,FALSE))","v":"65+"},212,{"$f":"IF(VLOOKUP($D30,invullijst!$A$11:$M$196,2,FALSE)=\"\",\"\",VLOOKUP($D30,invullijst!$A$11:$M$196,2,FALSE))","v":"René Duquesnoy"},null,{"$f":"IF(VLOOKUP($D30,invullijst!$A$11:$M$196,6,FALSE)=0,\"\",VLOOKUP($D30,invullijst!$A$11:$M$196,6,FALSE))","v":88},null,1,{"$f":"IF($O$3=\"k\",IF(VLOOKUP($L30,invullijst!$A$11:$M$196,11,FALSE)=0,\" \",VLOOKUP($L30,invullijst!$A$11:$M$196,11,FALSE)),\"\")","v":""},{"$f":"IF(VLOOKUP($L30,invullijst!$A$11:$M$237,4,FALSE)=\"\",\"\",VLOOKUP($L30,invullijst!$A$11:$M$237,4,FALSE))","v":"65+"},403,{"$f":"IF(VLOOKUP($L30,invullijst!$A$11:$M$196,2,FALSE)=\"\",\"\",VLOOKUP($L30,invullijst!$A$11:$M$196,2,FALSE))","v":"Dorien de Kort"},null,{"$f":"IF(VLOOKUP($L30,invullijst!$A$11:$M$196,6,FALSE)=0,\"\",VLOOKUP($L30,invullijst!$A$11:$M$196,6,FALSE))","v":91}]
[2,{"$f":"IF($G$3=\"k\",IF(VLOOKUP($D31,invullijst!$A$11:$M$196,11,FALSE)=0,\" \",VLOOKUP($D31,invullijst!$A$11:$M$196,11,FALSE)),\"\")","v":""},{"$f":"IF(VLOOKUP(D31,invullijst!A$11:F$237,4,FALSE)=\"\",\"\",VLOOKUP(D31,invullijst!A$11:D$237,4,FALSE))","v":"65+"},211,{"$f":"IF(VLOOKUP($D31,invullijst!$A$11:$M$196,2,FALSE)=\"\",\"\",VLOOKUP($D31,invullijst!$A$11:$M$196,2,FALSE))","v":"Ad van den houdt"},null,{"$f":"IF(VLOOKUP($D31,invullijst!$A$11:$M$196,6,FALSE)=0,\"\",VLOOKUP($D31,invullijst!$A$11:$M$196,6,FALSE))","v":88},null,2,{"$f":"IF($O$3=\"k\",IF(VLOOKUP($L31,invullijst!$A$11:$M$196,11,FALSE)=0,\" \",VLOOKUP($L31,invullijst!$A$11:$M$196,11,FALSE)),\"\")","v":""},{"$f":"IF(VLOOKUP($L31,invullijst!$A$11:$M$237,4,FALSE)=\"\",\"\",VLOOKUP($L31,invullijst!$A$11:$M$237,4,FALSE))","v":"65+"},412,{"$f":"IF(VLOOKUP($L31,invullijst!$A$11:$M$196,2,FALSE)=\"\",\"\",VLOOKUP($L31,invullijst!$A$11:$M$196,2,FALSE))","v":"Francien v/d Wiel"},null,{"$f":"IF(VLOOKUP($L31,invullijst!$A$11:$M$196,6,FALSE)=0,\"\",VLOOKUP($L31,invullijst!$A$11:$M$196,6,FALSE))","v":87}]
[3,{"$f":"IF($G$3=\"k\",IF(VLOOKUP($D32,invullijst!$A$11:$M$196,11,FALSE)=0,\" \",VLOOKUP($D32,invullijst!$A$11:$M$196,11,FALSE)),\"\")","v":""},{"$f":"IF(VLOOKUP(D32,invullijst!A$11:F$237,4,FALSE)=\"\",\"\",VLOOKUP(D32,invullijst!A$11:D$237,4,FALSE))","v":"65+"},214,{"$f":"IF(VLOOKUP($D32,invullijst!$A$11:$M$196,2,FALSE)=\"\",\"\",VLOOKUP($D32,invullijst!$A$11:$M$196,2,FALSE))","v":"Andre de Vaan"},null,{"$f":"IF(VLOOKUP($D32,invullijst!$A$11:$M$196,6,FALSE)=0,\"\",VLOOKUP($D32,invullijst!$A$11:$M$196,6,FALSE))","v":92},null,3,{"$f":"IF($O$3=\"k\",IF(VLOOKUP($L32,invullijst!$A$11:$M$196,11,FALSE)=0,\" \",VLOOKUP($L32,invullijst!$A$11:$M$196,11,FALSE)),\"\")","v":""},{"$f":"IF(VLOOKUP($L32,invullijst!$A$11:$M$237,4,FALSE)=\"\",\"\",VLOOKUP($L32,invullijst!$A$11:$M$237,4,FALSE))","v":"65+"},413,{"$f":"IF(VLOOKUP($L32,invullijst!$A$11:$M$196,2,FALSE)=\"\",\"\",VLOOKUP($L32,invullijst!$A$11:$M$196,2,FALSE))","v":"Frans Mommersteeg"},null,{"$f":"IF(VLOOKUP($L32,invullijst!$A$11:$M$196,6,FALSE)=0,\"\",VLOOKUP($L32,invullijst!$A$11:$M$196,6,FALSE))","v":93}]
["Totaal korps opgelegd A2",{"$nulls":5},{"$f":"SUM(G30:G32)","v":268},null,"Totaal korps opgelegd A2",{"$nulls":5},{"$f":"SUM(O30:O32)","v":271}]
[]
[1,{"$f":"IF($G$3=\"k\",IF(VLOOKUP($D35,invullijst!$A$11:$M$196,11,FALSE)=0,\" \",VLOOKUP($D35,invullijst!$A$11:$M$196,11,FALSE)),\"\")","v":""},{"$f":"IF(VLOOKUP(D35,invullijst!A$11:F$237,4,FALSE)=\"\",\"\",VLOOKUP(D35,invullijst!A$11:D$237,4,FALSE))","v":0},null,{"$f":"IF(VLOOKUP($D35,invullijst!$A$11:$M$196,2,FALSE)=\"\",\"\",VLOOKUP($D35,invullijst!$A$11:$M$196,2,FALSE))","v":0},null,{"$f":"IF(VLOOKUP($D35,invullijst!$A$11:$M$196,6,FALSE)=0,\"\",VLOOKUP($D35,invullijst!$A$11:$M$196,6,FALSE))","v":""},null,1,{"$f":"IF($O$3=\"k\",IF(VLOOKUP($L35,invullijst!$A$11:$M$196,11,FALSE)=0,\" \",VLOOKUP($L35,invullijst!$A$11:$M$196,11,FALSE)),\"\")","v":""},{"$f":"IF(VLOOKUP($L35,invullijst!$A$11:$M$237,4,FALSE)=\"\",\"\",VLOOKUP($L35,invullijst!$A$11:$M$237,4,FALSE))","v":"65+"},414,{"$f":"IF(VLOOKUP($L35,invullijst!$A$11:$M$196,2,FALSE)=\"\",\"\",VLOOKUP($L35,invullijst!$A$11:$M$196,2,FALSE))","v":"Alex Hus"},null,{"$f":"IF(VLOOKUP($L35,invullijst!$A$11:$M$196,6,FALSE)=0,\"\",VLOOKUP($L35,invullijst!$A$11:$M$196,6,FALSE))","v":73}]
[2,{"$f":"IF($G$3=\"k\",IF(VLOOKUP($D36,invullijst!$A$11:$M$196,11,FALSE)=0,\" \",VLOOKUP($D36,invullijst!$A$11:$M$196,11,FALSE)),\"\")","v":""},{"$f":"IF(VLOOKUP(D36,invullijst!A$11:F$237,4,FALSE)=\"\",\"\",VLOOKUP(D36,invullijst!A$11:D$237,4,FALSE))","v":0},null,{"$f":"IF(VLOOKUP($D36,invullijst!$A$11:$M$196,2,FALSE)=\"\",\"\",VLOOKUP($D36,invullijst!$A$11:$M$196,2,FALSE))","v":0},null,{"$f":"IF(VLOOKUP($D36,invullijst!$A$11:$M$196,6,FALSE)=0,\"\",VLOOKUP($D36,invullijst!$A$11:$M$196,6,FALSE))","v":""},null,2,{"$f":"IF($O$3=\"k\",IF(VLOOKUP($L36,invullijst!$A$11:$M$196,11,FALSE)=0,\" \",VLOOKUP($L36,invullijst!$A$11:$M$196,11,FALSE)),\"\")","v":""},{"$f":"IF(VLOOKUP($L36,invullijst!$A$11:$M$237,4,FALSE)=\"\",\"\",VLOOKUP($L36,invullijst!$A$11:$M$237,4,FALSE))","v":0},null,{"$f":"IF(VLOOKUP($L36,invullijst!$A$11:$M$196,2,FALSE)=\"\",\"\",VLOOKUP($L36,invullijst!$A$11:$M$196,2,FALSE))","v":0},null,{"$f":"IF(VLOOKUP($L36,invullijst!$A$11:$M$196,6,FALSE)=0,\"\",VLOOKUP($L36,invullijst!$A$11:$M$196,6,FALSE))","v":""}]
[3,{"$f":"IF($G$3=\"k\",IF(VLOOKUP($D37,invullijst!$A$11:$M$196,11,FALSE)=0,\" \",VLOOKUP($D37,invullijst!$A$11:$M$196,11,FALSE)),\"\")","v":""},{"$f":"IF(VLOOKUP(D37,invullijst!A$11:F$237,4,FALSE)=\"\",\"\",VLOOKUP(D37,invullijst!A$11:D$237,4,FALSE))","v":0},null,{"$f":"IF(VLOOKUP($D37,invullijst!$A$11:$M$196,2,FALSE)=\"\",\"\",VLOOKUP($D37,invullijst!$A$11:$M$196,2,FALSE))","v":0},null,{"$f":"IF(VLOOKUP($D37,invullijst!$A$11:$M$196,6,FALSE)=0,\"\",VLOOKUP($D37,invullijst!$A$11:$M$196,6,FALSE))","v":""},null,3,{"$f":"IF($O$3=\"k\",IF(VLOOKUP($L37,invullijst!$A$11:$M$196,11,FALSE)=0,\" \",VLOOKUP($L37,invullijst!$A$11:$M$196,11,FALSE)),\"\")","v":""},{"$f":"IF(VLOOKUP($L37,invullijst!$A$11:$M$237,4,FALSE)=\"\",\"\",VLOOKUP($L37,invullijst!$A$11:$M$237,4,FALSE))","v":0},null,{"$f":"IF(VLOOKUP($L37,invullijst!$A$11:$M$196,2,FALSE)=\"\",\"\",VLOOKUP($L37,invullijst!$A$11:$M$196,2,FALSE))","v":0},null,{"$f":"IF(VLOOKUP($L37,invullijst!$A$11:$M$196,6,FALSE)=0,\"\",VLOOKUP($L37,invullijst!$A$11:$M$196,6,FALSE))","v":""}]
["Diversen",{"$nulls":5},{"$f":"SUM(G35:G37)","v":0},null,"Totaal korps opgelegd A3",{"$nulls":5},{"$f":"SUM(O35:O37)","v":73}]

{"sheet":"wedstrijd 2A","index":7,"n_rows":38,"n_cols":15,"rows_kept":38,"merged":[[0,0,0,4],[0,5,0,7],[0,8,0,14],[1,0,1,11],[1,12,1,14],[2,1,2,5],[2,9,2,13],[4,0,4,14],[5,4,5,5],[5,12,5,13],[6,4,6,5],[6,12,6,13],[7,4,7,5],[7,12,7,13],[8,4,8,5],[8,12,8,13],[9,0,9,5],[9,8,9,13],[11,4,11,5],[11,12,11,13],[12,4,12,5],[12,12,12,13],[13,4,13,5],[13,12,13,13],[14,4,14,5],[14,12,14,13],[15,0,15,5],[15,8,15,13],[17,4,17,5],[17,12,17,13],[18,4,18,5],[18,12,18,13],[19,4,19,5],[19,12,19,13],[20,4,20,5],[20,12,20,13],[21,0,21,5],[21,8,21,13],[23,0,23,14],[24,4,24,5],[24,12,24,13],[25,4,25,5],[25,12,25,13],[26,4,26,5],[26,12,26,13],[27,0,27,5],[27,8,27,13],[29,4,29,5],[29,12,29,13],[30,4,30,5],[30,12,30,13],[31,4,31,5],[31,12,31,13],[32,0,32,5],[32,8,32,13],[34,4,34,5],[34,12,34,13],[35,4,35,5],[35,12,35,13],[36,4,36,5],[36,12,36,13],[37,0,37,5],[37,8,37,13]]}
[{"$f":"invullijst!F1","v":"Organistatie"},{"$nulls":4},{"$f":"invullijst!H2","v":"2025 - 2026"},null,null,{"$f":"invullijst!F3","v":"Sint Ambrosius Baardwijk"}]
["Datum: ",{"$nulls":11},"2026-01-18"]
[3,{"$f":"IF(VLOOKUP(A3,invullijst!A1:F5,2,FALSE)=\"\",\"\",VLOOKUP(A3,invullijst!A1:F5,2,FALSE))","v":"O.L.V. Schuts Elshout"},{"$nulls":6},1,{"$f":"IF(VLOOKUP(I3,invullijst!A1:C5,2,FALSE)=\"\",\"\",VLOOKUP(I3,invullijst!A1:C5,2,FALSE))","v":"Sint Ambrosius Baardwijk"}]
[]
["vrijehand"]
[1,{"$f":"IF($G$3=\"k\",IF(VLOOKUP($D6,invullijst!$A$11:$M$196,11,FALSE)=0,\" \",VLOOKUP($D6,invullijst!$A$11:$M$196,11,FALSE)),\"\")","v":""},{"$f":"IF(VLOOKUP(D6,invullijst!A$11:F$237,4,FALSE)=\"\",\"\",VLOOKUP(D6,invullijst!A$11:D$237,4,FALSE))","v":"vr"},302,{"$f":"IF(VLOOKUP($D6,invullijst!$A$11:$M$196,2,FALSE)=\"\",\"\",VLOOKUP($D6,invullijst!$A$11:$M$196,2,FALSE))","v":"Freek de Jong"},null,{"$f":"IF(VLOOKUP($D6,invullijst!$A$11:$M$196,7,FALSE)=0,\"\",VLOOKUP($D6,invullijst!$A$11:$M$196,7,FALSE))","v":90},null,1,{"$f":"IF($O$3=\"k\",IF(VLOOKUP($L6,invullijst!$A$11:$M$196,11,FALSE)=0,\" \",VLOOKUP($L6,invullijst!$A$11:$M$196,11,FALSE)),\"\")","v":""},{"$f":"IF(VLOOKUP($L6,invullijst!$A$11:$M$237,4,FALSE)=\"\",\"\",VLOOKUP($L6,invullijst!$A$11:$M$237,4,FALSE))","v":"vr"},105,{"$f":"IF(VLOOKUP($L6,invullijst!$A$11:$M$196,2,FALSE)=\"\",\"\",VLOOKUP($L6,invullijst!$A$11:$M$196,2,FALSE))","v":"René Klijn"},null,{"$f":"IF(VLOOKUP($L6,invullijst!$A$11:$M$196,7,FALSE)=0,\"\",VLOOKUP($L6,invullijst!$A$11:$M$196,7,FALSE))","v":81}]
[2,{"$f":"IF($G$3=\"k\",IF(VLOOKUP($D7,invullijst!$A$11:$M$196,11,FALSE)=0,\" \",VLOOKUP($D7,invullijst!$A$11:$M$196,11,FALSE)),\"\")","v":""},{"$f":"IF(VLOOKUP(D7,invullijst!A$11:F$237,4,FALSE)=\"\",\"\",VLOOKUP(D7,invullijst!A$11:D$237,4,FALSE))","v":"vr"},305,{"$f":"IF(VLOOKUP($D7,invullijst!$A$11:$M$196,2,FALSE)=\"\",\"\",VLOOKUP($D7,invullijst!$A$11:$M$196,2,FALSE))","v":"Johan Klerx"},null,{"$f":"IF(VLOOKUP($D7,invullijst!$A$11:$M$196,7,FALSE)=0,\"\",VLOOKUP($D7,invullijst!$A$11:$M$196,7,FALSE))","v":88},null,2,{"$f":"IF($O$3=\"k\",IF(VLOOKUP($L7,invullijst!$A$11:$M$196,11,FALSE)=0,\" \",VLOOKUP($L7,invullijst!$A$11:$M$196,11,FALSE)),\"\")","v":""},{"$f":"IF(VLOOKUP($L7,invullijst!$A$11:$M$237,4,FALSE)=\"\",\"\",VLOOKUP($L7,invullijst!$A$11:$M$237,4,FALSE))","v":"vr"},108,{"$f":"IF(VLOOKUP($L7,invullijst!$A$11:$M$196,2,FALSE)=\"\",\"\",VLOOKUP($L7,invullijst!$A$11:$M$196,2,FALSE))","v":"Bram Pullens"},null,{"$f":"IF(VLOOKUP($L7,invullijst!$A$11:$M$196,7,FALSE)=0,\"\",VLOOKUP($L7,invullijst!$A$11:$M$196,7,FALSE))","v":78}]
[3,{"$f":"IF($G$3=\"k\",IF(VLOOKUP($D8,invullijst!$A$11:$M$196,11,FALSE)=0,\" \",VLOOKUP($D8,invullijst!$A$11:$M$196,11,FALSE)),\"\")","v":""},{"$f":"IF(VLOOKUP(D8,invullijst!A$11:F$237,4,FALSE)=\"\",\"\",VLOOKUP(D8,invullijst!A$11:D$237,4,FALSE))","v":"vr"},306,{"$f":"IF(VLOOKUP($D8,invullijst!$A$11:$M$196,2,FALSE)=\"\",\"\",VLOOKUP($D8,invullijst!$A$11:$M$196,2,FALSE))","v":"Ron Groot"},null,{"$f":"IF(VLOOKUP($D8,invullijst!$A$11:$M$196,7,FALSE)=0,\"\",VLOOKUP($D8,invullijst!$A$11:$M$196,7,FALSE))","v":92},null,3,{"$f":"IF($O$3=\"k\",IF(VLOOKUP($L8,invullijst!$A$11:$M$196,11,FALSE)=0,\" \",VLOOKUP($L8,invullijst!$A$11:$M$196,11,FALSE)),\"\")","v":""},{"$f":"IF(VLOOKUP($L8,invullijst!$A$11:$M$237,4,FALSE)=\"\",\"\",VLOOKUP($L8,invullijst!$A$11:$M$237,4,FALSE))","v":"vr"},109,{"$f":"IF(VLOOKUP($L8,invullijst!$A$11:$M$196,2,FALSE)=\"\",\"\",VLOOKUP($L8,invullijst!$A$11:$M$196,2,FALSE))","v":"Gijs Pullens"},null,{"$f":"IF(VLOOKUP($L8,invullijst!$A$11:$M$196,7,FALSE)=0,\"\",VLOOKUP($L8,invullijst!$A$11:$M$196,7,FALSE))","v":84}]
[4,{"$f":"IF($G$3=\"k\",IF(VLOOKUP($D9,invullijst!$A$11:$M$196,11,FALSE)=0,\" \",VLOOKUP($D9,invullijst!$A$11:$M$196,11,FALSE)),\"\")","v":""},{"$f":"IF(VLOOKUP(D9,invullijst!A$11:F$237,4,FALSE)=\"\",\"\",VLOOKUP(D9,invullijst!A$11:D$237,4,FALSE))","v":"vr"},304,{"$f":"IF(VLOOKUP($D9,invullijst!$A$11:$M$196,2,FALSE)=\"\",\"\",VLOOKUP($D9,invullijst!$A$11:$M$196,2,FALSE))","v":"Henk Bruurmijn "},null,{"$f":"IF(VLOOKUP($D9,invullijst!$A$11:$M$196,7,FALSE)=0,\"\",VLOOKUP($D9,invullijst!$A$11:$M$196,7,FALSE))","v":76},null,4,{"$f":"IF($O$3=\"k\",IF(VLOOKUP($L9,invullijst!$A$11:$M$196,11,FALSE)=0,\" \",VLOOKUP($L9,invullijst!$A$11:$M$196,11,FALSE)),\"\")","v":""},{"$f":"IF(VLOOKUP($L9,invullijst!$A$11:$M$237,4,FALSE)=\"\",\"\",VLOOKUP($L9,invullijst!$A$11:$M$237,4,FALSE))","v":"vr"},106,{"$f":"IF(VLOOKUP($L9,invullijst!$A$11:$M$196,2,FALSE)=\"\",\"\",VLOOKUP($L9,invullijst!$A$11:$M$196,2,FALSE))","v":"René Pullens"},null,{"$f":"IF(VLOOKUP($L9,invullijst!$A$11:$M$196,7,FALSE)=0,\"\",VLOOKUP($L9,invullijst!$A$11:$M$196,7,FALSE))","v":66}]
["Totaal A korps",{"$nulls":5},{"$f":"SUM(G6:G9)","v":346},null,"Totaal A korps",{"$nulls":5},{"$f":"SUM(O6:O9)","v":309}]
[]
[1,{"$f":"IF($G$3=\"k\",IF(VLOOKUP($D12,invullijst!$A$11:$M$196,11,FALSE)=0,\" \",VLOOKUP($D12,invullijst!$A$11:$M$196,11,FALSE)),\"\")","v":""},{"$f":"IF(VLOOKUP(D12,invullijst!A$11:F$237,4,FALSE)=\"\",\"\",VLOOKUP(D12,invullijst!A$11:D$237,4,FALSE))","v":0},null,{"$f":"IF(VLOOKUP($D12,invullijst!$A$11:$M$196,2,FALSE)=\"\",\"\",VLOOKUP($D12,invullijst!$A$11:$M$196,2,FALSE))","v":0},null,{"$f":"IF(VLOOKUP($D12,invullijst!$A$11:$M$196,7,FALSE)=0,\"\",VLOOKUP($D12,invullijst!$A$11:$M$196,7,FALSE))","v":""},null,1,{"$f":"IF($O$3=\"k\",IF(VLOOKUP($L12,invullijst!$A$11:$M$196,11,FALSE)=0,\" \",VLOOKUP($L12,invullijst!$A$11:$M$196,11,FALSE)),\"\")","v":""},{"$f":"IF(VLOOKUP($L12,invullijst!$A$11:$M$237,4,FALSE)=\"\",\"\",VLOOKUP($L12,invullijst!$A$11:$M$237,4,FALSE))","v":0},null,{"$f":"IF(VLOOKUP($L12,invullijst!$A$11:$M$196,2,FALSE)=\"\",\"\",VLOOKUP($L12,invullijst!$A$11:$M$196,2,FALSE))","v":0},null,{"$f":"IF(VLOOKUP($L12,invullijst!$A$11:$M$196,7,FALSE)=0,\"\",VLOOKUP($L12,invullijst!$A$11:$M$196,7,FALSE))","v":""}]
[2,{"$f":"IF($G$3=\"k\",IF(VLOOKUP($D13,invullijst!$A$11:$M$196,11,FALSE)=0,\" \",VLOOKUP($D13,invullijst!$A$11:$M$196,11,FALSE)),\"\")","v":""},{"$f":"IF(VLOOKUP(D13,invullijst!A$11:F$237,4,FALSE)=\"\",\"\",VLOOKUP(D13,invullijst!A$11:D$237,4,FALSE))","v":0},null,{"$f":"IF(VLOOKUP($D13,invullijst!$A$11:$M$196,2,FALSE)=\"\",\"\",VLOOKUP($D13,invullijst!$A$11:$M$196,2,FALSE))","v":0},null,{"$f":"IF(VLOOKUP($D13,invullijst!$A$11:$M$196,7,FALSE)=0,\"\",VLOOKUP($D13,invullijst!$A$11:$M$196,7,FALSE))","v":""},null,2,{"$f":"IF($O$3=\"k\",IF(VLOOKUP($L13,invullijst!$A$11:$M$196,11,FALSE)=0,\" \",VLOOKUP($L13,invullijst!$A$11:$M$196,11,FALSE)),\"\")","v":""},{"$f":"IF(VLOOKUP($L13,invullijst!$A$11:$M$237,4,FALSE)=\"\",\"\",VLOOKUP($L13,invullijst!$A$11:$M$237,4,FALSE))","v":0},null,{"$f":"IF(VLOOKUP($L13,invullijst!$A$11:$M$196,2,FALSE)=\"\",\"\",VLOOKUP($L13,invullijst!$A$11:$M$196,2,FALSE))","v":0},null,{"$f":"IF(VLOOKUP($L13,invullijst!$A$11:$M$196,7,FALSE)=0,\"\",VLOOKUP($L13,invullijst!$A$11:$M$196,7,FALSE))","v":""}]
[3,{"$f":"IF($G$3=\"k\",IF(VLOOKUP($D14,invullijst!$A$11:$M$196,11,FALSE)=0,\" \",VLOOKUP($D14,invullijst!$A$11:$M$196,11,FALSE)),\"\")","v":""},{"$f":"IF(VLOOKUP(D14,invullijst!A$11:F$237,4,FALSE)=\"\",\"\",VLOOKUP(D14,invullijst!A$11:D$237,4,FALSE))","v":0},null,{"$f":"IF(VLOOKUP($D14,invullijst!$A$11:$M$196,2,FALSE)=\"\",\"\",VLOOKUP($D14,invullijst!$A$11:$M$196,2,FALSE))","v":0},null,{"$f":"IF(VLOOKUP($D14,invullijst!$A$11:$M$196,7,FALSE)=0,\"\",VLOOKUP($D14,invullijst!$A$11:$M$196,7,FALSE))","v":""},null,3,{"$f":"IF($O$3=\"k\",IF(VLOOKUP($L14,invullijst!$A$11:$M$196,11,FALSE)=0,\" \",VLOOKUP($L14,invullijst!$A$11:$M$196,11,FALSE)),\"\")","v":""},{"$f":"IF(VLOOKUP($L14,invullijst!$A$11:$M$237,4,FALSE)=\"\",\"\",VLOOKUP($L14,invullijst!$A$11:$M$237,4,FALSE))","v":0},null,{"$f":"IF(VLOOKUP($L14,invullijst!$A$11:$M$196,2,FALSE)=\"\",\"\",VLOOKUP($L14,invullijst!$A$11:$M$196,2,FALSE))","v":0},null,{"$f":"IF(VLOOKUP($L14,invullijst!$A$11:$M$196,7,FALSE)=0,\"\",VLOOKUP($L14,invullijst!$A$11:$M$196,7,FALSE))","v":""}]
[4,{"$f":"IF($G$3=\"k\",IF(VLOOKUP($D15,invullijst!$A$11:$M$196,11,FALSE)=0,\" \",VLOOKUP($D15,invullijst!$A$11:$M$196,11,FALSE)),\"\")","v":""},{"$f":"IF(VLOOKUP(D15,invullijst!A$11:F$237,4,FALSE)=\"\",\"\",VLOOKUP(D15,invullijst!A$11:D$237,4,FALSE))","v":0},null,{"$f":"IF(VLOOKUP($D15,invullijst!$A$11:$M$196,2,FALSE)=\"\",\"\",VLOOKUP($D15,invullijst!$A$11:$M$196,2,FALSE))","v":0},null,{"$f":"IF(VLOOKUP($D15,invullijst!$A$11:$M$196,7,FALSE)=0,\"\",VLOOKUP($D15,invullijst!$A$11:$M$196,7,FALSE))","v":""},null,4,{"$f":"IF($O$3=\"k\",IF(VLOOKUP($L15,invullijst!$A$11:$M$196,11,FALSE)=0,\" \",VLOOKUP($L15,invullijst!$A$11:$M$196,11,FALSE)),\"\")","v":""},{"$f":"IF(VLOOKUP($L15,invullijst!$A$11:$M$237,4,FALSE)=\"\",\"\",VLOOKUP($L15,invullijst!$A$11:$M$237,4,FALSE))","v":0},null,{"$f":"IF(VLOOKUP($L15,invullijst!$A$11:$M$196,2,FALSE)=\"\",\"\",VLOOKUP($L15,invullijst!$A$11:$M$196,2,FALSE))","v":0},null,{"$f":"IF(VLOOKUP($L15,invullijst!$A$11:$M$196,7,FALSE)=0,\"\",VLOOKUP($L15,invullijst!$A$11:$M$196,7,FALSE))","v":""}]
["Totaal B1 korps",{"$nulls":5},{"$f":"SUM(G12:G15)","v":0},null,"Totaal B1 korps",{"$nulls":5},{"$f":"SUM(O12:O15)","v":0}]
[]
[1,{"$f":"IF($G$3=\"k\",IF(VLOOKUP($D18,invullijst!$A$11:$M$196,11,FALSE)=0,\" \",VLOOKUP($D18,invullijst!$A$11:$M$196,11,FALSE)),\"\")","v":""},{"$f":"IF(VLOOKUP(D18,invullijst!A$11:F$237,4,FALSE)=\"\",\"\",VLOOKUP(D18,invullijst!A$11:D$237,4,FALSE))","v":0},null,{"$f":"IF(VLOOKUP($D18,invullijst!$A$11:$M$196,2,FALSE)=\"\",\"\",VLOOKUP($D18,invullijst!$A$11:$M$196,2,FALSE))","v":0},null,{"$f":"IF(VLOOKUP($D18,invullijst!$A$11:$M$196,7,FALSE)=0,\"\",VLOOKUP($D18,invullijst!$A$11:$M$196,7,FALSE))","v":""},null,1,{"$f":"IF($O$3=\"k\",IF(VLOOKUP($L18,invullijst!$A$11:$M$196,11,FALSE)=0,\" \",VLOOKUP($L18,invullijst!$A$11:$M$196,11,FALSE)),\"\")","v":""},{"$f":"IF(VLOOKUP($L18,invullijst!$A$11:$M$237,4,FALSE)=\"\",\"\",VLOOKUP($L18,invullijst!$A$11:$M$237,4,FALSE))","v":0},null,{"$f":"IF(VLOOKUP($L18,invullijst!$A$11:$M$196,2,FALSE)=\"\",\"\",VLOOKUP($L18,invullijst!$A$11:$M$196,2,FALSE))","v":0},null,{"$f":"IF(VLOOKUP($L18,invullijst!$A$11:$M$196,7,FALSE)=0,\"\",VLOOKUP($L18,invullijst!$A$11:$M$196,7,FALSE))","v":""}]
[2,{"$f":"IF($G$3=\"k\",IF(VLOOKUP($D19,invullijst!$A$11:$M$196,11,FALSE)=0,\" \",VLOOKUP($D19,invullijst!$A$11:$M$196,11,FALSE)),\"\")","v":""},{"$f":"IF(VLOOKUP(D19,invullijst!A$11:F$237,4,FALSE)=\"\",\"\",VLOOKUP(D19,invullijst!A$11:D$237,4,FALSE))","v":0},null,{"$f":"IF(VLOOKUP($D19,invullijst!$A$11:$M$196,2,FALSE)=\"\",\"\",VLOOKUP($D19,invullijst!$A$11:$M$196,2,FALSE))","v":0},null,{"$f":"IF(VLOOKUP($D19,invullijst!$A$11:$M$196,7,FALSE)=0,\"\",VLOOKUP($D19,invullijst!$A$11:$M$196,7,FALSE))","v":""},null,2,{"$f":"IF($O$3=\"k\",IF(VLOOKUP($L19,invullijst!$A$11:$M$196,11,FALSE)=0,\" \",VLOOKUP($L19,invullijst!$A$11:$M$196,11,FALSE)),\"\")","v":""},{"$f":"IF(VLOOKUP($L19,invullijst!$A$11:$M$237,4,FALSE)=\"\",\"\",VLOOKUP($L19,invullijst!$A$11:$M$237,4,FALSE))","v":0},null,{"$f":"IF(VLOOKUP($L19,invullijst!$A$11:$M$196,2,FALSE)=\"\",\"\",VLOOKUP($L19,invullijst!$A$11:$M$196,2,FALSE))","v":0},null,{"$f":"IF(VLOOKUP($L19,invullijst!$A$11:$M$196,7,FALSE)=0,\"\",VLOOKUP($L19,invullijst!$A$11:$M$196,7,FALSE))","v":""}]
[3,{"$f":"IF($G$3=\"k\",IF(VLOOKUP($D20,invullijst!$A$11:$M$196,11,FALSE)=0,\" \",VLOOKUP($D20,invullijst!$A$11:$M$196,11,FALSE)),\"\")","v":""},{"$f":"IF(VLOOKUP(D20,invullijst!A$11:F$237,4,FALSE)=\"\",\"\",VLOOKUP(D20,invullijst!A$11:D$237,4,FALSE))","v":0},null,{"$f":"IF(VLOOKUP($D20,invullijst!$A$11:$M$196,2,FALSE)=\"\",\"\",VLOOKUP($D20,invullijst!$A$11:$M$196,2,FALSE))","v":0},null,{"$f":"IF(VLOOKUP($D20,invullijst!$A$11:$M$196,7,FALSE)=0,\"\",VLOOKUP($D20,invullijst!$A$11:$M$196,7,FALSE))","v":""},null,3,{"$f":"IF($O$3=\"k\",IF(VLOOKUP($L20,invullijst!$A$11:$M$196,11,FALSE)=0,\" \",VLOOKUP($L20,invullijst!$A$11:$M$196,11,FALSE)),\"\")","v":""},{"$f":"IF(VLOOKUP($L20,invullijst!$A$11:$M$237,4,FALSE)=\"\",\"\",VLOOKUP($L20,invullijst!$A$11:$M$237,4,FALSE))","v":0},null,{"$f":"IF(VLOOKUP($L20,invullijst!$A$11:$M$196,2,FALSE)=\"\",\"\",VLOOKUP($L20,invullijst!$A$11:$M$196,2,FALSE))","v":0},null,{"$f":"IF(VLOOKUP($L20,invullijst!$A$11:$M$196,7,FALSE)=0,\"\",VLOOKUP($L20,invullijst!$A$11:$M$196,7,FALSE))","v":""}]
[4,{"$f":"IF($G$3=\"k\",IF(VLOOKUP($D21,invullijst!$A$11:$M$196,11,FALSE)=0,\" \",VLOOKUP($D21,invullijst!$A$11:$M$196,11,FALSE)),\"\")","v":""},{"$f":"IF(VLOOKUP(D21,invullijst!A$11:F$237,4,FALSE)=\"\",\"\",VLOOKUP(D21,invullijst!A$11:D$237,4,FALSE))","v":0},null,{"$f":"IF(VLOOKUP($D21,invullijst!$A$11:$M$196,2,FALSE)=\"\",\"\",VLOOKUP($D21,invullijst!$A$11:$M$196,2,FALSE))","v":0},null,{"$f":"IF(VLOOKUP($D21,invullijst!$A$11:$M$196,7,FALSE)=0,\"\",VLOOKUP($D21,invullijst!$A$11:$M$196,7,FALSE))","v":""},null,4,{"$f":"IF($O$3=\"k\",IF(VLOOKUP($L21,invullijst!$A$11:$M$196,11,FALSE)=0,\" \",VLOOKUP($L21,invullijst!$A$11:$M$196,11,FALSE)),\"\")","v":""},{"$f":"IF(VLOOKUP($L21,invullijst!$A$11:$M$237,4,FALSE)=\"\",\"\",VLOOKUP($L21,invullijst!$A$11:$M$237,4,FALSE))","v":0},null,{"$f":"IF(VLOOKUP($L21,invullijst!$A$11:$M$196,2,FALSE)=\"\",\"\",VLOOKUP($L21,invullijst!$A$11:$M$196,2,FALSE))","v":0},null,{"$f":"IF(VLOOKUP($L21,invullijst!$A$11:$M$196,7,FALSE)=0,\"\",VLOOKUP($L21,invullijst!$A$11:$M$196,7,FALSE))","v":""}]
["DIVERSEN / INHAAL",{"$nulls":5},{"$f":"SUM(G18:G21)","v":0},null,"DIVERSEN / INHAAL",{"$nulls":5},{"$f":"SUM(O18:O21)","v":0}]
[]
["OPGELEGD (Jeugd <16 en 65+)"]
[1,{"$f":"IF($G$3=\"k\",IF(VLOOKUP($D25,invullijst!$A$11:$M$196,11,FALSE)=0,\" \",VLOOKUP($D25,invullijst!$A$11:$M$196,11,FALSE)),\"\")","v":""},{"$f":"IF(VLOOKUP(D25,invullijst!A$11:F$237,4,FALSE)=\"\",\"\",VLOOKUP(D25,invullijst!A$11:D$237,4,FALSE))","v":"65+"},307,{"$f":"IF(VLOOKUP($D25,invullijst!$A$11:$M$196,2,FALSE)=\"\",\"\",VLOOKUP($D25,invullijst!$A$11:$M$196,2,FALSE))","v":"Bert van Engelen"},null,{"$f":"IF(VLOOKUP($D25,invullijst!$A$11:$M$196,7,FALSE)=0,\"\",VLOOKUP($D25,invullijst!$A$11:$M$196,7,FALSE))","v":93},null,1,{"$f":"IF($O$3=\"k\",IF(VLOOKUP($L25,invullijst!$A$11:$M$196,11,FALSE)=0,\" \",VLOOKUP($L25,invullijst!$A$11:$M$196,11,FALSE)),\"\")","v":""},{"$f":"IF(VLOOKUP($L25,invullijst!$A$11:$M$237,4,FALSE)=\"\",\"\",VLOOKUP($L25,invullijst!$A$11:$M$237,4,FALSE))","v":"65+"},102,{"$f":"IF(VLOOKUP($L25,invullijst!$A$11:$M$196,2,FALSE)=\"\",\"\",VLOOKUP($L25,invullijst!$A$11:$M$196,2,FALSE))","v":"John de Jong (disp)"},null,{"$f":"IF(VLOOKUP($L25,invullijst!$A$11:$M$196,7,FALSE)=0,\"\",VLOOKUP($L25,invullijst!$A$11:$M$196,7,FALSE))","v":84}]
[2,{"$f":"IF($G$3=\"k\",IF(VLOOKUP($D26,invullijst!$A$11:$M$196,11,FALSE)=0,\" \",VLOOKUP($D26,invullijst!$A$11:$M$196,11,FALSE)),\"\")","v":""},{"$f":"IF(VLOOKUP(D26,invullijst!A$11:F$237,4,FALSE)=\"\",\"\",VLOOKUP(D26,invullijst!A$11:D$237,4,FALSE))","v":"65+"},310,{"$f":"IF(VLOOKUP($D26,invullijst!$A$11:$M$196,2,FALSE)=\"\",\"\",VLOOKUP($D26,invullijst!$A$11:$M$196,2,FALSE))","v":"Tiny Boom"},null,{"$f":"IF(VLOOKUP($D26,invullijst!$A$11:$M$196,7,FALSE)=0,\"\",VLOOKUP($D26,invullijst!$A$11:$M$196,7,FALSE))","v":92},null,2,{"$f":"IF($O$3=\"k\",IF(VLOOKUP($L26,invullijst!$A$11:$M$196,11,FALSE)=0,\" \",VLOOKUP($L26,invullijst!$A$11:$M$196,11,FALSE)),\"\")","v":""},{"$f":"IF(VLOOKUP($L26,invullijst!$A$11:$M$237,4,FALSE)=\"\",\"\",VLOOKUP($L26,invullijst!$A$11:$M$237,4,FALSE))","v":"65+"},104,{"$f":"IF(VLOOKUP($L26,invullijst!$A$11:$M$196,2,FALSE)=\"\",\"\",VLOOKUP($L26,invullijst!$A$11:$M$196,2,FALSE))","v":"Peter Brekelmans"},null,{"$f":"IF(VLOOKUP($L26,invullijst!$A$11:$M$196,7,FALSE)=0,\"\",VLOOKUP($L26,invullijst!$A$11:$M$196,7,FALSE))","v":82}]
[3,{"$f":"IF($G$3=\"k\",IF(VLOOKUP($D27,invullijst!$A$11:$M$196,11,FALSE)=0,\" \",VLOOKUP($D27,invullijst!$A$11:$M$196,11,FALSE)),\"\")","v":""},{"$f":"IF(VLOOKUP(D27,invullijst!A$11:F$237,4,FALSE)=\"\",\"\",VLOOKUP(D27,invullijst!A$11:D$237,4,FALSE))","v":"65+"},303,{"$f":"IF(VLOOKUP($D27,invullijst!$A$11:$M$196,2,FALSE)=\"\",\"\",VLOOKUP($D27,invullijst!$A$11:$M$196,2,FALSE))","v":"Hans van de Wiel"},null,{"$f":"IF(VLOOKUP($D27,invullijst!$A$11:$M$196,7,FALSE)=0,\"\",VLOOKUP($D27,invullijst!$A$11:$M$196,7,FALSE))","v":96},null,3,{"$f":"IF($O$3=\"k\",IF(VLOOKUP($L27,invullijst!$A$11:$M$196,11,FALSE)=0,\" \",VLOOKUP($L27,invullijst!$A$11:$M$196,11,FALSE)),\"\")","v":""},{"$f":"IF(VLOOKUP($L27,invullijst!$A$11:$M$237,4,FALSE)=\"\",\"\",VLOOKUP($L27,invullijst!$A$11:$M$237,4,FALSE))","v":0},null,{"$f":"IF(VLOOKUP($L27,invullijst!$A$11:$M$196,2,FALSE)=\"\",\"\",VLOOKUP($L27,invullijst!$A$11:$M$196,2,FALSE))","v":0},null,{"$f":"IF(VLOOKUP($L27,invullijst!$A$11:$M$196,7,FALSE)=0,\"\",VLOOKUP($L27,invullijst!$A$11:$M$196,7,FALSE))","v":""}]
["Totaal korps opgelegd A1",{"$nulls":5},{"$f":"SUM(G25:G27)","v":281},null,"Totaal korps opgelegd A1",{"$nulls":5},{"$f":"SUM(O25:O27)","v":166}]
[]
[1,{"$f":"IF($G$3=\"k\",IF(VLOOKUP($D30,invullijst!$A$11:$M$196,11,FALSE)=0,\" \",VLOOKUP($D30,invullijst!$A$11:$M$196,11,FALSE)),\"\")","v":""},{"$f":"IF(VLOOKUP(D30,invullijst!A$11:F$237,4,FALSE)=\"\",\"\",VLOOKUP(D30,invullijst!A$11:D$237,4,FALSE))","v":"J"},312,{"$f":"IF(VLOOKUP($D30,invullijst!$A$11:$M$196,2,FALSE)=\"\",\"\",VLOOKUP($D30,invullijst!$A$11:$M$196,2,FALSE))","v":"Floor de Jong"},null,{"$f":"IF(VLOOKUP($D30,invullijst!$A$11:$M$196,7,FALSE)=0,\"\",VLOOKUP($D30,invullijst!$A$11:$M$196,7,FALSE))","v":90},null,1,{"$f":"IF($O$3=\"k\",IF(VLOOKUP($L30,invullijst!$A$11:$M$196,11,FALSE)=0,\" \",VLOOKUP($L30,invullijst!$A$11:$M$196,11,FALSE)),\"\")","v":""},{"$f":"IF(VLOOKUP($L30,invullijst!$A$11:$M$237,4,FALSE)=\"\",\"\",VLOOKUP($L30,invullijst!$A$11:$M$237,4,FALSE))","v":0},null,{"$f":"IF(VLOOKUP($L30,invullijst!$A$11:$M$196,2,FALSE)=\"\",\"\",VLOOKUP($L30,invullijst!$A$11:$M$196,2,FALSE))","v":0},null,{"$f":"IF(VLOOKUP($L30,invullijst!$A$11:$M$196,7,FALSE)=0,\"\",VLOOKUP($L30,invullijst!$A$11:$M$196,7,FALSE))","v":""}]
[2,{"$f":"IF($G$3=\"k\",IF(VLOOKUP($D31,invullijst!$A$11:$M$196,11,FALSE)=0,\" \",VLOOKUP($D31,invullijst!$A$11:$M$196,11,FALSE)),\"\")","v":""},{"$f":"IF(VLOOKUP(D31,invullijst!A$11:F$237,4,FALSE)=\"\",\"\",VLOOKUP(D31,invullijst!A$11:D$237,4,FALSE))","v":"65+"},301,{"$f":"IF(VLOOKUP($D31,invullijst!$A$11:$M$196,2,FALSE)=\"\",\"\",VLOOKUP($D31,invullijst!$A$11:$M$196,2,FALSE))","v":"Arjen van Assem (disp)"},null,{"$f":"IF(VLOOKUP($D31,invullijst!$A$11:$M$196,7,FALSE)=0,\"\",VLOOKUP($D31,invullijst!$A$11:$M$196,7,FALSE))","v":84},null,2,{"$f":"IF($O$3=\"k\",IF(VLOOKUP($L31,invullijst!$A$11:$M$196,11,FALSE)=0,\" \",VLOOKUP($L31,invullijst!$A$11:$M$196,11,FALSE)),\"\")","v":""},{"$f":"IF(VLOOKUP($L31,invullijst!$A$11:$M$237,4,FALSE)=\"\",\"\",VLOOKUP($L31,invullijst!$A$11:$M$237,4,FALSE))","v":0},null,{"$f":"IF(VLOOKUP($L31,invullijst!$A$11:$M$196,2,FALSE)=\"\",\"\",VLOOKUP($L31,invullijst!$A$11:$M$196,2,FALSE))","v":0},null,{"$f":"IF(VLOOKUP($L31,invullijst!$A$11:$M$196,7,FALSE)=0,\"\",VLOOKUP($L31,invullijst!$A$11:$M$196,7,FALSE))","v":""}]
[3,{"$f":"IF($G$3=\"k\",IF(VLOOKUP($D32,invullijst!$A$11:$M$196,11,FALSE)=0,\" \",VLOOKUP($D32,invullijst!$A$11:$M$196,11,FALSE)),\"\")","v":""},{"$f":"IF(VLOOKUP(D32,invullijst!A$11:F$237,4,FALSE)=\"\",\"\",VLOOKUP(D32,invullijst!A$11:D$237,4,FALSE))","v":"65+"},309,{"$f":"IF(VLOOKUP($D32,invullijst!$A$11:$M$196,2,FALSE)=\"\",\"\",VLOOKUP($D32,invullijst!$A$11:$M$196,2,FALSE))","v":"René de Jong"},null,{"$f":"IF(VLOOKUP($D32,invullijst!$A$11:$M$196,7,FALSE)=0,\"\",VLOOKUP($D32,invullijst!$A$11:$M$196,7,FALSE))","v":88},null,3,{"$f":"IF($O$3=\"k\",IF(VLOOKUP($L32,invullijst!$A$11:$M$196,11,FALSE)=0,\" \",VLOOKUP($L32,invullijst!$A$11:$M$196,11,FALSE)),\"\")","v":""},{"$f":"IF(VLOOKUP($L32,invullijst!$A$11:$M$237,4,FALSE)=\"\",\"\",VLOOKUP($L32,invullijst!$A$11:$M$237,4,FALSE))","v":0},null,{"$f":"IF(VLOOKUP($L32,invullijst!$A$11:$M$196,2,FALSE)=\"\",\"\",VLOOKUP($L32,invullijst!$A$11:$M$196,2,FALSE))","v":0},null,{"$f":"IF(VLOOKUP($L32,invullijst!$A$11:$M$196,7,FALSE)=0,\"\",VLOOKUP($L32,invullijst!$A$11:$M$196,7,FALSE))","v":""}]
["Totaal korps opgelegd A2",{"$nulls":5},{"$f":"SUM(G30:G32)","v":262},null,"Totaal korps opgelegd A2",{"$nulls":5},{"$f":"SUM(O30:O32)","v":0}]
[]
[1,{"$f":"IF($G$3=\"k\",IF(VLOOKUP($D35,invullijst!$A$11:$M$196,11,FALSE)=0,\" \",VLOOKUP($D35,invullijst!$A$11:$M$196,11,FALSE)),\"\")","v":""},{"$f":"IF(VLOOKUP(D35,invullijst!A$11:F$237,4,FALSE)=\"\",\"\",VLOOKUP(D35,invullijst!A$11:D$237,4,FALSE))","v":0},null,{"$f":"IF(VLOOKUP($D35,invullijst!$A$11:$M$196,2,FALSE)=\"\",\"\",VLOOKUP($D35,invullijst!$A$11:$M$196,2,FALSE))","v":0},null,{"$f":"IF(VLOOKUP($D35,invullijst!$A$11:$M$196,7,FALSE)=0,\"\",VLOOKUP($D35,invullijst!$A$11:$M$196,7,FALSE))","v":""},null,1,{"$f":"IF($O$3=\"k\",IF(VLOOKUP($L35,invullijst!$A$11:$M$196,11,FALSE)=0,\" \",VLOOKUP($L35,invullijst!$A$11:$M$196,11,FALSE)),\"\")","v":""},{"$f":"IF(VLOOKUP($L35,invullijst!$A$11:$M$237,4,FALSE)=\"\",\"\",VLOOKUP($L35,invullijst!$A$11:$M$237,4,FALSE))","v":0},null,{"$f":"IF(VLOOKUP($L35,invullijst!$A$11:$M$196,2,FALSE)=\"\",\"\",VLOOKUP($L35,invullijst!$A$11:$M$196,2,FALSE))","v":0},null,{"$f":"IF(VLOOKUP($L35,invullijst!$A$11:$M$196,7,FALSE)=0,\"\",VLOOKUP($L35,invullijst!$A$11:$M$196,7,FALSE))","v":""}]
[2,{"$f":"IF($G$3=\"k\",IF(VLOOKUP($D36,invullijst!$A$11:$M$196,11,FALSE)=0,\" \",VLOOKUP($D36,invullijst!$A$11:$M$196,11,FALSE)),\"\")","v":""},{"$f":"IF(VLOOKUP(D36,invullijst!A$11:F$237,4,FALSE)=\"\",\"\",VLOOKUP(D36,invullijst!A$11:D$237,4,FALSE))","v":0},null,{"$f":"IF(VLOOKUP($D36,invullijst!$A$11:$M$196,2,FALSE)=\"\",\"\",VLOOKUP($D36,invullijst!$A$11:$M$196,2,FALSE))","v":0},null,{"$f":"IF(VLOOKUP($D36,invullijst!$A$11:$M$196,7,FALSE)=0,\"\",VLOOKUP($D36,invullijst!$A$11:$M$196,7,FALSE))","v":""},null,2,{"$f":"IF($O$3=\"k\",IF(VLOOKUP($L36,invullijst!$A$11:$M$196,11,FALSE)=0,\" \",VLOOKUP($L36,invullijst!$A$11:$M$196,11,FALSE)),\"\")","v":""},{"$f":"IF(VLOOKUP($L36,invullijst!$A$11:$M$237,4,FALSE)=\"\",\"\",VLOOKUP($L36,invullijst!$A$11:$M$237,4,FALSE))","v":0},null,{"$f":"IF(VLOOKUP($L36,invullijst!$A$11:$M$196,2,FALSE)=\"\",\"\",VLOOKUP($L36,invullijst!$A$11:$M$196,2,FALSE))","v":0},null,{"$f":"IF(VLOOKUP($L36,invullijst!$A$11:$M$196,7,FALSE)=0,\"\",VLOOKUP($L36,invullijst!$A$11:$M$196,7,FALSE))","v":""}]
[3,{"$f":"IF($G$3=\"k\",IF(VLOOKUP($D37,invullijst!$A$11:$M$196,11,FALSE)=0,\" \",VLOOKUP($D37,invullijst!$A$11:$M$196,11,FALSE)),\"\")","v":""},{"$f":"IF(VLOOKUP(D37,invullijst!A$11:F$237,4,FALSE)=\"\",\"\",VLOOKUP(D37,invullijst!A$11:D$237,4,FALSE))","v":0},null,{"$f":"IF(VLOOKUP($D37,invullijst!$A$11:$M$196,2,FALSE)=\"\",\"\",VLOOKUP($D37,invullijst!$A$11:$M$196,2,FALSE))","v":0},null,{"$f":"IF(VLOOKUP($D37,invullijst!$A$11:$M$196,7,FALSE)=0,\"\",VLOOKUP($D37,invullijst!$A$11:$M$196,7,FALSE))","v":""},null,3,{"$f":"IF($O$3=\"k\",IF(VLOOKUP($L37,invullijst!$A$11:$M$196,11,FALSE)=0,\" \",VLOOKUP($L37,invullijst!$A$11:$M$196,11,FALSE)),\"\")","v":""},{"$f":"IF(VLOOKUP($L37,invullijst!$A$11:$M$237,4,FALSE)=\"\",\"\",VLOOKUP($L37,invullijst!$A$11:$M$237,4,FALSE))","v":0},null,{"$f":"IF(VLOOKUP($L37,invullijst!$A$11:$M$196,2,FALSE)=\"\",\"\",VLOOKUP($L37,invullijst!$A$11:$M$196,2,FALSE))","v":0},null,{"$f":"IF(VLOOKUP($L37,invullijst!$A$11:$M$196,7,FALSE)=0,\"\",VLOOKUP($L37,invullijst!$A$11:$M$196,7,FALSE))","v":""}]
["Totaal korps opgelegd A3",{"$nulls":5},{"$f":"SUM(G35:G37)","v":0},null,"Totaal korps opgelegd A3",{"$nulls":5},{"$f":"SUM(O35:O37)","v":0}]

{"sheet":"wedstrijd 2B","index":8,"n_rows":38,"n_cols":15,"rows_kept":38,"merged":[[0,0,0,4],[0,5,0,7],[0,8,0,14],[1,0,1,11],[1,12,1,14],[2,1,2,5],[2,9,2,13],[4,0,4,14],[5,4,5,5],[5,12,5,13],[6,4,6,5],[6,12,6,13],[7,4,7,5],[7,12,7,13],[8,4,8,5],[8,12,8,13],[9,0,9,5],[9,8,9,13],[11,4,11,5],[11,12,11,13],[12,4,12,5],[12,12,12,13],[13,4,13,5],[13,12,13,13],[14,4,14,5],[14,12,14,13],[15,0,15,5],[15,8,15,13],[17,4,17,5],[17,12,17,13],[18,4,18,5],[18,12,18,13],[19,4,19,5],[19,12,19,13],[20,4,20,5],[20,12,20,13],[21,0,21,5],[21,8,21,13],[23,0,23,14],[24,4,24,5],[24,12,24,13],[25,4,25,5],[25,12,25,13],[26,4,26,5],[26,12,26,13],[27,0,27,5],[27,8,27,13],[29,4,29,5],[29,12,29,13],[30,4,30,5],[30,12,30,13],[31,4,31,5],[31,12,31,13],[32,0,32,5],[32,8,32,13],[34,4,34,5],[34,12,34,13],[35,4,35,5],[35,12,35,13],[36,4,36,5],[36,12,36,13],[37,0,37,5],[37,8,37,13]]}
[{"$f":"invullijst!F1","v":"Organistatie"},{"$nulls":4},{"$f":"invullijst!H2","v":"2025 - 2026"},null,null,{"$f":"invullijst!F3","v":"Sint Ambrosius Baardwijk"}]
["Datum: ",{"$nulls":11},"2026-01-18"]
[5,{"$f":"IF(VLOOKUP(A3,invullijst!A1:F5,2,FALSE)=\"\",\"\",VLOOKUP(A3,invullijst!A1:F5,2,FALSE))","v":"Sint Jan Baptist Kaatsheuvel"},{"$nulls":6},2,{"$f":"IF(VLOOKUP(I3,invullijst!A1:C5,2,FALSE)=\"\",\"\",VLOOKUP(I3,invullijst!A1:C5,2,FALSE))","v":"St. Crispinus & Crispinianus Besoijen"}]
[]
["vrijehand"]
[1,{"$f":"IF($G$3=\"k\",IF(VLOOKUP($D6,invullijst!$A$11:$M$196,11,FALSE)=0,\" \",VLOOKUP($D6,invullijst!$A$11:$M$196,11,FALSE)),\"\")","v":""},{"$f":"IF(VLOOKUP(D6,invullijst!A$11:F$237,4,FALSE)=\"\",\"\",VLOOKUP(D6,invullijst!A$11:D$237,4,FALSE))","v":"vr"},504,{"$f":"IF(VLOOKUP($D6,invullijst!$A$11:$M$196,2,FALSE)=\"\",\"\",VLOOKUP($D6,invullijst!$A$11:$M$196,2,FALSE))","v":"Koen v/d Ven"},null,{"$f":"IF(VLOOKUP($D6,invullijst!$A$11:$M$196,7,FALSE)=0,\"\",VLOOKUP($D6,invullijst!$A$11:$M$196,7,FALSE))","v":83},null,1,{"$f":"IF($O$3=\"k\",IF(VLOOKUP($L6,invullijst!$A$11:$M$196,11,FALSE)=0,\" \",VLOOKUP($L6,invullijst!$A$11:$M$196,11,FALSE)),\"\")","v":""},{"$f":"IF(VLOOKUP($L6,invullijst!$A$11:$M$237,4,FALSE)=\"\",\"\",VLOOKUP($L6,invullijst!$A$11:$M$237,4,FALSE))","v":"vr"},210,{"$f":"IF(VLOOKUP($L6,invullijst!$A$11:$M$196,2,FALSE)=\"\",\"\",VLOOKUP($L6,invullijst!$A$11:$M$196,2,FALSE))","v":"Sander Oome"},null,{"$f":"IF(VLOOKUP($L6,invullijst!$A$11:$M$196,7,FALSE)=0,\"\",VLOOKUP($L6,invullijst!$A$11:$M$196,7,FALSE))","v":91}]
[2,{"$f":"IF($G$3=\"k\",IF(VLOOKUP($D7,invullijst!$A$11:$M$196,11,FALSE)=0,\" \",VLOOKUP($D7,invullijst!$A$11:$M$196,11,FALSE)),\"\")","v":""},{"$f":"IF(VLOOKUP(D7,invullijst!A$11:F$237,4,FALSE)=\"\",\"\",VLOOKUP(D7,invullijst!A$11:D$237,4,FALSE))","v":"vr"},501,{"$f":"IF(VLOOKUP($D7,invullijst!$A$11:$M$196,2,FALSE)=\"\",\"\",VLOOKUP($D7,invullijst!$A$11:$M$196,2,FALSE))","v":"Annette Vos"},null,{"$f":"IF(VLOOKUP($D7,invullijst!$A$11:$M$196,7,FALSE)=0,\"\",VLOOKUP($D7,invullijst!$A$11:$M$196,7,FALSE))","v":77},null,2,{"$f":"IF($O$3=\"k\",IF(VLOOKUP($L7,invullijst!$A$11:$M$196,11,FALSE)=0,\" \",VLOOKUP($L7,invullijst!$A$11:$M$196,11,FALSE)),\"\")","v":""},{"$f":"IF(VLOOKUP($L7,invullijst!$A$11:$M$237,4,FALSE)=\"\",\"\",VLOOKUP($L7,invullijst!$A$11:$M$237,4,FALSE))","v":"vr"},216,{"$f":"IF(VLOOKUP($L7,invullijst!$A$11:$M$196,2,FALSE)=\"\",\"\",VLOOKUP($L7,invullijst!$A$11:$M$196,2,FALSE))","v":"Pieter Laghuwitz"},null,{"$f":"IF(VLOOKUP($L7,invullijst!$A$11:$M$196,7,FALSE)=0,\"\",VLOOKUP($L7,invullijst!$A$11:$M$196,7,FALSE))","v":92}]
[3,{"$f":"IF($G$3=\"k\",IF(VLOOKUP($D8,invullijst!$A$11:$M$196,11,FALSE)=0,\" \",VLOOKUP($D8,invullijst!$A$11:$M$196,11,FALSE)),\"\")","v":""},{"$f":"IF(VLOOKUP(D8,invullijst!A$11:F$237,4,FALSE)=\"\",\"\",VLOOKUP(D8,invullijst!A$11:D$237,4,FALSE))","v":"vr"},513,{"$f":"IF(VLOOKUP($D8,invullijst!$A$11:$M$196,2,FALSE)=\"\",\"\",VLOOKUP($D8,invullijst!$A$11:$M$196,2,FALSE))","v":"Mark van Delft"},null,{"$f":"IF(VLOOKUP($D8,invullijst!$A$11:$M$196,7,FALSE)=0,\"\",VLOOKUP($D8,invullijst!$A$11:$M$196,7,FALSE))","v":83},null,3,{"$f":"IF($O$3=\"k\",IF(VLOOKUP($L8,invullijst!$A$11:$M$196,11,FALSE)=0,\" \",VLOOKUP($L8,invullijst!$A$11:$M$196,11,FALSE)),\"\")","v":""},{"$f":"IF(VLOOKUP($L8,invullijst!$A$11:$M$237,4,FALSE)=\"\",\"\",VLOOKUP($L8,invullijst!$A$11:$M$237,4,FALSE))","v":"vr"},203,{"$f":"IF(VLOOKUP($L8,invullijst!$A$11:$M$196,2,FALSE)=\"\",\"\",VLOOKUP($L8,invullijst!$A$11:$M$196,2,FALSE))","v":"Frank van den Houdt"},null,{"$f":"IF(VLOOKUP($L8,invullijst!$A$11:$M$196,7,FALSE)=0,\"\",VLOOKUP($L8,invullijst!$A$11:$M$196,7,FALSE))","v":84}]
[4,{"$f":"IF($G$3=\"k\",IF(VLOOKUP($D9,invullijst!$A$11:$M$196,11,FALSE)=0,\" \",VLOOKUP($D9,invullijst!$A$11:$M$196,11,FALSE)),\"\")","v":""},{"$f":"IF(VLOOKUP(D9,invullijst!A$11:F$237,4,FALSE)=\"\",\"\",VLOOKUP(D9,invullijst!A$11:D$237,4,FALSE))","v":"vr"},507,{"$f":"IF(VLOOKUP($D9,invullijst!$A$11:$M$196,2,FALSE)=\"\",\"\",VLOOKUP($D9,invullijst!$A$11:$M$196,2,FALSE))","v":"Michael Blaauwbroek"},null,{"$f":"IF(VLOOKUP($D9,invullijst!$A$11:$M$196,7,FALSE)=0,\"\",VLOOKUP($D9,invullijst!$A$11:$M$196,7,FALSE))","v":74},null,4,{"$f":"IF($O$3=\"k\",IF(VLOOKUP($L9,invullijst!$A$11:$M$196,11,FALSE)=0,\" \",VLOOKUP($L9,invullijst!$A$11:$M$196,11,FALSE)),\"\")","v":""},{"$f":"IF(VLOOKUP($L9,invullijst!$A$11:$M$237,4,FALSE)=\"\",\"\",VLOOKUP($L9,invullijst!$A$11:$M$237,4,FALSE))","v":"vr"},217,{"$f":"IF(VLOOKUP($L9,invullijst!$A$11:$M$196,2,FALSE)=\"\",\"\",VLOOKUP($L9,invullijst!$A$11:$M$196,2,FALSE))","v":"Hans Laghuwitz"},null,{"$f":"IF(VLOOKUP($L9,invullijst!$A$11:$M$196,7,FALSE)=0,\"\",VLOOKUP($L9,invullijst!$A$11:$M$196,7,FALSE))","v":80}]
["Totaal A korps",{"$nulls":5},{"$f":"SUM(G6:G9)","v":317},null,"Totaal A korps",{"$nulls":5},{"$f":"SUM(O6:O9)","v":347}]
[]
[1,{"$f":"IF($G$3=\"k\",IF(VLOOKUP($D12,invullijst!$A$11:$M$196,11,FALSE)=0,\" \",VLOOKUP($D12,invullijst!$A$11:$M$196,11,FALSE)),\"\")","v":""},{"$f":"IF(VLOOKUP(D12,invullijst!A$11:F$237,4,FALSE)=\"\",\"\",VLOOKUP(D12,invullijst!A$11:D$237,4,FALSE))","v":"vr"},512,{"$f":"IF(VLOOKUP($D12,invullijst!$A$11:$M$196,2,FALSE)=\"\",\"\",VLOOKUP($D12,invullijst!$A$11:$M$196,2,FALSE))","v":"Hans Bergakker"},null,{"$f":"IF(VLOOKUP($D12,invullijst!$A$11:$M$196,7,FALSE)=0,\"\",VLOOKUP($D12,invullijst!$A$11:$M$196,7,FALSE))","v":75},null,1,{"$f":"IF($O$3=\"k\",IF(VLOOKUP($L12,invullijst!$A$11:$M$196,11,FALSE)=0,\" \",VLOOKUP($L12,invullijst!$A$11:$M$196,11,FALSE)),\"\")","v":""},{"$f":"IF(VLOOKUP($L12,invullijst!$A$11:$M$237,4,FALSE)=\"\",\"\",VLOOKUP($L12,invullijst!$A$11:$M$237,4,FALSE))","v":"vr"},209,{"$f":"IF(VLOOKUP($L12,invullijst!$A$11:$M$196,2,FALSE)=\"\",\"\",VLOOKUP($L12,invullijst!$A$11:$M$196,2,FALSE))","v":"René van Kuijk"},null,{"$f":"IF(VLOOKUP($L12,invullijst!$A$11:$M$196,7,FALSE)=0,\"\",VLOOKUP($L12,invullijst!$A$11:$M$196,7,FALSE))","v":83}]
[2,{"$f":"IF($G$3=\"k\",IF(VLOOKUP($D13,invullijst!$A$11:$M$196,11,FALSE)=0,\" \",VLOOKUP($D13,invullijst!$A$11:$M$196,11,FALSE)),\"\")","v":""},{"$f":"IF(VLOOKUP(D13,invullijst!A$11:F$237,4,FALSE)=\"\",\"\",VLOOKUP(D13,invullijst!A$11:D$237,4,FALSE))","v":"vr"},508,{"$f":"IF(VLOOKUP($D13,invullijst!$A$11:$M$196,2,FALSE)=\"\",\"\",VLOOKUP($D13,invullijst!$A$11:$M$196,2,FALSE))","v":"Rowan Dobbelsteen"},null,{"$f":"IF(VLOOKUP($D13,invullijst!$A$11:$M$196,7,FALSE)=0,\"\",VLOOKUP($D13,invullijst!$A$11:$M$196,7,FALSE))","v":81},null,2,{"$f":"IF($O$3=\"k\",IF(VLOOKUP($L13,invullijst!$A$11:$M$196,11,FALSE)=0,\" \",VLOOKUP($L13,invullijst!$A$11:$M$196,11,FALSE)),\"\")","v":""},{"$f":"IF(VLOOKUP($L13,invullijst!$A$11:$M$237,4,FALSE)=\"\",\"\",VLOOKUP($L13,invullijst!$A$11:$M$237,4,FALSE))","v":"vr"},208,{"$f":"IF(VLOOKUP($L13,invullijst!$A$11:$M$196,2,FALSE)=\"\",\"\",VLOOKUP($L13,invullijst!$A$11:$M$196,2,FALSE))","v":"Erin van Hulten"},null,{"$f":"IF(VLOOKUP($L13,invullijst!$A$11:$M$196,7,FALSE)=0,\"\",VLOOKUP($L13,invullijst!$A$11:$M$196,7,FALSE))","v":82}]
[3,{"$f":"IF($G$3=\"k\",IF(VLOOKUP($D14,invullijst!$A$11:$M$196,11,FALSE)=0,\" \",VLOOKUP($D14,invullijst!$A$11:$M$196,11,FALSE)),\"\")","v":""},{"$f":"IF(VLOOKUP(D14,invullijst!A$11:F$237,4,FALSE)=\"\",\"\",VLOOKUP(D14,invullijst!A$11:D$237,4,FALSE))","v":0},null,{"$f":"IF(VLOOKUP($D14,invullijst!$A$11:$M$196,2,FALSE)=\"\",\"\",VLOOKUP($D14,invullijst!$A$11:$M$196,2,FALSE))","v":0},null,{"$f":"IF(VLOOKUP($D14,invullijst!$A$11:$M$196,7,FALSE)=0,\"\",VLOOKUP($D14,invullijst!$A$11:$M$196,7,FALSE))","v":""},null,3,{"$f":"IF($O$3=\"k\",IF(VLOOKUP($L14,invullijst!$A$11:$M$196,11,FALSE)=0,\" \",VLOOKUP($L14,invullijst!$A$11:$M$196,11,FALSE)),\"\")","v":""},{"$f":"IF(VLOOKUP($L14,invullijst!$A$11:$M$237,4,FALSE)=\"\",\"\",VLOOKUP($L14,invullijst!$A$11:$M$237,4,FALSE))","v":"vr"},204,{"$f":"IF(VLOOKUP($L14,invullijst!$A$11:$M$196,2,FALSE)=\"\",\"\",VLOOKUP($L14,invullijst!$A$11:$M$196,2,FALSE))","v":"Harry de Louw"},null,{"$f":"IF(VLOOKUP($L14,invullijst!$A$11:$M$196,7,FALSE)=0,\"\",VLOOKUP($L14,invullijst!$A$11:$M$196,7,FALSE))","v":80}]
[4,{"$f":"IF($G$3=\"k\",IF(VLOOKUP($D15,invullijst!$A$11:$M$196,11,FALSE)=0,\" \",VLOOKUP($D15,invullijst!$A$11:$M$196,11,FALSE)),\"\")","v":""},{"$f":"IF(VLOOKUP(D15,invullijst!A$11:F$237,4,FALSE)=\"\",\"\",VLOOKUP(D15,invullijst!A$11:D$237,4,FALSE))","v":0},null,{"$f":"IF(VLOOKUP($D15,invullijst!$A$11:$M$196,2,FALSE)=\"\",\"\",VLOOKUP($D15,invullijst!$A$11:$M$196,2,FALSE))","v":0},null,{"$f":"IF(VLOOKUP($D15,invullijst!$A$11:$M$196,7,FALSE)=0,\"\",VLOOKUP($D15,invullijst!$A$11:$M$196,7,FALSE))","v":""},null,4,{"$f":"IF($O$3=\"k\",IF(VLOOKUP($L15,invullijst!$A$11:$M$196,11,FALSE)=0,\" \",VLOOKUP($L15,invullijst!$A$11:$M$196,11,FALSE)),\"\")","v":""},{"$f":"IF(VLOOKUP($L15,invullijst!$A$11:$M$237,4,FALSE)=\"\",\"\",VLOOKUP($L15,invullijst!$A$11:$M$237,4,FALSE))","v":"vr"},213,{"$f":"IF(VLOOKUP($L15,invullijst!$A$11:$M$196,2,FALSE)=\"\",\"\",VLOOKUP($L15,invullijst!$A$11:$M$196,2,FALSE))","v":"Roland van Delft"},null,{"$f":"IF(VLOOKUP($L15,invullijst!$A$11:$M$196,7,FALSE)=0,\"\",VLOOKUP($L15,invullijst!$A$11:$M$196,7,FALSE))","v":75}]
["Totaal B1 korps",{"$nulls":5},{"$f":"SUM(G12:G15)","v":156},null,"Totaal B1 korps",{"$nulls":5},{"$f":"SUM(O12:O15)","v":320}]
[]
[1,{"$f":"IF($G$3=\"k\",IF(VLOOKUP($D18,invullijst!$A$11:$M$196,11,FALSE)=0,\" \",VLOOKUP($D18,invullijst!$A$11:$M$196,11,FALSE)),\"\")","v":""},{"$f":"IF(VLOOKUP(D18,invullijst!A$11:F$237,4,FALSE)=\"\",\"\",VLOOKUP(D18,invullijst!A$11:D$237,4,FALSE))","v":0},null,{"$f":"IF(VLOOKUP($D18,invullijst!$A$11:$M$196,2,FALSE)=\"\",\"\",VLOOKUP($D18,invullijst!$A$11:$M$196,2,FALSE))","v":0},null,{"$f":"IF(VLOOKUP($D18,invullijst!$A$11:$M$196,7,FALSE)=0,\"\",VLOOKUP($D18,invullijst!$A$11:$M$196,7,FALSE))","v":""},null,1,{"$f":"IF($O$3=\"k\",IF(VLOOKUP($L18,invullijst!$A$11:$M$196,11,FALSE)=0,\" \",VLOOKUP($L18,invullijst!$A$11:$M$196,11,FALSE)),\"\")","v":""},{"$f":"IF(VLOOKUP($L18,invullijst!$A$11:$M$237,4,FALSE)=\"\",\"\",VLOOKUP($L18,invullijst!$A$11:$M$237,4,FALSE))","v":"vr"},223,{"$f":"IF(VLOOKUP($L18,invullijst!$A$11:$M$196,2,FALSE)=\"\",\"\",VLOOKUP($L18,invullijst!$A$11:$M$196,2,FALSE))","v":"Jänis Jakobsons"},null,{"$f":"IF(VLOOKUP($L18,invullijst!$A$11:$M$196,7,FALSE)=0,\"\",VLOOKUP($L18,invullijst!$A$11:$M$196,7,FALSE))","v":74}]
[2,{"$f":"IF($G$3=\"k\",IF(VLOOKUP($D19,invullijst!$A$11:$M$196,11,FALSE)=0,\" \",VLOOKUP($D19,invullijst!$A$11:$M$196,11,FALSE)),\"\")","v":""},{"$f":"IF(VLOOKUP(D19,invullijst!A$11:F$237,4,FALSE)=\"\",\"\",VLOOKUP(D19,invullijst!A$11:D$237,4,FALSE))","v":0},null,{"$f":"IF(VLOOKUP($D19,invullijst!$A$11:$M$196,2,FALSE)=\"\",\"\",VLOOKUP($D19,invullijst!$A$11:$M$196,2,FALSE))","v":0},null,{"$f":"IF(VLOOKUP($D19,invullijst!$A$11:$M$196,7,FALSE)=0,\"\",VLOOKUP($D19,invullijst!$A$11:$M$196,7,FALSE))","v":""},null,2,{"$f":"IF($O$3=\"k\",IF(VLOOKUP($L19,invullijst!$A$11:$M$196,11,FALSE)=0,\" \",VLOOKUP($L19,invullijst!$A$11:$M$196,11,FALSE)),\"\")","v":""},{"$f":"IF(VLOOKUP($L19,invullijst!$A$11:$M$237,4,FALSE)=\"\",\"\",VLOOKUP($L19,invullijst!$A$11:$M$237,4,FALSE))","v":0},null,{"$f":"IF(VLOOKUP($L19,invullijst!$A$11:$M$196,2,FALSE)=\"\",\"\",VLOOKUP($L19,invullijst!$A$11:$M$196,2,FALSE))","v":0},null,{"$f":"IF(VLOOKUP($L19,invullijst!$A$11:$M$196,7,FALSE)=0,\"\",VLOOKUP($L19,invullijst!$A$11:$M$196,7,FALSE))","v":""}]
[3,{"$f":"IF($G$3=\"k\",IF(VLOOKUP($D20,invullijst!$A$11:$M$196,11,FALSE)=0,\" \",VLOOKUP($D20,invullijst!$A$11:$M$196,11,FALSE)),\"\")","v":""},{"$f":"IF(VLOOKUP(D20,invullijst!A$11:F$237,4,FALSE)=\"\",\"\",VLOOKUP(D20,invullijst!A$11:D$237,4,FALSE))","v":0},null,{"$f":"IF(VLOOKUP($D20,invullijst!$A$11:$M$196,2,FALSE)=\"\",\"\",VLOOKUP($D20,invullijst!$A$11:$M$196,2,FALSE))","v":0},null,{"$f":"IF(VLOOKUP($D20,invullijst!$A$11:$M$196,7,FALSE)=0,\"\",VLOOKUP($D20,invullijst!$A$11:$M$196,7,FALSE))","v":""},null,3,{"$f":"IF($O$3=\"k\",IF(VLOOKUP($L20,invullijst!$A$11:$M$196,11,FALSE)=0,\" \",VLOOKUP($L20,invullijst!$A$11:$M$196,11,FALSE)),\"\")","v":""},{"$f":"IF(VLOOKUP($L20,invullijst!$A$11:$M$237,4,FALSE)=\"\",\"\",VLOOKUP($L20,invullijst!$A$11:$M$237,4,FALSE))","v":0},null,{"$f":"IF(VLOOKUP($L20,invullijst!$A$11:$M$196,2,FALSE)=\"\",\"\",VLOOKUP($L20,invullijst!$A$11:$M$196,2,FALSE))","v":0},null,{"$f":"IF(VLOOKUP($L20,invullijst!$A$11:$M$196,7,FALSE)=0,\"\",VLOOKUP($L20,invullijst!$A$11:$M$196,7,FALSE))","v":""}]
[4,{"$f":"IF($G$3=\"k\",IF(VLOOKUP($D21,invullijst!$A$11:$M$196,11,FALSE)=0,\" \",VLOOKUP($D21,invullijst!$A$11:$M$196,11,FALSE)),\"\")","v":""},{"$f":"IF(VLOOKUP(D21,invullijst!A$11:F$237,4,FALSE)=\"\",\"\",VLOOKUP(D21,invullijst!A$11:D$237,4,FALSE))","v":0},null,{"$f":"IF(VLOOKUP($D21,invullijst!$A$11:$M$196,2,FALSE)=\"\",\"\",VLOOKUP($D21,invullijst!$A$11:$M$196,2,FALSE))","v":0},null,{"$f":"IF(VLOOKUP($D21,invullijst!$A$11:$M$196,7,FALSE)=0,\"\",VLOOKUP($D21,invullijst!$A$11:$M$196,7,FALSE))","v":""},null,4,{"$f":"IF($O$3=\"k\",IF(VLOOKUP($L21,invullijst!$A$11:$M$196,11,FALSE)=0,\" \",VLOOKUP($L21,invullijst!$A$11:$M$196,11,FALSE)),\"\")","v":""},{"$f":"IF(VLOOKUP($L21,invullijst!$A$11:$M$237,4,FALSE)=\"\",\"\",VLOOKUP($L21,invullijst!$A$11:$M$237,4,FALSE))","v":0},null,{"$f":"IF(VLOOKUP($L21,invullijst!$A$11:$M$196,2,FALSE)=\"\",\"\",VLOOKUP($L21,invullijst!$A$11:$M$196,2,FALSE))","v":0},null,{"$f":"IF(VLOOKUP($L21,invullijst!$A$11:$M$196,7,FALSE)=0,\"\",VLOOKUP($L21,invullijst!$A$11:$M$196,7,FALSE))","v":""}]
["DIVERSE / INHAAL",{"$nulls":5},{"$f":"SUM(G18:G21)","v":0},null,"DIVERSE / INHAAL",{"$nulls":5},{"$f":"SUM(O18:O21)","v":74}]
[]
["OPGELEGD (Jeugd <16 en 65+)"]
[1,{"$f":"IF($G$3=\"k\",IF(VLOOKUP($D25,invullijst!$A$11:$M$196,11,FALSE)=0,\" \",VLOOKUP($D25,invullijst!$A$11:$M$196,11,FALSE)),\"\")","v":""},{"$f":"IF(VLOOKUP(D25,invullijst!A$11:F$237,4,FALSE)=\"\",\"\",VLOOKUP(D25,invullijst!A$11:D$237,4,FALSE))","v":"65+"},509,{"$f":"IF(VLOOKUP($D25,invullijst!$A$11:$M$196,2,FALSE)=\"\",\"\",VLOOKUP($D25,invullijst!$A$11:$M$196,2,FALSE))","v":"Adwan de Pinth"},null,{"$f":"IF(VLOOKUP($D25,invullijst!$A$11:$M$196,7,FALSE)=0,\"\",VLOOKUP($D25,invullijst!$A$11:$M$196,7,FALSE))","v":96},null,1,{"$f":"IF($O$3=\"k\",IF(VLOOKUP($L25,invullijst!$A$11:$M$196,11,FALSE)=0,\" \",VLOOKUP($L25,invullijst!$A$11:$M$196,11,FALSE)),\"\")","v":""},{"$f":"IF(VLOOKUP($L25,invullijst!$A$11:$M$237,4,FALSE)=\"\",\"\",VLOOKUP($L25,invullijst!$A$11:$M$237,4,FALSE))","v":"65+"},218,{"$f":"IF(VLOOKUP($L25,invullijst!$A$11:$M$196,2,FALSE)=\"\",\"\",VLOOKUP($L25,invullijst!$A$11:$M$196,2,FALSE))","v":"Jacob van de Werken"},null,{"$f":"IF(VLOOKUP($L25,invullijst!$A$11:$M$196,7,FALSE)=0,\"\",VLOOKUP($L25,invullijst!$A$11:$M$196,7,FALSE))","v":96}]
[2,{"$f":"IF($G$3=\"k\",IF(VLOOKUP($D26,invullijst!$A$11:$M$196,11,FALSE)=0,\" \",VLOOKUP($D26,invullijst!$A$11:$M$196,11,FALSE)),\"\")","v":""},{"$f":"IF(VLOOKUP(D26,invullijst!A$11:F$237,4,FALSE)=\"\",\"\",VLOOKUP(D26,invullijst!A$11:D$237,4,FALSE))","v":"65+"},516,{"$f":"IF(VLOOKUP($D26,invullijst!$A$11:$M$196,2,FALSE)=\"\",\"\",VLOOKUP($D26,invullijst!$A$11:$M$196,2,FALSE))","v":"Henry Bergakker (disp)"},null,{"$f":"IF(VLOOKUP($D26,invullijst!$A$11:$M$196,7,FALSE)=0,\"\",VLOOKUP($D26,invullijst!$A$11:$M$196,7,FALSE))","v":81},null,2,{"$f":"IF($O$3=\"k\",IF(VLOOKUP($L26,invullijst!$A$11:$M$196,11,FALSE)=0,\" \",VLOOKUP($L26,invullijst!$A$11:$M$196,11,FALSE)),\"\")","v":""},{"$f":"IF(VLOOKUP($L26,invullijst!$A$11:$M$237,4,FALSE)=\"\",\"\",VLOOKUP($L26,invullijst!$A$11:$M$237,4,FALSE))","v":"65+"},220,{"$f":"IF(VLOOKUP($L26,invullijst!$A$11:$M$196,2,FALSE)=\"\",\"\",VLOOKUP($L26,invullijst!$A$11:$M$196,2,FALSE))","v":"Kees Vos"},null,{"$f":"IF(VLOOKUP($L26,invullijst!$A$11:$M$196,7,FALSE)=0,\"\",VLOOKUP($L26,invullijst!$A$11:$M$196,7,FALSE))","v":94}]
[3,{"$f":"IF($G$3=\"k\",IF(VLOOKUP($D27,invullijst!$A$11:$M$196,11,FALSE)=0,\" \",VLOOKUP($D27,invullijst!$A$11:$M$196,11,FALSE)),\"\")","v":""},{"$f":"IF(VLOOKUP(D27,invullijst!A$11:F$237,4,FALSE)=\"\",\"\",VLOOKUP(D27,invullijst!A$11:D$237,4,FALSE))","v":"65+"},517,{"$f":"IF(VLOOKUP($D27,invullijst!$A$11:$M$196,2,FALSE)=\"\",\"\",VLOOKUP($D27,invullijst!$A$11:$M$196,2,FALSE))","v":"Diny Vos (disp)"},null,{"$f":"IF(VLOOKUP($D27,invullijst!$A$11:$M$196,7,FALSE)=0,\"\",VLOOKUP($D27,invullijst!$A$11:$M$196,7,FALSE))","v":95},null,3,{"$f":"IF($O$3=\"k\",IF(VLOOKUP($L27,invullijst!$A$11:$M$196,11,FALSE)=0,\" \",VLOOKUP($L27,invullijst!$A$11:$M$196,11,FALSE)),\"\")","v":""},{"$f":"IF(VLOOKUP($L27,invullijst!$A$11:$M$237,4,FALSE)=\"\",\"\",VLOOKUP($L27,invullijst!$A$11:$M$237,4,FALSE))","v":"65+"},219,{"$f":"IF(VLOOKUP($L27,invullijst!$A$11:$M$196,2,FALSE)=\"\",\"\",VLOOKUP($L27,invullijst!$A$11:$M$196,2,FALSE))","v":"Frans de Bont"},null,{"$f":"IF(VLOOKUP($L27,invullijst!$A$11:$M$196,7,FALSE)=0,\"\",VLOOKUP($L27,invullijst!$A$11:$M$196,7,FALSE))","v":96}]
["Totaal korps opgelegd A1",{"$nulls":5},{"$f":"SUM(G25:G27)","v":272},null,"Totaal korps opgelegd A1",{"$nulls":5},{"$f":"SUM(O25:O27)","v":286}]
[]
[1,{"$f":"IF($G$3=\"k\",IF(VLOOKUP($D30,invullijst!$A$11:$M$196,11,FALSE)=0,\" \",VLOOKUP($D30,invullijst!$A$11:$M$196,11,FALSE)),\"\")","v":""},{"$f":"IF(VLOOKUP(D30,invullijst!A$11:F$237,4,FALSE)=\"\",\"\",VLOOKUP(D30,invullijst!A$11:D$237,4,FALSE))","v":"65+"},503,{"$f":"IF(VLOOKUP($D30,invullijst!$A$11:$M$196,2,FALSE)=\"\",\"\",VLOOKUP($D30,invullijst!$A$11:$M$196,2,FALSE))","v":"Kees Vos (disp)"},null,{"$f":"IF(VLOOKUP($D30,invullijst!$A$11:$M$196,7,FALSE)=0,\"\",VLOOKUP($D30,invullijst!$A$11:$M$196,7,FALSE))","v":82},null,1,{"$f":"IF($O$3=\"k\",IF(VLOOKUP($L30,invullijst!$A$11:$M$196,11,FALSE)=0,\" \",VLOOKUP($L30,invullijst!$A$11:$M$196,11,FALSE)),\"\")","v":""},{"$f":"IF(VLOOKUP($L30,invullijst!$A$11:$M$237,4,FALSE)=\"\",\"\",VLOOKUP($L30,invullijst!$A$11:$M$237,4,FALSE))","v":"65+"},212,{"$f":"IF(VLOOKUP($L30,invullijst!$A$11:$M$196,2,FALSE)=\"\",\"\",VLOOKUP($L30,invullijst!$A$11:$M$196,2,FALSE))","v":"René Duquesnoy"},null,{"$f":"IF(VLOOKUP($L30,invullijst!$A$11:$M$196,7,FALSE)=0,\"\",VLOOKUP($L30,invullijst!$A$11:$M$196,7,FALSE))","v":85}]
[2,{"$f":"IF($G$3=\"k\",IF(VLOOKUP($D31,invullijst!$A$11:$M$196,11,FALSE)=0,\" \",VLOOKUP($D31,invullijst!$A$11:$M$196,11,FALSE)),\"\")","v":""},{"$f":"IF(VLOOKUP(D31,invullijst!A$11:F$237,4,FALSE)=\"\",\"\",VLOOKUP(D31,invullijst!A$11:D$237,4,FALSE))","v":"65+"},518,{"$f":"IF(VLOOKUP($D31,invullijst!$A$11:$M$196,2,FALSE)=\"\",\"\",VLOOKUP($D31,invullijst!$A$11:$M$196,2,FALSE))","v":"Ton Stanz"},null,{"$f":"IF(VLOOKUP($D31,invullijst!$A$11:$M$196,7,FALSE)=0,\"\",VLOOKUP($D31,invullijst!$A$11:$M$196,7,FALSE))","v":88},null,2,{"$f":"IF($O$3=\"k\",IF(VLOOKUP($L31,invullijst!$A$11:$M$196,11,FALSE)=0,\" \",VLOOKUP($L31,invullijst!$A$11:$M$196,11,FALSE)),\"\")","v":""},{"$f":"IF(VLOOKUP($L31,invullijst!$A$11:$M$237,4,FALSE)=\"\",\"\",VLOOKUP($L31,invullijst!$A$11:$M$237,4,FALSE))","v":"65+"},214,{"$f":"IF(VLOOKUP($L31,invullijst!$A$11:$M$196,2,FALSE)=\"\",\"\",VLOOKUP($L31,invullijst!$A$11:$M$196,2,FALSE))","v":"Andre de Vaan"},null,{"$f":"IF(VLOOKUP($L31,invullijst!$A$11:$M$196,7,FALSE)=0,\"\",VLOOKUP($L31,invullijst!$A$11:$M$196,7,FALSE))","v":93}]
[3,{"$f":"IF($G$3=\"k\",IF(VLOOKUP($D32,invullijst!$A$11:$M$196,11,FALSE)=0,\" \",VLOOKUP($D32,invullijst!$A$11:$M$196,11,FALSE)),\"\")","v":""},{"$f":"IF(VLOOKUP(D32,invullijst!A$11:F$237,4,FALSE)=\"\",\"\",VLOOKUP(D32,invullijst!A$11:D$237,4,FALSE))","v":"65+"},515,{"$f":"IF(VLOOKUP($D32,invullijst!$A$11:$M$196,2,FALSE)=\"\",\"\",VLOOKUP($D32,invullijst!$A$11:$M$196,2,FALSE))","v":"Ilona Bergakker (disp)"},null,{"$f":"IF(VLOOKUP($D32,invullijst!$A$11:$M$196,7,FALSE)=0,\"\",VLOOKUP($D32,invullijst!$A$11:$M$196,7,FALSE))","v":87},null,3,{"$f":"IF($O$3=\"k\",IF(VLOOKUP($L32,invullijst!$A$11:$M$196,11,FALSE)=0,\" \",VLOOKUP($L32,invullijst!$A$11:$M$196,11,FALSE)),\"\")","v":""},{"$f":"IF(VLOOKUP($L32,invullijst!$A$11:$M$237,4,FALSE)=\"\",\"\",VLOOKUP($L32,invullijst!$A$11:$M$237,4,FALSE))","v":"J"},221,{"$f":"IF(VLOOKUP($L32,invullijst!$A$11:$M$196,2,FALSE)=\"\",\"\",VLOOKUP($L32,invullijst!$A$11:$M$196,2,FALSE))","v":"Mees Huijben"},null,{"$f":"IF(VLOOKUP($L32,invullijst!$A$11:$M$196,7,FALSE)=0,\"\",VLOOKUP($L32,invullijst!$A$11:$M$196,7,FALSE))","v":83}]
["Totaal korps opgelegd A2",{"$nulls":5},{"$f":"SUM(G30:G32)","v":257},null,"Totaal korps opgelegd A2",{"$nulls":5},{"$f":"SUM(O30:O32)","v":261}]
[]
[1,{"$f":"IF($G$3=\"k\",IF(VLOOKUP($D35,invullijst!$A$11:$M$196,11,FALSE)=0,\" \",VLOOKUP($D35,invullijst!$A$11:$M$196,11,FALSE)),\"\")","v":""},{"$f":"IF(VLOOKUP(D35,invullijst!A$11:F$237,4,FALSE)=\"\",\"\",VLOOKUP(D35,invullijst!A$11:D$237,4,FALSE))","v":"J"},502,{"$f":"IF(VLOOKUP($D35,invullijst!$A$11:$M$196,2,FALSE)=\"\",\"\",VLOOKUP($D35,invullijst!$A$11:$M$196,2,FALSE))","v":"Djody Wagemakers"},null,{"$f":"IF(VLOOKUP($D35,invullijst!$A$11:$M$196,7,FALSE)=0,\"\",VLOOKUP($D35,invullijst!$A$11:$M$196,7,FALSE))","v":91},null,1,"inh",{"$f":"IF(VLOOKUP($L35,invullijst!$A$11:$M$237,4,FALSE)=\"\",\"\",VLOOKUP($L35,invullijst!$A$11:$M$237,4,FALSE))","v":"vr"},208,{"$f":"IF(VLOOKUP($L35,invullijst!$A$11:$M$196,2,FALSE)=\"\",\"\",VLOOKUP($L35,invullijst!$A$11:$M$196,2,FALSE))","v":"Erin van Hulten"},null,83]
[2,{"$f":"IF($G$3=\"k\",IF(VLOOKUP($D36,invullijst!$A$11:$M$196,11,FALSE)=0,\" \",VLOOKUP($D36,invullijst!$A$11:$M$196,11,FALSE)),\"\")","v":""},{"$f":"IF(VLOOKUP(D36,invullijst!A$11:F$237,4,FALSE)=\"\",\"\",VLOOKUP(D36,invullijst!A$11:D$237,4,FALSE))","v":0},null,{"$f":"IF(VLOOKUP($D36,invullijst!$A$11:$M$196,2,FALSE)=\"\",\"\",VLOOKUP($D36,invullijst!$A$11:$M$196,2,FALSE))","v":0},null,{"$f":"IF(VLOOKUP($D36,invullijst!$A$11:$M$196,7,FALSE)=0,\"\",VLOOKUP($D36,invullijst!$A$11:$M$196,7,FALSE))","v":""},null,2,"inh",{"$f":"IF(VLOOKUP($L36,invullijst!$A$11:$M$237,4,FALSE)=\"\",\"\",VLOOKUP($L36,invullijst!$A$11:$M$237,4,FALSE))","v":"J"},221,{"$f":"IF(VLOOKUP($L36,invullijst!$A$11:$M$196,2,FALSE)=\"\",\"\",VLOOKUP($L36,invullijst!$A$11:$M$196,2,FALSE))","v":"Mees Huijben"},null,86]
[3,{"$f":"IF($G$3=\"k\",IF(VLOOKUP($D37,invullijst!$A$11:$M$196,11,FALSE)=0,\" \",VLOOKUP($D37,invullijst!$A$11:$M$196,11,FALSE)),\"\")","v":""},{"$f":"IF(VLOOKUP(D37,invullijst!A$11:F$237,4,FALSE)=\"\",\"\",VLOOKUP(D37,invullijst!A$11:D$237,4,FALSE))","v":0},null,{"$f":"IF(VLOOKUP($D37,invullijst!$A$11:$M$196,2,FALSE)=\"\",\"\",VLOOKUP($D37,invullijst!$A$11:$M$196,2,FALSE))","v":0},null,{"$f":"IF(VLOOKUP($D37,invullijst!$A$11:$M$196,7,FALSE)=0,\"\",VLOOKUP($D37,invullijst!$A$11:$M$196,7,FALSE))","v":""},null,3,"inh",{"$f":"IF(VLOOKUP($L37,invullijst!$A$11:$M$237,4,FALSE)=\"\",\"\",VLOOKUP($L37,invullijst!$A$11:$M$237,4,FALSE))","v":"vr"},223,{"$f":"IF(VLOOKUP($L37,invullijst!$A$11:$M$196,2,FALSE)=\"\",\"\",VLOOKUP($L37,invullijst!$A$11:$M$196,2,FALSE))","v":"Jänis Jakobsons"},null,80]
["Totaal korps opgelegd A3",{"$nulls":5},{"$f":"SUM(G35:G37)","v":91},null,"Totaal korps opgelegd A3"]

{"sheet":"wedstrijd 3A","index":9,"n_rows":38,"n_cols":15,"rows_kept":38,"merged":[[0,0,0,4],[0,5,0,7],[0,8,0,14],[1,0,1,11],[1,12,1,14],[2,1,2,5],[2,9,2,13],[4,0,4,14],[5,4,5,5],[5,12,5,13],[6,4,6,5],[6,12,6,13],[7,4,7,5],[7,12,7,13],[8,4,8,5],[8,12,8,13],[9,0,9,5],[9,8,9,13],[11,4,11,5],[11,12,11,13],[12,4,12,5],[12,12,12,13],[13,4,13,5],[13,12,13,13],[14,4,14,5],[14,12,14,13],[15,0,15,5],[15,8,15,13],[17,4,17,5],[17,12,17,13],[18,4,18,5],[18,12,18,13],[19,4,19,5],[19,12,19,13],[20,4,20,5],[20,12,20,13],[21,0,21,5],[21,8,21,13],[23,0,23,14],[24,4,24,5],[24,12,24,13],[25,4,25,5],[25,12,25,13],[26,4,26,5],[26,12,26,13],[27,0,27,5],[27,8,27,13],[29,4,29,5],[29,12,29,13],[30,4,30,5],[30,12,30,13],[31,4,31,5],[31,12,31,13],[32,0,32,5],[32,8,32,13],[34,4,34,5],[34,12,34,13],[35,4,35,5],[35,12,35,13],[36,4,36,5],[36,12,36,13],[37,0,37,5],[37,8,37,13]]}
[{"$f":"invullijst!F1","v":"Organistatie"},{"$nulls":4},{"$f":"invullijst!H2","v":"2025 - 2026"},null,null,{"$f":"invullijst!F3","v":"Sint Ambrosius Baardwijk"}]
["Datum: ",{"$nulls":11},"2026-02-01"]
[2,{"$f":"IF(VLOOKUP(A3,invullijst!A1:F5,2,FALSE)=\"\",\"\",VLOOKUP(A3,invullijst!A1:F5,2,FALSE))","v":"St. Crispinus & Crispinianus Besoijen"},{"$nulls":4},"K",null,1,{"$f":"IF(VLOOKUP(I3,invullijst!A1:C5,2,FALSE)=\"\",\"\",VLOOKUP(I3,invullijst!A1:C5,2,FALSE))","v":"Sint Ambrosius Baardwijk"}]
[]
["vrijehand"]
[1,{"$f":"IF($G$3=\"k\",IF(VLOOKUP($D6,invullijst!$A$11:$M$196,11,FALSE)=0,\" \",VLOOKUP($D6,invullijst!$A$11:$M$196,11,FALSE)),\"\")","v":40},{"$f":"IF(VLOOKUP(D6,invullijst!A$11:F$237,4,FALSE)=\"\",\"\",VLOOKUP(D6,invullijst!A$11:D$237,4,FALSE))","v":"vr"},210,{"$f":"IF(VLOOKUP($D6,invullijst!$A$11:$M$196,2,FALSE)=\"\",\"\",VLOOKUP($D6,invullijst!$A$11:$M$196,2,FALSE))","v":"Sander Oome"},null,{"$f":"IF(VLOOKUP($D6,invullijst!$A$11:$M$196,8,FALSE)=0,\"\",VLOOKUP($D6,invullijst!$A$11:$M$196,8,FALSE))","v":93},null,1,{"$f":"IF($O$3=\"k\",IF(VLOOKUP($L6,invullijst!$A$11:$M$196,11,FALSE)=0,\" \",VLOOKUP($L6,invullijst!$A$11:$M$196,11,FALSE)),\"\")","v":""},{"$f":"IF(VLOOKUP($L6,invullijst!$A$11:$M$237,4,FALSE)=\"\",\"\",VLOOKUP($L6,invullijst!$A$11:$M$237,4,FALSE))","v":"vr"},105,{"$f":"IF(VLOOKUP($L6,invullijst!$A$11:$M$196,2,FALSE)=\"\",\"\",VLOOKUP($L6,invullijst!$A$11:$M$196,2,FALSE))","v":"René Klijn"},null,{"$f":"IF(VLOOKUP($L6,invullijst!$A$11:$M$196,8,FALSE)=0,\"\",VLOOKUP($L6,invullijst!$A$11:$M$196,8,FALSE))","v":84}]
[2,{"$f":"IF($G$3=\"k\",IF(VLOOKUP($D7,invullijst!$A$11:$M$196,11,FALSE)=0,\" \",VLOOKUP($D7,invullijst!$A$11:$M$196,11,FALSE)),\"\")","v":39},{"$f":"IF(VLOOKUP(D7,invullijst!A$11:F$237,4,FALSE)=\"\",\"\",VLOOKUP(D7,invullijst!A$11:D$237,4,FALSE))","v":"vr"},203,{"$f":"IF(VLOOKUP($D7,invullijst!$A$11:$M$196,2,FALSE)=\"\",\"\",VLOOKUP($D7,invullijst!$A$11:$M$196,2,FALSE))","v":"Frank van den Houdt"},null,{"$f":"IF(VLOOKUP($D7,invullijst!$A$11:$M$196,8,FALSE)=0,\"\",VLOOKUP($D7,invullijst!$A$11:$M$196,8,FALSE))","v":73},null,2,{"$f":"IF($O$3=\"k\",IF(VLOOKUP($L7,invullijst!$A$11:$M$196,11,FALSE)=0,\" \",VLOOKUP($L7,invullijst!$A$11:$M$196,11,FALSE)),\"\")","v":""},{"$f":"IF(VLOOKUP($L7,invullijst!$A$11:$M$237,4,FALSE)=\"\",\"\",VLOOKUP($L7,invullijst!$A$11:$M$237,4,FALSE))","v":"vr"},108,{"$f":"IF(VLOOKUP($L7,invullijst!$A$11:$M$196,2,FALSE)=\"\",\"\",VLOOKUP($L7,invullijst!$A$11:$M$196,2,FALSE))","v":"Bram Pullens"},null,{"$f":"IF(VLOOKUP($L7,invullijst!$A$11:$M$196,8,FALSE)=0,\"\",VLOOKUP($L7,invullijst!$A$11:$M$196,8,FALSE))","v":78}]
[3,{"$f":"IF($G$3=\"k\",IF(VLOOKUP($D8,invullijst!$A$11:$M$196,11,FALSE)=0,\" \",VLOOKUP($D8,invullijst!$A$11:$M$196,11,FALSE)),\"\")","v":44},{"$f":"IF(VLOOKUP(D8,invullijst!A$11:F$237,4,FALSE)=\"\",\"\",VLOOKUP(D8,invullijst!A$11:D$237,4,FALSE))","v":"vr"},216,{"$f":"IF(VLOOKUP($D8,invullijst!$A$11:$M$196,2,FALSE)=\"\",\"\",VLOOKUP($D8,invullijst!$A$11:$M$196,2,FALSE))","v":"Pieter Laghuwitz"},null,{"$f":"IF(VLOOKUP($D8,invullijst!$A$11:$M$196,8,FALSE)=0,\"\",VLOOKUP($D8,invullijst!$A$11:$M$196,8,FALSE))","v":86},null,3,{"$f":"IF($O$3=\"k\",IF(VLOOKUP($L8,invullijst!$A$11:$M$196,11,FALSE)=0,\" \",VLOOKUP($L8,invullijst!$A$11:$M$196,11,FALSE)),\"\")","v":""},{"$f":"IF(VLOOKUP($L8,invullijst!$A$11:$M$237,4,FALSE)=\"\",\"\",VLOOKUP($L8,invullijst!$A$11:$M$237,4,FALSE))","v":"vr"},109,{"$f":"IF(VLOOKUP($L8,invullijst!$A$11:$M$196,2,FALSE)=\"\",\"\",VLOOKUP($L8,invullijst!$A$11:$M$196,2,FALSE))","v":"Gijs Pullens"},null,{"$f":"IF(VLOOKUP($L8,invullijst!$A$11:$M$196,8,FALSE)=0,\"\",VLOOKUP($L8,invullijst!$A$11:$M$196,8,FALSE))","v":76}]
[4,{"$f":"IF($G$3=\"k\",IF(VLOOKUP($D9,invullijst!$A$11:$M$196,11,FALSE)=0,\" \",VLOOKUP($D9,invullijst!$A$11:$M$196,11,FALSE)),\"\")","v":37},{"$f":"IF(VLOOKUP(D9,invullijst!A$11:F$237,4,FALSE)=\"\",\"\",VLOOKUP(D9,invullijst!A$11:D$237,4,FALSE))","v":"vr"},217,{"$f":"IF(VLOOKUP($D9,invullijst!$A$11:$M$196,2,FALSE)=\"\",\"\",VLOOKUP($D9,invullijst!$A$11:$M$196,2,FALSE))","v":"Hans Laghuwitz"},null,{"$f":"IF(VLOOKUP($D9,invullijst!$A$11:$M$196,8,FALSE)=0,\"\",VLOOKUP($D9,invullijst!$A$11:$M$196,8,FALSE))","v":83},null,4,{"$f":"IF($O$3=\"k\",IF(VLOOKUP($L9,invullijst!$A$11:$M$196,11,FALSE)=0,\" \",VLOOKUP($L9,invullijst!$A$11:$M$196,11,FALSE)),\"\")","v":""},{"$f":"IF(VLOOKUP($L9,invullijst!$A$11:$M$237,4,FALSE)=\"\",\"\",VLOOKUP($L9,invullijst!$A$11:$M$237,4,FALSE))","v":"vr"},106,{"$f":"IF(VLOOKUP($L9,invullijst!$A$11:$M$196,2,FALSE)=\"\",\"\",VLOOKUP($L9,invullijst!$A$11:$M$196,2,FALSE))","v":"René Pullens"},null,{"$f":"IF(VLOOKUP($L9,invullijst!$A$11:$M$196,8,FALSE)=0,\"\",VLOOKUP($L9,invullijst!$A$11:$M$196,8,FALSE))","v":83}]
["Totaal A korps",{"$nulls":5},{"$f":"SUM(G6:G9)","v":335},null,"Totaal A korps",{"$nulls":5},{"$f":"SUM(O6:O9)","v":321}]
[]
[1,{"$f":"IF($G$3=\"k\",IF(VLOOKUP($D12,invullijst!$A$11:$M$196,11,FALSE)=0,\" \",VLOOKUP($D12,invullijst!$A$11:$M$196,11,FALSE)),\"\")","v":33},{"$f":"IF(VLOOKUP(D12,invullijst!A$11:F$237,4,FALSE)=\"\",\"\",VLOOKUP(D12,invullijst!A$11:D$237,4,FALSE))","v":"vr"},209,{"$f":"IF(VLOOKUP($D12,invullijst!$A$11:$M$196,2,FALSE)=\"\",\"\",VLOOKUP($D12,invullijst!$A$11:$M$196,2,FALSE))","v":"René van Kuijk"},null,{"$f":"IF(VLOOKUP($D12,invullijst!$A$11:$M$196,8,FALSE)=0,\"\",VLOOKUP($D12,invullijst!$A$11:$M$196,8,FALSE))","v":84},null,1,{"$f":"IF($O$3=\"k\",IF(VLOOKUP($L12,invullijst!$A$11:$M$196,11,FALSE)=0,\" \",VLOOKUP($L12,invullijst!$A$11:$M$196,11,FALSE)),\"\")","v":""},{"$f":"IF(VLOOKUP($L12,invullijst!$A$11:$M$237,4,FALSE)=\"\",\"\",VLOOKUP($L12,invullijst!$A$11:$M$237,4,FALSE))","v":0},null,{"$f":"IF(VLOOKUP($L12,invullijst!$A$11:$M$196,2,FALSE)=\"\",\"\",VLOOKUP($L12,invullijst!$A$11:$M$196,2,FALSE))","v":0},null,{"$f":"IF(VLOOKUP($L12,invullijst!$A$11:$M$196,8,FALSE)=0,\"\",VLOOKUP($L12,invullijst!$A$11:$M$196,8,FALSE))","v":""}]
[2,{"$f":"IF($G$3=\"k\",IF(VLOOKUP($D13,invullijst!$A$11:$M$196,11,FALSE)=0,\" \",VLOOKUP($D13,invullijst!$A$11:$M$196,11,FALSE)),\"\")","v":39},{"$f":"IF(VLOOKUP(D13,invullijst!A$11:F$237,4,FALSE)=\"\",\"\",VLOOKUP(D13,invullijst!A$11:D$237,4,FALSE))","v":"vr"},205,{"$f":"IF(VLOOKUP($D13,invullijst!$A$11:$M$196,2,FALSE)=\"\",\"\",VLOOKUP($D13,invullijst!$A$11:$M$196,2,FALSE))","v":"Jos v/d Snepscheut"},null,{"$f":"IF(VLOOKUP($D13,invullijst!$A$11:$M$196,8,FALSE)=0,\"\",VLOOKUP($D13,invullijst!$A$11:$M$196,8,FALSE))","v":76},null,2,{"$f":"IF($O$3=\"k\",IF(VLOOKUP($L13,invullijst!$A$11:$M$196,11,FALSE)=0,\" \",VLOOKUP($L13,invullijst!$A$11:$M$196,11,FALSE)),\"\")","v":""},{"$f":"IF(VLOOKUP($L13,invullijst!$A$11:$M$237,4,FALSE)=\"\",\"\",VLOOKUP($L13,invullijst!$A$11:$M$237,4,FALSE))","v":0},null,{"$f":"IF(VLOOKUP($L13,invullijst!$A$11:$M$196,2,FALSE)=\"\",\"\",VLOOKUP($L13,invullijst!$A$11:$M$196,2,FALSE))","v":0},null,{"$f":"IF(VLOOKUP($L13,invullijst!$A$11:$M$196,8,FALSE)=0,\"\",VLOOKUP($L13,invullijst!$A$11:$M$196,8,FALSE))","v":""}]
[3,{"$f":"IF($G$3=\"k\",IF(VLOOKUP($D14,invullijst!$A$11:$M$196,11,FALSE)=0,\" \",VLOOKUP($D14,invullijst!$A$11:$M$196,11,FALSE)),\"\")","v":33},{"$f":"IF(VLOOKUP(D14,invullijst!A$11:F$237,4,FALSE)=\"\",\"\",VLOOKUP(D14,invullijst!A$11:D$237,4,FALSE))","v":"vr"},204,{"$f":"IF(VLOOKUP($D14,invullijst!$A$11:$M$196,2,FALSE)=\"\",\"\",VLOOKUP($D14,invullijst!$A$11:$M$196,2,FALSE))","v":"Harry de Louw"},null,{"$f":"IF(VLOOKUP($D14,invullijst!$A$11:$M$196,8,FALSE)=0,\"\",VLOOKUP($D14,invullijst!$A$11:$M$196,8,FALSE))","v":83},null,3,{"$f":"IF($O$3=\"k\",IF(VLOOKUP($L14,invullijst!$A$11:$M$196,11,FALSE)=0,\" \",VLOOKUP($L14,invullijst!$A$11:$M$196,11,FALSE)),\"\")","v":""},{"$f":"IF(VLOOKUP($L14,invullijst!$A$11:$M$237,4,FALSE)=\"\",\"\",VLOOKUP($L14,invullijst!$A$11:$M$237,4,FALSE))","v":0},null,{"$f":"IF(VLOOKUP($L14,invullijst!$A$11:$M$196,2,FALSE)=\"\",\"\",VLOOKUP($L14,invullijst!$A$11:$M$196,2,FALSE))","v":0},null,{"$f":"IF(VLOOKUP($L14,invullijst!$A$11:$M$196,8,FALSE)=0,\"\",VLOOKUP($L14,invullijst!$A$11:$M$196,8,FALSE))","v":""}]
[4,{"$f":"IF($G$3=\"k\",IF(VLOOKUP($D15,invullijst!$A$11:$M$196,11,FALSE)=0,\" \",VLOOKUP($D15,invullijst!$A$11:$M$196,11,FALSE)),\"\")","v":36},{"$f":"IF(VLOOKUP(D15,invullijst!A$11:F$237,4,FALSE)=\"\",\"\",VLOOKUP(D15,invullijst!A$11:D$237,4,FALSE))","v":"vr"},213,{"$f":"IF(VLOOKUP($D15,invullijst!$A$11:$M$196,2,FALSE)=\"\",\"\",VLOOKUP($D15,invullijst!$A$11:$M$196,2,FALSE))","v":"Roland van Delft"},null,{"$f":"IF(VLOOKUP($D15,invullijst!$A$11:$M$196,8,FALSE)=0,\"\",VLOOKUP($D15,invullijst!$A$11:$M$196,8,FALSE))","v":62},null,4,{"$f":"IF($O$3=\"k\",IF(VLOOKUP($L15,invullijst!$A$11:$M$196,11,FALSE)=0,\" \",VLOOKUP($L15,invullijst!$A$11:$M$196,11,FALSE)),\"\")","v":""},{"$f":"IF(VLOOKUP($L15,invullijst!$A$11:$M$237,4,FALSE)=\"\",\"\",VLOOKUP($L15,invullijst!$A$11:$M$237,4,FALSE))","v":0},null,{"$f":"IF(VLOOKUP($L15,invullijst!$A$11:$M$196,2,FALSE)=\"\",\"\",VLOOKUP($L15,invullijst!$A$11:$M$196,2,FALSE))","v":0},null,{"$f":"IF(VLOOKUP($L15,invullijst!$A$11:$M$196,8,FALSE)=0,\"\",VLOOKUP($L15,invullijst!$A$11:$M$196,8,FALSE))","v":""}]
["Totaal B1 korps",{"$nulls":5},{"$f":"SUM(G12:G15)","v":305},null,"Totaal B1 korps",{"$nulls":5},{"$f":"SUM(O12:O15)","v":0}]
[]
[1,{"$f":"IF($G$3=\"k\",IF(VLOOKUP($D18,invullijst!$A$11:$M$196,11,FALSE)=0,\" \",VLOOKUP($D18,invullijst!$A$11:$M$196,11,FALSE)),\"\")","v":29},{"$f":"IF(VLOOKUP(D18,invullijst!A$11:F$237,4,FALSE)=\"\",\"\",VLOOKUP(D18,invullijst!A$11:D$237,4,FALSE))","v":"vr"},222,{"$f":"IF(VLOOKUP($D18,invullijst!$A$11:$M$196,2,FALSE)=\"\",\"\",VLOOKUP($D18,invullijst!$A$11:$M$196,2,FALSE))","v":"Nick de Vaan"},null,{"$f":"IF(VLOOKUP($D18,invullijst!$A$11:$M$196,8,FALSE)=0,\"\",VLOOKUP($D18,invullijst!$A$11:$M$196,8,FALSE))","v":74},null,1,{"$f":"IF($O$3=\"k\",IF(VLOOKUP($L18,invullijst!$A$11:$M$196,11,FALSE)=0,\" \",VLOOKUP($L18,invullijst!$A$11:$M$196,11,FALSE)),\"\")","v":""},{"$f":"IF(VLOOKUP($L18,invullijst!$A$11:$M$237,4,FALSE)=\"\",\"\",VLOOKUP($L18,invullijst!$A$11:$M$237,4,FALSE))","v":0},null,{"$f":"IF(VLOOKUP($L18,invullijst!$A$11:$M$196,2,FALSE)=\"\",\"\",VLOOKUP($L18,invullijst!$A$11:$M$196,2,FALSE))","v":0},null,{"$f":"IF(VLOOKUP($L18,invullijst!$A$11:$M$196,8,FALSE)=0,\"\",VLOOKUP($L18,invullijst!$A$11:$M$196,8,FALSE))","v":""}]
[2,{"$f":"IF($G$3=\"k\",IF(VLOOKUP($D19,invullijst!$A$11:$M$196,11,FALSE)=0,\" \",VLOOKUP($D19,invullijst!$A$11:$M$196,11,FALSE)),\"\")","v":12},{"$f":"IF(VLOOKUP(D19,invullijst!A$11:F$237,4,FALSE)=\"\",\"\",VLOOKUP(D19,invullijst!A$11:D$237,4,FALSE))","v":"vr"},223,{"$f":"IF(VLOOKUP($D19,invullijst!$A$11:$M$196,2,FALSE)=\"\",\"\",VLOOKUP($D19,invullijst!$A$11:$M$196,2,FALSE))","v":"Jänis Jakobsons"},null,{"$f":"IF(VLOOKUP($D19,invullijst!$A$11:$M$196,8,FALSE)=0,\"\",VLOOKUP($D19,invullijst!$A$11:$M$196,8,FALSE))","v":70},null,2,{"$f":"IF($O$3=\"k\",IF(VLOOKUP($L19,invullijst!$A$11:$M$196,11,FALSE)=0,\" \",VLOOKUP($L19,invullijst!$A$11:$M$196,11,FALSE)),\"\")","v":""},{"$f":"IF(VLOOKUP($L19,invullijst!$A$11:$M$237,4,FALSE)=\"\",\"\",VLOOKUP($L19,invullijst!$A$11:$M$237,4,FALSE))","v":0},null,{"$f":"IF(VLOOKUP($L19,invullijst!$A$11:$M$196,2,FALSE)=\"\",\"\",VLOOKUP($L19,invullijst!$A$11:$M$196,2,FALSE))","v":0},null,{"$f":"IF(VLOOKUP($L19,invullijst!$A$11:$M$196,8,FALSE)=0,\"\",VLOOKUP($L19,invullijst!$A$11:$M$196,8,FALSE))","v":""}]
[3,{"$f":"IF($G$3=\"k\",IF(VLOOKUP($D20,invullijst!$A$11:$M$196,11,FALSE)=0,\" \",VLOOKUP($D20,invullijst!$A$11:$M$196,11,FALSE)),\"\")","v":" "},{"$f":"IF(VLOOKUP(D20,invullijst!A$11:F$237,4,FALSE)=\"\",\"\",VLOOKUP(D20,invullijst!A$11:D$237,4,FALSE))","v":0},null,{"$f":"IF(VLOOKUP($D20,invullijst!$A$11:$M$196,2,FALSE)=\"\",\"\",VLOOKUP($D20,invullijst!$A$11:$M$196,2,FALSE))","v":0},null,{"$f":"IF(VLOOKUP($D20,invullijst!$A$11:$M$196,8,FALSE)=0,\"\",VLOOKUP($D20,invullijst!$A$11:$M$196,8,FALSE))","v":""},null,3,{"$f":"IF($O$3=\"k\",IF(VLOOKUP($L20,invullijst!$A$11:$M$196,11,FALSE)=0,\" \",VLOOKUP($L20,invullijst!$A$11:$M$196,11,FALSE)),\"\")","v":""},{"$f":"IF(VLOOKUP($L20,invullijst!$A$11:$M$237,4,FALSE)=\"\",\"\",VLOOKUP($L20,invullijst!$A$11:$M$237,4,FALSE))","v":0},null,{"$f":"IF(VLOOKUP($L20,invullijst!$A$11:$M$196,2,FALSE)=\"\",\"\",VLOOKUP($L20,invullijst!$A$11:$M$196,2,FALSE))","v":0},null,{"$f":"IF(VLOOKUP($L20,invullijst!$A$11:$M$196,8,FALSE)=0,\"\",VLOOKUP($L20,invullijst!$A$11:$M$196,8,FALSE))","v":""}]
[4,{"$f":"IF($G$3=\"k\",IF(VLOOKUP($D21,invullijst!$A$11:$M$196,11,FALSE)=0,\" \",VLOOKUP($D21,invullijst!$A$11:$M$196,11,FALSE)),\"\")","v":" "},{"$f":"IF(VLOOKUP(D21,invullijst!A$11:F$237,4,FALSE)=\"\",\"\",VLOOKUP(D21,invullijst!A$11:D$237,4,FALSE))","v":0},null,{"$f":"IF(VLOOKUP($D21,invullijst!$A$11:$M$196,2,FALSE)=\"\",\"\",VLOOKUP($D21,invullijst!$A$11:$M$196,2,FALSE))","v":0},null,{"$f":"IF(VLOOKUP($D21,invullijst!$A$11:$M$196,8,FALSE)=0,\"\",VLOOKUP($D21,invullijst!$A$11:$M$196,8,FALSE))","v":""},null,4,{"$f":"IF($O$3=\"k\",IF(VLOOKUP($L21,invullijst!$A$11:$M$196,11,FALSE)=0,\" \",VLOOKUP($L21,invullijst!$A$11:$M$196,11,FALSE)),\"\")","v":""},{"$f":"IF(VLOOKUP($L21,invullijst!$A$11:$M$237,4,FALSE)=\"\",\"\",VLOOKUP($L21,invullijst!$A$11:$M$237,4,FALSE))","v":0},null,{"$f":"IF(VLOOKUP($L21,invullijst!$A$11:$M$196,2,FALSE)=\"\",\"\",VLOOKUP($L21,invullijst!$A$11:$M$196,2,FALSE))","v":0},null,{"$f":"IF(VLOOKUP($L21,invullijst!$A$11:$M$196,8,FALSE)=0,\"\",VLOOKUP($L21,invullijst!$A$11:$M$196,8,FALSE))","v":""}]
["DIVERSEN / INHAAL",{"$nulls":5},{"$f":"SUM(G18:G21)","v":144},null,"DIVERSEN / INHAAL",{"$nulls":5},{"$f":"SUM(O18:O21)","v":0}]
[]
["OPGELEGD (Jeugd <16 en 65+)"]
[1,{"$f":"IF($G$3=\"k\",IF(VLOOKUP($D25,invullijst!$A$11:$M$196,11,FALSE)=0,\" \",VLOOKUP($D25,invullijst!$A$11:$M$196,11,FALSE)),\"\")","v":48},{"$f":"IF(VLOOKUP(D25,invullijst!A$11:F$237,4,FALSE)=\"\",\"\",VLOOKUP(D25,invullijst!A$11:D$237,4,FALSE))","v":"65+"},220,{"$f":"IF(VLOOKUP($D25,invullijst!$A$11:$M$196,2,FALSE)=\"\",\"\",VLOOKUP($D25,invullijst!$A$11:$M$196,2,FALSE))","v":"Kees Vos"},null,{"$f":"IF(VLOOKUP($D25,invullijst!$A$11:$M$196,8,FALSE)=0,\"\",VLOOKUP($D25,invullijst!$A$11:$M$196,8,FALSE))","v":93},null,1,{"$f":"IF($O$3=\"k\",IF(VLOOKUP($L25,invullijst!$A$11:$M$196,11,FALSE)=0,\" \",VLOOKUP($L25,invullijst!$A$11:$M$196,11,FALSE)),\"\")","v":""},{"$f":"IF(VLOOKUP($L25,invullijst!$A$11:$M$237,4,FALSE)=\"\",\"\",VLOOKUP($L25,invullijst!$A$11:$M$237,4,FALSE))","v":"65+"},102,{"$f":"IF(VLOOKUP($L25,invullijst!$A$11:$M$196,2,FALSE)=\"\",\"\",VLOOKUP($L25,invullijst!$A$11:$M$196,2,FALSE))","v":"John de Jong (disp)"},null,{"$f":"IF(VLOOKUP($L25,invullijst!$A$11:$M$196,8,FALSE)=0,\"\",VLOOKUP($L25,invullijst!$A$11:$M$196,8,FALSE))","v":82}]
[2,{"$f":"IF($G$3=\"k\",IF(VLOOKUP($D26,invullijst!$A$11:$M$196,11,FALSE)=0,\" \",VLOOKUP($D26,invullijst!$A$11:$M$196,11,FALSE)),\"\")","v":48},{"$f":"IF(VLOOKUP(D26,invullijst!A$11:F$237,4,FALSE)=\"\",\"\",VLOOKUP(D26,invullijst!A$11:D$237,4,FALSE))","v":"65+"},218,{"$f":"IF(VLOOKUP($D26,invullijst!$A$11:$M$196,2,FALSE)=\"\",\"\",VLOOKUP($D26,invullijst!$A$11:$M$196,2,FALSE))","v":"Jacob van de Werken"},null,{"$f":"IF(VLOOKUP($D26,invullijst!$A$11:$M$196,8,FALSE)=0,\"\",VLOOKUP($D26,invullijst!$A$11:$M$196,8,FALSE))","v":96},null,2,{"$f":"IF($O$3=\"k\",IF(VLOOKUP($L26,invullijst!$A$11:$M$196,11,FALSE)=0,\" \",VLOOKUP($L26,invullijst!$A$11:$M$196,11,FALSE)),\"\")","v":""},{"$f":"IF(VLOOKUP($L26,invullijst!$A$11:$M$237,4,FALSE)=\"\",\"\",VLOOKUP($L26,invullijst!$A$11:$M$237,4,FALSE))","v":"65+"},107,{"$f":"IF(VLOOKUP($L26,invullijst!$A$11:$M$196,2,FALSE)=\"\",\"\",VLOOKUP($L26,invullijst!$A$11:$M$196,2,FALSE))","v":"Cees Coppens"},null,{"$f":"IF(VLOOKUP($L26,invullijst!$A$11:$M$196,8,FALSE)=0,\"\",VLOOKUP($L26,invullijst!$A$11:$M$196,8,FALSE))","v":83}]
[3,{"$f":"IF($G$3=\"k\",IF(VLOOKUP($D27,invullijst!$A$11:$M$196,11,FALSE)=0,\" \",VLOOKUP($D27,invullijst!$A$11:$M$196,11,FALSE)),\"\")","v":48},{"$f":"IF(VLOOKUP(D27,invullijst!A$11:F$237,4,FALSE)=\"\",\"\",VLOOKUP(D27,invullijst!A$11:D$237,4,FALSE))","v":"65+"},219,{"$f":"IF(VLOOKUP($D27,invullijst!$A$11:$M$196,2,FALSE)=\"\",\"\",VLOOKUP($D27,invullijst!$A$11:$M$196,2,FALSE))","v":"Frans de Bont"},null,{"$f":"IF(VLOOKUP($D27,invullijst!$A$11:$M$196,8,FALSE)=0,\"\",VLOOKUP($D27,invullijst!$A$11:$M$196,8,FALSE))","v":97},null,3,{"$f":"IF($O$3=\"k\",IF(VLOOKUP($L27,invullijst!$A$11:$M$196,11,FALSE)=0,\" \",VLOOKUP($L27,invullijst!$A$11:$M$196,11,FALSE)),\"\")","v":""},{"$f":"IF(VLOOKUP($L27,invullijst!$A$11:$M$237,4,FALSE)=\"\",\"\",VLOOKUP($L27,invullijst!$A$11:$M$237,4,FALSE))","v":0},null,{"$f":"IF(VLOOKUP($L27,invullijst!$A$11:$M$196,2,FALSE)=\"\",\"\",VLOOKUP($L27,invullijst!$A$11:$M$196,2,FALSE))","v":0},null,{"$f":"IF(VLOOKUP($L27,invullijst!$A$11:$M$196,8,FALSE)=0,\"\",VLOOKUP($L27,invullijst!$A$11:$M$196,8,FALSE))","v":""}]
["Totaal korps opgelegd A1",{"$nulls":5},{"$f":"SUM(G25:G27)","v":286},null,"Totaal korps opgelegd A1",{"$nulls":5},{"$f":"SUM(O25:O27)","v":165}]
[]
[1,{"$f":"IF($G$3=\"k\",IF(VLOOKUP($D30,invullijst!$A$11:$M$196,11,FALSE)=0,\" \",VLOOKUP($D30,invullijst!$A$11:$M$196,11,FALSE)),\"\")","v":37},{"$f":"IF(VLOOKUP(D30,invullijst!A$11:F$237,4,FALSE)=\"\",\"\",VLOOKUP(D30,invullijst!A$11:D$237,4,FALSE))","v":"65+"},212,{"$f":"IF(VLOOKUP($D30,invullijst!$A$11:$M$196,2,FALSE)=\"\",\"\",VLOOKUP($D30,invullijst!$A$11:$M$196,2,FALSE))","v":"René Duquesnoy"},null,{"$f":"IF(VLOOKUP($D30,invullijst!$A$11:$M$196,8,FALSE)=0,\"\",VLOOKUP($D30,invullijst!$A$11:$M$196,8,FALSE))","v":90},null,1,{"$f":"IF($O$3=\"k\",IF(VLOOKUP($L30,invullijst!$A$11:$M$196,11,FALSE)=0,\" \",VLOOKUP($L30,invullijst!$A$11:$M$196,11,FALSE)),\"\")","v":""},{"$f":"IF(VLOOKUP($L30,invullijst!$A$11:$M$237,4,FALSE)=\"\",\"\",VLOOKUP($L30,invullijst!$A$11:$M$237,4,FALSE))","v":0},null,{"$f":"IF(VLOOKUP($L30,invullijst!$A$11:$M$196,2,FALSE)=\"\",\"\",VLOOKUP($L30,invullijst!$A$11:$M$196,2,FALSE))","v":0},null,{"$f":"IF(VLOOKUP($L30,invullijst!$A$11:$M$196,8,FALSE)=0,\"\",VLOOKUP($L30,invullijst!$A$11:$M$196,8,FALSE))","v":""}]
[2,{"$f":"IF($G$3=\"k\",IF(VLOOKUP($D31,invullijst!$A$11:$M$196,11,FALSE)=0,\" \",VLOOKUP($D31,invullijst!$A$11:$M$196,11,FALSE)),\"\")","v":43},{"$f":"IF(VLOOKUP(D31,invullijst!A$11:F$237,4,FALSE)=\"\",\"\",VLOOKUP(D31,invullijst!A$11:D$237,4,FALSE))","v":"J"},221,{"$f":"IF(VLOOKUP($D31,invullijst!$A$11:$M$196,2,FALSE)=\"\",\"\",VLOOKUP($D31,invullijst!$A$11:$M$196,2,FALSE))","v":"Mees Huijben"},null,{"$f":"IF(VLOOKUP($D31,invullijst!$A$11:$M$196,8,FALSE)=0,\"\",VLOOKUP($D31,invullijst!$A$11:$M$196,8,FALSE))","v":89},null,2,{"$f":"IF($O$3=\"k\",IF(VLOOKUP($L31,invullijst!$A$11:$M$196,11,FALSE)=0,\" \",VLOOKUP($L31,invullijst!$A$11:$M$196,11,FALSE)),\"\")","v":""},{"$f":"IF(VLOOKUP($L31,invullijst!$A$11:$M$237,4,FALSE)=\"\",\"\",VLOOKUP($L31,invullijst!$A$11:$M$237,4,FALSE))","v":0},null,{"$f":"IF(VLOOKUP($L31,invullijst!$A$11:$M$196,2,FALSE)=\"\",\"\",VLOOKUP($L31,invullijst!$A$11:$M$196,2,FALSE))","v":0},null,{"$f":"IF(VLOOKUP($L31,invullijst!$A$11:$M$196,8,FALSE)=0,\"\",VLOOKUP($L31,invullijst!$A$11:$M$196,8,FALSE))","v":""}]
[3,{"$f":"IF($G$3=\"k\",IF(VLOOKUP($D32,invullijst!$A$11:$M$196,11,FALSE)=0,\" \",VLOOKUP($D32,invullijst!$A$11:$M$196,11,FALSE)),\"\")","v":44},{"$f":"IF(VLOOKUP(D32,invullijst!A$11:F$237,4,FALSE)=\"\",\"\",VLOOKUP(D32,invullijst!A$11:D$237,4,FALSE))","v":"65+"},214,{"$f":"IF(VLOOKUP($D32,invullijst!$A$11:$M$196,2,FALSE)=\"\",\"\",VLOOKUP($D32,invullijst!$A$11:$M$196,2,FALSE))","v":"Andre de Vaan"},null,{"$f":"IF(VLOOKUP($D32,invullijst!$A$11:$M$196,8,FALSE)=0,\"\",VLOOKUP($D32,invullijst!$A$11:$M$196,8,FALSE))","v":90},null,3,{"$f":"IF($O$3=\"k\",IF(VLOOKUP($L32,invullijst!$A$11:$M$196,11,FALSE)=0,\" \",VLOOKUP($L32,invullijst!$A$11:$M$196,11,FALSE)),\"\")","v":""},{"$f":"IF(VLOOKUP($L32,invullijst!$A$11:$M$237,4,FALSE)=\"\",\"\",VLOOKUP($L32,invullijst!$A$11:$M$237,4,FALSE))","v":0},null,{"$f":"IF(VLOOKUP($L32,invullijst!$A$11:$M$196,2,FALSE)=\"\",\"\",VLOOKUP($L32,invullijst!$A$11:$M$196,2,FALSE))","v":0},null,{"$f":"IF(VLOOKUP($L32,invullijst!$A$11:$M$196,8,FALSE)=0,\"\",VLOOKUP($L32,invullijst!$A$11:$M$196,8,FALSE))","v":""}]
["Totaal korps opgelegd A2",{"$nulls":5},{"$f":"SUM(G30:G32)","v":269},null,"Totaal korps opgelegd A2",{"$nulls":5},{"$f":"SUM(O30:O32)","v":0}]
[]
[1,{"$f":"IF($G$3=\"k\",IF(VLOOKUP($D35,invullijst!$A$11:$M$196,11,FALSE)=0,\" \",VLOOKUP($D35,invullijst!$A$11:$M$196,11,FALSE)),\"\")","v":41},{"$f":"IF(VLOOKUP(D35,invullijst!A$11:F$237,4,FALSE)=\"\",\"\",VLOOKUP(D35,invullijst!A$11:D$237,4,FALSE))","v":"65+"},211,{"$f":"IF(VLOOKUP($D35,invullijst!$A$11:$M$196,2,FALSE)=\"\",\"\",VLOOKUP($D35,invullijst!$A$11:$M$196,2,FALSE))","v":"Ad van den houdt"},null,{"$f":"IF(VLOOKUP($D35,invullijst!$A$11:$M$196,8,FALSE)=0,\"\",VLOOKUP($D35,invullijst!$A$11:$M$196,8,FALSE))","v":89},null,1,{"$f":"IF($O$3=\"k\",IF(VLOOKUP($L35,invullijst!$A$11:$M$196,11,FALSE)=0,\" \",VLOOKUP($L35,invullijst!$A$11:$M$196,11,FALSE)),\"\")","v":""},{"$f":"IF(VLOOKUP($L35,invullijst!$A$11:$M$237,4,FALSE)=\"\",\"\",VLOOKUP($L35,invullijst!$A$11:$M$237,4,FALSE))","v":0},null,{"$f":"IF(VLOOKUP($L35,invullijst!$A$11:$M$196,2,FALSE)=\"\",\"\",VLOOKUP($L35,invullijst!$A$11:$M$196,2,FALSE))","v":0},null,{"$f":"IF(VLOOKUP($L35,invullijst!$A$11:$M$196,8,FALSE)=0,\"\",VLOOKUP($L35,invullijst!$A$11:$M$196,8,FALSE))","v":""}]
[2,{"$f":"IF($G$3=\"k\",IF(VLOOKUP($D36,invullijst!$A$11:$M$196,11,FALSE)=0,\" \",VLOOKUP($D36,invullijst!$A$11:$M$196,11,FALSE)),\"\")","v":" "},{"$f":"IF(VLOOKUP(D36,invullijst!A$11:F$237,4,FALSE)=\"\",\"\",VLOOKUP(D36,invullijst!A$11:D$237,4,FALSE))","v":0},null,{"$f":"IF(VLOOKUP($D36,invullijst!$A$11:$M$196,2,FALSE)=\"\",\"\",VLOOKUP($D36,invullijst!$A$11:$M$196,2,FALSE))","v":0},null,{"$f":"IF(VLOOKUP($D36,invullijst!$A$11:$M$196,8,FALSE)=0,\"\",VLOOKUP($D36,invullijst!$A$11:$M$196,8,FALSE))","v":""},null,2,{"$f":"IF($O$3=\"k\",IF(VLOOKUP($L36,invullijst!$A$11:$M$196,11,FALSE)=0,\" \",VLOOKUP($L36,invullijst!$A$11:$M$196,11,FALSE)),\"\")","v":""},{"$f":"IF(VLOOKUP($L36,invullijst!$A$11:$M$237,4,FALSE)=\"\",\"\",VLOOKUP($L36,invullijst!$A$11:$M$237,4,FALSE))","v":0},null,{"$f":"IF(VLOOKUP($L36,invullijst!$A$11:$M$196,2,FALSE)=\"\",\"\",VLOOKUP($L36,invullijst!$A$11:$M$196,2,FALSE))","v":0},null,{"$f":"IF(VLOOKUP($L36,invullijst!$A$11:$M$196,8,FALSE)=0,\"\",VLOOKUP($L36,invullijst!$A$11:$M$196,8,FALSE))","v":""}]
[3,{"$f":"IF($G$3=\"k\",IF(VLOOKUP($D37,invullijst!$A$11:$M$196,11,FALSE)=0,\" \",VLOOKUP($D37,invullijst!$A$11:$M$196,11,FALSE)),\"\")","v":" "},{"$f":"IF(VLOOKUP(D37,invullijst!A$11:F$237,4,FALSE)=\"\",\"\",VLOOKUP(D37,invullijst!A$11:D$237,4,FALSE))","v":0},null,{"$f":"IF(VLOOKUP($D37,invullijst!$A$11:$M$196,2,FALSE)=\"\",\"\",VLOOKUP($D37,invullijst!$A$11:$M$196,2,FALSE))","v":0},null,{"$f":"IF(VLOOKUP($D37,invullijst!$A$11:$M$196,8,FALSE)=0,\"\",VLOOKUP($D37,invullijst!$A$11:$M$196,8,FALSE))","v":""},null,3,{"$f":"IF($O$3=\"k\",IF(VLOOKUP($L37,invullijst!$A$11:$M$196,11,FALSE)=0,\" \",VLOOKUP($L37,invullijst!$A$11:$M$196,11,FALSE)),\"\")","v":""},{"$f":"IF(VLOOKUP($L37,invullijst!$A$11:$M$237,4,FALSE)=\"\",\"\",VLOOKUP($L37,invullijst!$A$11:$M$237,4,FALSE))","v":0},null,{"$f":"IF(VLOOKUP($L37,invullijst!$A$11:$M$196,2,FALSE)=\"\",\"\",VLOOKUP($L37,invullijst!$A$11:$M$196,2,FALSE))","v":0},null,{"$f":"IF(VLOOKUP($L37,invullijst!$A$11:$M$196,8,FALSE)=0,\"\",VLOOKUP($L37,invullijst!$A$11:$M$196,8,FALSE))","v":""}]
["Totaal korps opgelegd A3",{"$nulls":5},{"$f":"SUM(G35:G37)","v":89},null,"Totaal korps opgelegd A3",{"$nulls":5},{"$f":"SUM(O35:O37)","v":0}]

{"sheet":"wedstrijd 3B","index":10,"n_rows":38,"n_cols":15,"rows_kept":38,"merged":[[0,0,0,4],[0,5,0,7],[0,8,0,14],[1,0,1,11],[1,12,1,14],[2,1,2,5],[2,9,2,13],[4,0,4,14],[5,4,5,5],[5,12,5,13],[6,4,6,5],[6,12,6,13],[7,4,7,5],[7,12,7,13],[8,4,8,5],[8,12,8,13],[9,0,9,5],[9,8,9,13],[11,4,11,5],[11,12,11,13],[12,4,12,5],[12,12,12,13],[13,4,13,5],[13,12,13,13],[14,4,14,5],[14,12,14,13],[15,0,15,5],[15,8,15,13],[17,4,17,5],[17,12,17,13],[18,4,18,5],[18,12,18,13],[19,4,19,5],[19,12,19,13],[20,4,20,5],[20,12,20,13],[21,0,21,5],[21,8,21,13],[23,0,23,14],[24,4,24,5],[24,12,24,13],[25,4,25,5],[25,12,25,13],[26,4,26,5],[26,12,26,13],[27,0,27,5],[27,8,27,13],[29,4,29,5],[29,12,29,13],[30,4,30,5],[30,12,30,13],[31,4,31,5],[31,12,31,13],[32,0,32,5],[32,8,32,13],[34,4,34,5],[34,12,34,13],[35,4,35,5],[35,12,35,13],[36,4,36,5],[36,12,36,13],[37,0,37,5],[37,8,37,13]]}
[{"$f":"invullijst!F1","v":"Organistatie"},{"$nulls":4},{"$f":"invullijst!H2","v":"2025 - 2026"},null,null,{"$f":"invullijst!F3","v":"Sint Ambrosius Baardwijk"}]
["Datum: ",{"$nulls":11},"2026-02-01"]
[4,{"$f":"IF(VLOOKUP(A3,invullijst!A1:F5,2,FALSE)=\"\",\"\",VLOOKUP(A3,invullijst!A1:F5,2,FALSE))","v":"Sint Ambrosius Haarsteeg"},{"$nulls":6},3,{"$f":"IF(VLOOKUP(I3,invullijst!A1:C5,2,FALSE)=\"\",\"\",VLOOKUP(I3,invullijst!A1:C5,2,FALSE))","v":"O.L.V. Schuts Elshout"}]
[]
["vrijehand"]
[1,{"$f":"IF($G$3=\"k\",IF(VLOOKUP($D6,invullijst!$A$11:$M$196,11,FALSE)=0,\" \",VLOOKUP($D6,invullijst!$A$11:$M$196,11,FALSE)),\"\")","v":""},{"$f":"IF(VLOOKUP(D6,invullijst!A$11:F$237,4,FALSE)=\"\",\"\",VLOOKUP(D6,invullijst!A$11:D$237,4,FALSE))","v":"vr"},406,{"$f":"IF(VLOOKUP($D6,invullijst!$A$11:$M$196,2,FALSE)=\"\",\"\",VLOOKUP($D6,invullijst!$A$11:$M$196,2,FALSE))","v":"Jeroen van Oss"},null,{"$f":"IF(VLOOKUP($D6,invullijst!$A$11:$M$196,8,FALSE)=0,\"\",VLOOKUP($D6,invullijst!$A$11:$M$196,8,FALSE))","v":84},null,1,{"$f":"IF($O$3=\"k\",IF(VLOOKUP($L6,invullijst!$A$11:$M$196,11,FALSE)=0,\" \",VLOOKUP($L6,invullijst!$A$11:$M$196,11,FALSE)),\"\")","v":""},{"$f":"IF(VLOOKUP($L6,invullijst!$A$11:$M$237,4,FALSE)=\"\",\"\",VLOOKUP($L6,invullijst!$A$11:$M$237,4,FALSE))","v":"vr"},306,{"$f":"IF(VLOOKUP($L6,invullijst!$A$11:$M$196,2,FALSE)=\"\",\"\",VLOOKUP($L6,invullijst!$A$11:$M$196,2,FALSE))","v":"Ron Groot"},null,{"$f":"IF(VLOOKUP($L6,invullijst!$A$11:$M$196,8,FALSE)=0,\"\",VLOOKUP($L6,invullijst!$A$11:$M$196,8,FALSE))","v":87}]
[2,{"$f":"IF($G$3=\"k\",IF(VLOOKUP($D7,invullijst!$A$11:$M$196,11,FALSE)=0,\" \",VLOOKUP($D7,invullijst!$A$11:$M$196,11,FALSE)),\"\")","v":""},{"$f":"IF(VLOOKUP(D7,invullijst!A$11:F$237,4,FALSE)=\"\",\"\",VLOOKUP(D7,invullijst!A$11:D$237,4,FALSE))","v":"vr"},410,{"$f":"IF(VLOOKUP($D7,invullijst!$A$11:$M$196,2,FALSE)=\"\",\"\",VLOOKUP($D7,invullijst!$A$11:$M$196,2,FALSE))","v":"Tonnie Koks"},null,{"$f":"IF(VLOOKUP($D7,invullijst!$A$11:$M$196,8,FALSE)=0,\"\",VLOOKUP($D7,invullijst!$A$11:$M$196,8,FALSE))","v":78},null,2,{"$f":"IF($O$3=\"k\",IF(VLOOKUP($L7,invullijst!$A$11:$M$196,11,FALSE)=0,\" \",VLOOKUP($L7,invullijst!$A$11:$M$196,11,FALSE)),\"\")","v":""},{"$f":"IF(VLOOKUP($L7,invullijst!$A$11:$M$237,4,FALSE)=\"\",\"\",VLOOKUP($L7,invullijst!$A$11:$M$237,4,FALSE))","v":"vr"},305,{"$f":"IF(VLOOKUP($L7,invullijst!$A$11:$M$196,2,FALSE)=\"\",\"\",VLOOKUP($L7,invullijst!$A$11:$M$196,2,FALSE))","v":"Johan Klerx"},null,{"$f":"IF(VLOOKUP($L7,invullijst!$A$11:$M$196,8,FALSE)=0,\"\",VLOOKUP($L7,invullijst!$A$11:$M$196,8,FALSE))","v":82}]
[3,{"$f":"IF($G$3=\"k\",IF(VLOOKUP($D8,invullijst!$A$11:$M$196,11,FALSE)=0,\" \",VLOOKUP($D8,invullijst!$A$11:$M$196,11,FALSE)),\"\")","v":""},{"$f":"IF(VLOOKUP(D8,invullijst!A$11:F$237,4,FALSE)=\"\",\"\",VLOOKUP(D8,invullijst!A$11:D$237,4,FALSE))","v":"vr"},409,{"$f":"IF(VLOOKUP($D8,invullijst!$A$11:$M$196,2,FALSE)=\"\",\"\",VLOOKUP($D8,invullijst!$A$11:$M$196,2,FALSE))","v":"Thijs Koks"},null,{"$f":"IF(VLOOKUP($D8,invullijst!$A$11:$M$196,8,FALSE)=0,\"\",VLOOKUP($D8,invullijst!$A$11:$M$196,8,FALSE))","v":86},null,3,{"$f":"IF($O$3=\"k\",IF(VLOOKUP($L8,invullijst!$A$11:$M$196,11,FALSE)=0,\" \",VLOOKUP($L8,invullijst!$A$11:$M$196,11,FALSE)),\"\")","v":""},{"$f":"IF(VLOOKUP($L8,invullijst!$A$11:$M$237,4,FALSE)=\"\",\"\",VLOOKUP($L8,invullijst!$A$11:$M$237,4,FALSE))","v":"vr"},304,{"$f":"IF(VLOOKUP($L8,invullijst!$A$11:$M$196,2,FALSE)=\"\",\"\",VLOOKUP($L8,invullijst!$A$11:$M$196,2,FALSE))","v":"Henk Bruurmijn "},null,{"$f":"IF(VLOOKUP($L8,invullijst!$A$11:$M$196,8,FALSE)=0,\"\",VLOOKUP($L8,invullijst!$A$11:$M$196,8,FALSE))","v":74}]
[4,{"$f":"IF($G$3=\"k\",IF(VLOOKUP($D9,invullijst!$A$11:$M$196,11,FALSE)=0,\" \",VLOOKUP($D9,invullijst!$A$11:$M$196,11,FALSE)),\"\")","v":""},{"$f":"IF(VLOOKUP(D9,invullijst!A$11:F$237,4,FALSE)=\"\",\"\",VLOOKUP(D9,invullijst!A$11:D$237,4,FALSE))","v":"vr"},408,{"$f":"IF(VLOOKUP($D9,invullijst!$A$11:$M$196,2,FALSE)=\"\",\"\",VLOOKUP($D9,invullijst!$A$11:$M$196,2,FALSE))","v":"Rudy van Falier"},null,{"$f":"IF(VLOOKUP($D9,invullijst!$A$11:$M$196,8,FALSE)=0,\"\",VLOOKUP($D9,invullijst!$A$11:$M$196,8,FALSE))","v":80},null,4,{"$f":"IF($O$3=\"k\",IF(VLOOKUP($L9,invullijst!$A$11:$M$196,11,FALSE)=0,\" \",VLOOKUP($L9,invullijst!$A$11:$M$196,11,FALSE)),\"\")","v":""},{"$f":"IF(VLOOKUP($L9,invullijst!$A$11:$M$237,4,FALSE)=\"\",\"\",VLOOKUP($L9,invullijst!$A$11:$M$237,4,FALSE))","v":"vr"},302,{"$f":"IF(VLOOKUP($L9,invullijst!$A$11:$M$196,2,FALSE)=\"\",\"\",VLOOKUP($L9,invullijst!$A$11:$M$196,2,FALSE))","v":"Freek de Jong"},null,{"$f":"IF(VLOOKUP($L9,invullijst!$A$11:$M$196,8,FALSE)=0,\"\",VLOOKUP($L9,invullijst!$A$11:$M$196,8,FALSE))","v":88}]
["Totaal A korps",{"$nulls":5},{"$f":"SUM(G6:G9)","v":328},null,"Totaal A korps",{"$nulls":5},{"$f":"SUM(O6:O9)","v":331}]
[]
[1,{"$f":"IF($G$3=\"k\",IF(VLOOKUP($D12,invullijst!$A$11:$M$196,11,FALSE)=0,\" \",VLOOKUP($D12,invullijst!$A$11:$M$196,11,FALSE)),\"\")","v":""},{"$f":"IF(VLOOKUP(D12,invullijst!A$11:F$237,4,FALSE)=\"\",\"\",VLOOKUP(D12,invullijst!A$11:D$237,4,FALSE))","v":"vr"},402,{"$f":"IF(VLOOKUP($D12,invullijst!$A$11:$M$196,2,FALSE)=\"\",\"\",VLOOKUP($D12,invullijst!$A$11:$M$196,2,FALSE))","v":"Daniëlle v/d Lee"},null,{"$f":"IF(VLOOKUP($D12,invullijst!$A$11:$M$196,8,FALSE)=0,\"\",VLOOKUP($D12,invullijst!$A$11:$M$196,8,FALSE))","v":80},null,1,{"$f":"IF($O$3=\"k\",IF(VLOOKUP($L12,invullijst!$A$11:$M$196,11,FALSE)=0,\" \",VLOOKUP($L12,invullijst!$A$11:$M$196,11,FALSE)),\"\")","v":""},{"$f":"IF(VLOOKUP($L12,invullijst!$A$11:$M$237,4,FALSE)=\"\",\"\",VLOOKUP($L12,invullijst!$A$11:$M$237,4,FALSE))","v":0},null,{"$f":"IF(VLOOKUP($L12,invullijst!$A$11:$M$196,2,FALSE)=\"\",\"\",VLOOKUP($L12,invullijst!$A$11:$M$196,2,FALSE))","v":0},null,{"$f":"IF(VLOOKUP($L12,invullijst!$A$11:$M$196,8,FALSE)=0,\"\",VLOOKUP($L12,invullijst!$A$11:$M$196,8,FALSE))","v":""}]
[2,{"$f":"IF($G$3=\"k\",IF(VLOOKUP($D13,invullijst!$A$11:$M$196,11,FALSE)=0,\" \",VLOOKUP($D13,invullijst!$A$11:$M$196,11,FALSE)),\"\")","v":""},{"$f":"IF(VLOOKUP(D13,invullijst!A$11:F$237,4,FALSE)=\"\",\"\",VLOOKUP(D13,invullijst!A$11:D$237,4,FALSE))","v":"vr"},411,{"$f":"IF(VLOOKUP($D13,invullijst!$A$11:$M$196,2,FALSE)=\"\",\"\",VLOOKUP($D13,invullijst!$A$11:$M$196,2,FALSE))","v":"Wilma v/d Lee"},null,{"$f":"IF(VLOOKUP($D13,invullijst!$A$11:$M$196,8,FALSE)=0,\"\",VLOOKUP($D13,invullijst!$A$11:$M$196,8,FALSE))","v":72},null,2,{"$f":"IF($O$3=\"k\",IF(VLOOKUP($L13,invullijst!$A$11:$M$196,11,FALSE)=0,\" \",VLOOKUP($L13,invullijst!$A$11:$M$196,11,FALSE)),\"\")","v":""},{"$f":"IF(VLOOKUP($L13,invullijst!$A$11:$M$237,4,FALSE)=\"\",\"\",VLOOKUP($L13,invullijst!$A$11:$M$237,4,FALSE))","v":0},null,{"$f":"IF(VLOOKUP($L13,invullijst!$A$11:$M$196,2,FALSE)=\"\",\"\",VLOOKUP($L13,invullijst!$A$11:$M$196,2,FALSE))","v":0},null,{"$f":"IF(VLOOKUP($L13,invullijst!$A$11:$M$196,8,FALSE)=0,\"\",VLOOKUP($L13,invullijst!$A$11:$M$196,8,FALSE))","v":""}]
[3,{"$f":"IF($G$3=\"k\",IF(VLOOKUP($D14,invullijst!$A$11:$M$196,11,FALSE)=0,\" \",VLOOKUP($D14,invullijst!$A$11:$M$196,11,FALSE)),\"\")","v":""},{"$f":"IF(VLOOKUP(D14,invullijst!A$11:F$237,4,FALSE)=\"\",\"\",VLOOKUP(D14,invullijst!A$11:D$237,4,FALSE))","v":0},null,{"$f":"IF(VLOOKUP($D14,invullijst!$A$11:$M$196,2,FALSE)=\"\",\"\",VLOOKUP($D14,invullijst!$A$11:$M$196,2,FALSE))","v":0},null,{"$f":"IF(VLOOKUP($D14,invullijst!$A$11:$M$196,8,FALSE)=0,\"\",VLOOKUP($D14,invullijst!$A$11:$M$196,8,FALSE))","v":""},null,3,{"$f":"IF($O$3=\"k\",IF(VLOOKUP($L14,invullijst!$A$11:$M$196,11,FALSE)=0,\" \",VLOOKUP($L14,invullijst!$A$11:$M$196,11,FALSE)),\"\")","v":""},{"$f":"IF(VLOOKUP($L14,invullijst!$A$11:$M$237,4,FALSE)=\"\",\"\",VLOOKUP($L14,invullijst!$A$11:$M$237,4,FALSE))","v":0},null,{"$f":"IF(VLOOKUP($L14,invullijst!$A$11:$M$196,2,FALSE)=\"\",\"\",VLOOKUP($L14,invullijst!$A$11:$M$196,2,FALSE))","v":0},null,{"$f":"IF(VLOOKUP($L14,invullijst!$A$11:$M$196,8,FALSE)=0,\"\",VLOOKUP($L14,invullijst!$A$11:$M$196,8,FALSE))","v":""}]
[4,{"$f":"IF($G$3=\"k\",IF(VLOOKUP($D15,invullijst!$A$11:$M$196,11,FALSE)=0,\" \",VLOOKUP($D15,invullijst!$A$11:$M$196,11,FALSE)),\"\")","v":""},{"$f":"IF(VLOOKUP(D15,invullijst!A$11:F$237,4,FALSE)=\"\",\"\",VLOOKUP(D15,invullijst!A$11:D$237,4,FALSE))","v":0},null,{"$f":"IF(VLOOKUP($D15,invullijst!$A$11:$M$196,2,FALSE)=\"\",\"\",VLOOKUP($D15,invullijst!$A$11:$M$196,2,FALSE))","v":0},null,{"$f":"IF(VLOOKUP($D15,invullijst!$A$11:$M$196,8,FALSE)=0,\"\",VLOOKUP($D15,invullijst!$A$11:$M$196,8,FALSE))","v":""},null,4,{"$f":"IF($O$3=\"k\",IF(VLOOKUP($L15,invullijst!$A$11:$M$196,11,FALSE)=0,\" \",VLOOKUP($L15,invullijst!$A$11:$M$196,11,FALSE)),\"\")","v":""},{"$f":"IF(VLOOKUP($L15,invullijst!$A$11:$M$237,4,FALSE)=\"\",\"\",VLOOKUP($L15,invullijst!$A$11:$M$237,4,FALSE))","v":0},null,{"$f":"IF(VLOOKUP($L15,invullijst!$A$11:$M$196,2,FALSE)=\"\",\"\",VLOOKUP($L15,invullijst!$A$11:$M$196,2,FALSE))","v":0},null,{"$f":"IF(VLOOKUP($L15,invullijst!$A$11:$M$196,8,FALSE)=0,\"\",VLOOKUP($L15,invullijst!$A$11:$M$196,8,FALSE))","v":""}]
["Totaal B1 korps",{"$nulls":5},{"$f":"SUM(G12:G15)","v":152},null,"Totaal B1 korps",{"$nulls":5},{"$f":"SUM(O12:O15)","v":0}]
[]
[1,{"$f":"IF($G$3=\"k\",IF(VLOOKUP($D18,invullijst!$A$11:$M$196,11,FALSE)=0,\" \",VLOOKUP($D18,invullijst!$A$11:$M$196,11,FALSE)),\"\")","v":""},{"$f":"IF(VLOOKUP(D18,invullijst!A$11:F$237,4,FALSE)=\"\",\"\",VLOOKUP(D18,invullijst!A$11:D$237,4,FALSE))","v":0},null,{"$f":"IF(VLOOKUP($D18,invullijst!$A$11:$M$196,2,FALSE)=\"\",\"\",VLOOKUP($D18,invullijst!$A$11:$M$196,2,FALSE))","v":0},null,{"$f":"IF(VLOOKUP($D18,invullijst!$A$11:$M$196,8,FALSE)=0,\"\",VLOOKUP($D18,invullijst!$A$11:$M$196,8,FALSE))","v":""},null,1,{"$f":"IF($O$3=\"k\",IF(VLOOKUP($L18,invullijst!$A$11:$M$196,11,FALSE)=0,\" \",VLOOKUP($L18,invullijst!$A$11:$M$196,11,FALSE)),\"\")","v":""},{"$f":"IF(VLOOKUP($L18,invullijst!$A$11:$M$237,4,FALSE)=\"\",\"\",VLOOKUP($L18,invullijst!$A$11:$M$237,4,FALSE))","v":0},null,{"$f":"IF(VLOOKUP($L18,invullijst!$A$11:$M$196,2,FALSE)=\"\",\"\",VLOOKUP($L18,invullijst!$A$11:$M$196,2,FALSE))","v":0},null,{"$f":"IF(VLOOKUP($L18,invullijst!$A$11:$M$196,8,FALSE)=0,\"\",VLOOKUP($L18,invullijst!$A$11:$M$196,8,FALSE))","v":""}]
[2,{"$f":"IF($G$3=\"k\",IF(VLOOKUP($D19,invullijst!$A$11:$M$196,11,FALSE)=0,\" \",VLOOKUP($D19,invullijst!$A$11:$M$196,11,FALSE)),\"\")","v":""},{"$f":"IF(VLOOKUP(D19,invullijst!A$11:F$237,4,FALSE)=\"\",\"\",VLOOKUP(D19,invullijst!A$11:D$237,4,FALSE))","v":0},null,{"$f":"IF(VLOOKUP($D19,invullijst!$A$11:$M$196,2,FALSE)=\"\",\"\",VLOOKUP($D19,invullijst!$A$11:$M$196,2,FALSE))","v":0},null,{"$f":"IF(VLOOKUP($D19,invullijst!$A$11:$M$196,8,FALSE)=0,\"\",VLOOKUP($D19,invullijst!$A$11:$M$196,8,FALSE))","v":""},null,2,{"$f":"IF($O$3=\"k\",IF(VLOOKUP($L19,invullijst!$A$11:$M$196,11,FALSE)=0,\" \",VLOOKUP($L19,invullijst!$A$11:$M$196,11,FALSE)),\"\")","v":""},{"$f":"IF(VLOOKUP($L19,invullijst!$A$11:$M$237,4,FALSE)=\"\",\"\",VLOOKUP($L19,invullijst!$A$11:$M$237,4,FALSE))","v":0},null,{"$f":"IF(VLOOKUP($L19,invullijst!$A$11:$M$196,2,FALSE)=\"\",\"\",VLOOKUP($L19,invullijst!$A$11:$M$196,2,FALSE))","v":0},null,{"$f":"IF(VLOOKUP($L19,invullijst!$A$11:$M$196,8,FALSE)=0,\"\",VLOOKUP($L19,invullijst!$A$11:$M$196,8,FALSE))","v":""}]
[3,{"$f":"IF($G$3=\"k\",IF(VLOOKUP($D20,invullijst!$A$11:$M$196,11,FALSE)=0,\" \",VLOOKUP($D20,invullijst!$A$11:$M$196,11,FALSE)),\"\")","v":""},{"$f":"IF(VLOOKUP(D20,invullijst!A$11:F$237,4,FALSE)=\"\",\"\",VLOOKUP(D20,invullijst!A$11:D$237,4,FALSE))","v":0},null,{"$f":"IF(VLOOKUP($D20,invullijst!$A$11:$M$196,2,FALSE)=\"\",\"\",VLOOKUP($D20,invullijst!$A$11:$M$196,2,FALSE))","v":0},null,{"$f":"IF(VLOOKUP($D20,invullijst!$A$11:$M$196,8,FALSE)=0,\"\",VLOOKUP($D20,invullijst!$A$11:$M$196,8,FALSE))","v":""},null,3,{"$f":"IF($O$3=\"k\",IF(VLOOKUP($L20,invullijst!$A$11:$M$196,11,FALSE)=0,\" \",VLOOKUP($L20,invullijst!$A$11:$M$196,11,FALSE)),\"\")","v":""},{"$f":"IF(VLOOKUP($L20,invullijst!$A$11:$M$237,4,FALSE)=\"\",\"\",VLOOKUP($L20,invullijst!$A$11:$M$237,4,FALSE))","v":0},null,{"$f":"IF(VLOOKUP($L20,invullijst!$A$11:$M$196,2,FALSE)=\"\",\"\",VLOOKUP($L20,invullijst!$A$11:$M$196,2,FALSE))","v":0},null,{"$f":"IF(VLOOKUP($L20,invullijst!$A$11:$M$196,8,FALSE)=0,\"\",VLOOKUP($L20,invullijst!$A$11:$M$196,8,FALSE))","v":""}]
[4,{"$f":"IF($G$3=\"k\",IF(VLOOKUP($D21,invullijst!$A$11:$M$196,11,FALSE)=0,\" \",VLOOKUP($D21,invullijst!$A$11:$M$196,11,FALSE)),\"\")","v":""},{"$f":"IF(VLOOKUP(D21,invullijst!A$11:F$237,4,FALSE)=\"\",\"\",VLOOKUP(D21,invullijst!A$11:D$237,4,FALSE))","v":0},null,{"$f":"IF(VLOOKUP($D21,invullijst!$A$11:$M$196,2,FALSE)=\"\",\"\",VLOOKUP($D21,invullijst!$A$11:$M$196,2,FALSE))","v":0},null,{"$f":"IF(VLOOKUP($D21,invullijst!$A$11:$M$196,8,FALSE)=0,\"\",VLOOKUP($D21,invullijst!$A$11:$M$196,8,FALSE))","v":""},null,4,{"$f":"IF($O$3=\"k\",IF(VLOOKUP($L21,invullijst!$A$11:$M$196,11,FALSE)=0,\" \",VLOOKUP($L21,invullijst!$A$11:$M$196,11,FALSE)),\"\")","v":""},{"$f":"IF(VLOOKUP($L21,invullijst!$A$11:$M$237,4,FALSE)=\"\",\"\",VLOOKUP($L21,invullijst!$A$11:$M$237,4,FALSE))","v":0},null,{"$f":"IF(VLOOKUP($L21,invullijst!$A$11:$M$196,2,FALSE)=\"\",\"\",VLOOKUP($L21,invullijst!$A$11:$M$196,2,FALSE))","v":0},null,{"$f":"IF(VLOOKUP($L21,invullijst!$A$11:$M$196,8,FALSE)=0,\"\",VLOOKUP($L21,invullijst!$A$11:$M$196,8,FALSE))","v":""}]
["DIVERSEN / INHAAL",{"$nulls":5},{"$f":"SUM(G18:G21)","v":0},null,"DIVERSEN / INHAAL",{"$nulls":5},{"$f":"SUM(O18:O21)","v":0}]
[]
["OPGELEGD (Jeugd <16 en 65+)"]
[1,{"$f":"IF($G$3=\"k\",IF(VLOOKUP($D25,invullijst!$A$11:$M$196,11,FALSE)=0,\" \",VLOOKUP($D25,invullijst!$A$11:$M$196,11,FALSE)),\"\")","v":""},{"$f":"IF(VLOOKUP(D25,invullijst!A$11:F$237,4,FALSE)=\"\",\"\",VLOOKUP(D25,invullijst!A$11:D$237,4,FALSE))","v":"65+"},405,{"$f":"IF(VLOOKUP($D25,invullijst!$A$11:$M$196,2,FALSE)=\"\",\"\",VLOOKUP($D25,invullijst!$A$11:$M$196,2,FALSE))","v":"Jan de Vaan"},null,{"$f":"IF(VLOOKUP($D25,invullijst!$A$11:$M$196,8,FALSE)=0,\"\",VLOOKUP($D25,invullijst!$A$11:$M$196,8,FALSE))","v":96},null,1,{"$f":"IF($O$3=\"k\",IF(VLOOKUP($L25,invullijst!$A$11:$M$196,11,FALSE)=0,\" \",VLOOKUP($L25,invullijst!$A$11:$M$196,11,FALSE)),\"\")","v":""},{"$f":"IF(VLOOKUP($L25,invullijst!$A$11:$M$237,4,FALSE)=\"\",\"\",VLOOKUP($L25,invullijst!$A$11:$M$237,4,FALSE))","v":"65+"},310,{"$f":"IF(VLOOKUP($L25,invullijst!$A$11:$M$196,2,FALSE)=\"\",\"\",VLOOKUP($L25,invullijst!$A$11:$M$196,2,FALSE))","v":"Tiny Boom"},null,{"$f":"IF(VLOOKUP($L25,invullijst!$A$11:$M$196,8,FALSE)=0,\"\",VLOOKUP($L25,invullijst!$A$11:$M$196,8,FALSE))","v":94}]
[2,{"$f":"IF($G$3=\"k\",IF(VLOOKUP($D26,invullijst!$A$11:$M$196,11,FALSE)=0,\" \",VLOOKUP($D26,invullijst!$A$11:$M$196,11,FALSE)),\"\")","v":""},{"$f":"IF(VLOOKUP(D26,invullijst!A$11:F$237,4,FALSE)=\"\",\"\",VLOOKUP(D26,invullijst!A$11:D$237,4,FALSE))","v":"65+"},404,{"$f":"IF(VLOOKUP($D26,invullijst!$A$11:$M$196,2,FALSE)=\"\",\"\",VLOOKUP($D26,invullijst!$A$11:$M$196,2,FALSE))","v":"Gerard van Beurden"},null,{"$f":"IF(VLOOKUP($D26,invullijst!$A$11:$M$196,8,FALSE)=0,\"\",VLOOKUP($D26,invullijst!$A$11:$M$196,8,FALSE))","v":98},null,2,{"$f":"IF($O$3=\"k\",IF(VLOOKUP($L26,invullijst!$A$11:$M$196,11,FALSE)=0,\" \",VLOOKUP($L26,invullijst!$A$11:$M$196,11,FALSE)),\"\")","v":""},{"$f":"IF(VLOOKUP($L26,invullijst!$A$11:$M$237,4,FALSE)=\"\",\"\",VLOOKUP($L26,invullijst!$A$11:$M$237,4,FALSE))","v":"65+"},307,{"$f":"IF(VLOOKUP($L26,invullijst!$A$11:$M$196,2,FALSE)=\"\",\"\",VLOOKUP($L26,invullijst!$A$11:$M$196,2,FALSE))","v":"Bert van Engelen"},null,{"$f":"IF(VLOOKUP($L26,invullijst!$A$11:$M$196,8,FALSE)=0,\"\",VLOOKUP($L26,invullijst!$A$11:$M$196,8,FALSE))","v":94}]
[3,{"$f":"IF($G$3=\"k\",IF(VLOOKUP($D27,invullijst!$A$11:$M$196,11,FALSE)=0,\" \",VLOOKUP($D27,invullijst!$A$11:$M$196,11,FALSE)),\"\")","v":""},{"$f":"IF(VLOOKUP(D27,invullijst!A$11:F$237,4,FALSE)=\"\",\"\",VLOOKUP(D27,invullijst!A$11:D$237,4,FALSE))","v":"65+"},415,{"$f":"IF(VLOOKUP($D27,invullijst!$A$11:$M$196,2,FALSE)=\"\",\"\",VLOOKUP($D27,invullijst!$A$11:$M$196,2,FALSE))","v":"Wim de Gouw"},null,{"$f":"IF(VLOOKUP($D27,invullijst!$A$11:$M$196,8,FALSE)=0,\"\",VLOOKUP($D27,invullijst!$A$11:$M$196,8,FALSE))","v":97},null,3,{"$f":"IF($O$3=\"k\",IF(VLOOKUP($L27,invullijst!$A$11:$M$196,11,FALSE)=0,\" \",VLOOKUP($L27,invullijst!$A$11:$M$196,11,FALSE)),\"\")","v":""},{"$f":"IF(VLOOKUP($L27,invullijst!$A$11:$M$237,4,FALSE)=\"\",\"\",VLOOKUP($L27,invullijst!$A$11:$M$237,4,FALSE))","v":"J"},312,{"$f":"IF(VLOOKUP($L27,invullijst!$A$11:$M$196,2,FALSE)=\"\",\"\",VLOOKUP($L27,invullijst!$A$11:$M$196,2,FALSE))","v":"Floor de Jong"},null,{"$f":"IF(VLOOKUP($L27,invullijst!$A$11:$M$196,8,FALSE)=0,\"\",VLOOKUP($L27,invullijst!$A$11:$M$196,8,FALSE))","v":97}]
["Totaal korps opgelegd A1",{"$nulls":5},{"$f":"SUM(G25:G27)","v":291},null,"Totaal korps opgelegd A1",{"$nulls":5},{"$f":"SUM(O25:O27)","v":285}]
[]
[1,{"$f":"IF($G$3=\"k\",IF(VLOOKUP($D30,invullijst!$A$11:$M$196,11,FALSE)=0,\" \",VLOOKUP($D30,invullijst!$A$11:$M$196,11,FALSE)),\"\")","v":""},{"$f":"IF(VLOOKUP(D30,invullijst!A$11:F$237,4,FALSE)=\"\",\"\",VLOOKUP(D30,invullijst!A$11:D$237,4,FALSE))","v":"65+"},401,{"$f":"IF(VLOOKUP($D30,invullijst!$A$11:$M$196,2,FALSE)=\"\",\"\",VLOOKUP($D30,invullijst!$A$11:$M$196,2,FALSE))","v":"Frans van Beurden"},null,{"$f":"IF(VLOOKUP($D30,invullijst!$A$11:$M$196,8,FALSE)=0,\"\",VLOOKUP($D30,invullijst!$A$11:$M$196,8,FALSE))","v":96},null,1,{"$f":"IF($O$3=\"k\",IF(VLOOKUP($L30,invullijst!$A$11:$M$196,11,FALSE)=0,\" \",VLOOKUP($L30,invullijst!$A$11:$M$196,11,FALSE)),\"\")","v":""},{"$f":"IF(VLOOKUP($L30,invullijst!$A$11:$M$237,4,FALSE)=\"\",\"\",VLOOKUP($L30,invullijst!$A$11:$M$237,4,FALSE))","v":"65+"},301,{"$f":"IF(VLOOKUP($L30,invullijst!$A$11:$M$196,2,FALSE)=\"\",\"\",VLOOKUP($L30,invullijst!$A$11:$M$196,2,FALSE))","v":"Arjen van Assem (disp)"},null,{"$f":"IF(VLOOKUP($L30,invullijst!$A$11:$M$196,8,FALSE)=0,\"\",VLOOKUP($L30,invullijst!$A$11:$M$196,8,FALSE))","v":88}]
[2,{"$f":"IF($G$3=\"k\",IF(VLOOKUP($D31,invullijst!$A$11:$M$196,11,FALSE)=0,\" \",VLOOKUP($D31,invullijst!$A$11:$M$196,11,FALSE)),\"\")","v":""},{"$f":"IF(VLOOKUP(D31,invullijst!A$11:F$237,4,FALSE)=\"\",\"\",VLOOKUP(D31,invullijst!A$11:D$237,4,FALSE))","v":"65+"},403,{"$f":"IF(VLOOKUP($D31,invullijst!$A$11:$M$196,2,FALSE)=\"\",\"\",VLOOKUP($D31,invullijst!$A$11:$M$196,2,FALSE))","v":"Dorien de Kort"},null,{"$f":"IF(VLOOKUP($D31,invullijst!$A$11:$M$196,8,FALSE)=0,\"\",VLOOKUP($D31,invullijst!$A$11:$M$196,8,FALSE))","v":96},null,2,{"$f":"IF($O$3=\"k\",IF(VLOOKUP($L31,invullijst!$A$11:$M$196,11,FALSE)=0,\" \",VLOOKUP($L31,invullijst!$A$11:$M$196,11,FALSE)),\"\")","v":""},{"$f":"IF(VLOOKUP($L31,invullijst!$A$11:$M$237,4,FALSE)=\"\",\"\",VLOOKUP($L31,invullijst!$A$11:$M$237,4,FALSE))","v":0},null,{"$f":"IF(VLOOKUP($L31,invullijst!$A$11:$M$196,2,FALSE)=\"\",\"\",VLOOKUP($L31,invullijst!$A$11:$M$196,2,FALSE))","v":0},null,{"$f":"IF(VLOOKUP($L31,invullijst!$A$11:$M$196,8,FALSE)=0,\"\",VLOOKUP($L31,invullijst!$A$11:$M$196,8,FALSE))","v":""}]
[3,{"$f":"IF($G$3=\"k\",IF(VLOOKUP($D32,invullijst!$A$11:$M$196,11,FALSE)=0,\" \",VLOOKUP($D32,invullijst!$A$11:$M$196,11,FALSE)),\"\")","v":""},{"$f":"IF(VLOOKUP(D32,invullijst!A$11:F$237,4,FALSE)=\"\",\"\",VLOOKUP(D32,invullijst!A$11:D$237,4,FALSE))","v":"65+"},413,{"$f":"IF(VLOOKUP($D32,invullijst!$A$11:$M$196,2,FALSE)=\"\",\"\",VLOOKUP($D32,invullijst!$A$11:$M$196,2,FALSE))","v":"Frans Mommersteeg"},null,{"$f":"IF(VLOOKUP($D32,invullijst!$A$11:$M$196,8,FALSE)=0,\"\",VLOOKUP($D32,invullijst!$A$11:$M$196,8,FALSE))","v":97},null,3,{"$f":"IF($O$3=\"k\",IF(VLOOKUP($L32,invullijst!$A$11:$M$196,11,FALSE)=0,\" \",VLOOKUP($L32,invullijst!$A$11:$M$196,11,FALSE)),\"\")","v":""},{"$f":"IF(VLOOKUP($L32,invullijst!$A$11:$M$237,4,FALSE)=\"\",\"\",VLOOKUP($L32,invullijst!$A$11:$M$237,4,FALSE))","v":0},null,{"$f":"IF(VLOOKUP($L32,invullijst!$A$11:$M$196,2,FALSE)=\"\",\"\",VLOOKUP($L32,invullijst!$A$11:$M$196,2,FALSE))","v":0},null,{"$f":"IF(VLOOKUP($L32,invullijst!$A$11:$M$196,8,FALSE)=0,\"\",VLOOKUP($L32,invullijst!$A$11:$M$196,8,FALSE))","v":""}]
["Totaal korps opgelegd A2",{"$nulls":5},{"$f":"SUM(G30:G32)","v":289},null,"Totaal korps opgelegd A2",{"$nulls":5},{"$f":"SUM(O30:O32)","v":88}]
[]
[1,{"$f":"IF($G$3=\"k\",IF(VLOOKUP($D35,invullijst!$A$11:$M$196,11,FALSE)=0,\" \",VLOOKUP($D35,invullijst!$A$11:$M$196,11,FALSE)),\"\")","v":""},{"$f":"IF(VLOOKUP(D35,invullijst!A$11:F$237,4,FALSE)=\"\",\"\",VLOOKUP(D35,invullijst!A$11:D$237,4,FALSE))","v":"65+"},412,{"$f":"IF(VLOOKUP($D35,invullijst!$A$11:$M$196,2,FALSE)=\"\",\"\",VLOOKUP($D35,invullijst!$A$11:$M$196,2,FALSE))","v":"Francien v/d Wiel"},null,{"$f":"IF(VLOOKUP($D35,invullijst!$A$11:$M$196,8,FALSE)=0,\"\",VLOOKUP($D35,invullijst!$A$11:$M$196,8,FALSE))","v":95},null,1,{"$f":"IF($O$3=\"k\",IF(VLOOKUP($L35,invullijst!$A$11:$M$196,11,FALSE)=0,\" \",VLOOKUP($L35,invullijst!$A$11:$M$196,11,FALSE)),\"\")","v":""},{"$f":"IF(VLOOKUP($L35,invullijst!$A$11:$M$237,4,FALSE)=\"\",\"\",VLOOKUP($L35,invullijst!$A$11:$M$237,4,FALSE))","v":0},null,{"$f":"IF(VLOOKUP($L35,invullijst!$A$11:$M$196,2,FALSE)=\"\",\"\",VLOOKUP($L35,invullijst!$A$11:$M$196,2,FALSE))","v":0},null,{"$f":"IF(VLOOKUP($L35,invullijst!$A$11:$M$196,8,FALSE)=0,\"\",VLOOKUP($L35,invullijst!$A$11:$M$196,8,FALSE))","v":""}]
[2,{"$f":"IF($G$3=\"k\",IF(VLOOKUP($D36,invullijst!$A$11:$M$196,11,FALSE)=0,\" \",VLOOKUP($D36,invullijst!$A$11:$M$196,11,FALSE)),\"\")","v":""},{"$f":"IF(VLOOKUP(D36,invullijst!A$11:F$237,4,FALSE)=\"\",\"\",VLOOKUP(D36,invullijst!A$11:D$237,4,FALSE))","v":"65+"},414,{"$f":"IF(VLOOKUP($D36,invullijst!$A$11:$M$196,2,FALSE)=\"\",\"\",VLOOKUP($D36,invullijst!$A$11:$M$196,2,FALSE))","v":"Alex Hus"},null,{"$f":"IF(VLOOKUP($D36,invullijst!$A$11:$M$196,8,FALSE)=0,\"\",VLOOKUP($D36,invullijst!$A$11:$M$196,8,FALSE))","v":90},null,2,{"$f":"IF($O$3=\"k\",IF(VLOOKUP($L36,invullijst!$A$11:$M$196,11,FALSE)=0,\" \",VLOOKUP($L36,invullijst!$A$11:$M$196,11,FALSE)),\"\")","v":""},{"$f":"IF(VLOOKUP($L36,invullijst!$A$11:$M$237,4,FALSE)=\"\",\"\",VLOOKUP($L36,invullijst!$A$11:$M$237,4,FALSE))","v":0},null,{"$f":"IF(VLOOKUP($L36,invullijst!$A$11:$M$196,2,FALSE)=\"\",\"\",VLOOKUP($L36,invullijst!$A$11:$M$196,2,FALSE))","v":0},null,{"$f":"IF(VLOOKUP($L36,invullijst!$A$11:$M$196,8,FALSE)=0,\"\",VLOOKUP($L36,invullijst!$A$11:$M$196,8,FALSE))","v":""}]
[3,{"$f":"IF($G$3=\"k\",IF(VLOOKUP($D37,invullijst!$A$11:$M$196,11,FALSE)=0,\" \",VLOOKUP($D37,invullijst!$A$11:$M$196,11,FALSE)),\"\")","v":""},{"$f":"IF(VLOOKUP(D37,invullijst!A$11:F$237,4,FALSE)=\"\",\"\",VLOOKUP(D37,invullijst!A$11:D$237,4,FALSE))","v":{"$error":"#N/A"}},"inh","jan de vaan",null,95,null,3,{"$f":"IF($O$3=\"k\",IF(VLOOKUP($L37,invullijst!$A$11:$M$196,11,FALSE)=0,\" \",VLOOKUP($L37,invullijst!$A$11:$M$196,11,FALSE)),\"\")","v":""},{"$f":"IF(VLOOKUP($L37,invullijst!$A$11:$M$237,4,FALSE)=\"\",\"\",VLOOKUP($L37,invullijst!$A$11:$M$237,4,FALSE))","v":0},null,{"$f":"IF(VLOOKUP($L37,invullijst!$A$11:$M$196,2,FALSE)=\"\",\"\",VLOOKUP($L37,invullijst!$A$11:$M$196,2,FALSE))","v":0},null,{"$f":"IF(VLOOKUP($L37,invullijst!$A$11:$M$196,8,FALSE)=0,\"\",VLOOKUP($L37,invullijst!$A$11:$M$196,8,FALSE))","v":""}]
["Totaal korps opgelegd A3",{"$nulls":7},"Totaal korps opgelegd A3",{"$nulls":5},{"$f":"SUM(O35:O37)","v":0}]

{"sheet":"wedstrijd 4A","index":11,"n_rows":38,"n_cols":15,"rows_kept":38,"merged":[[0,0,0,4],[0,5,0,7],[0,8,0,14],[1,0,1,11],[1,12,1,14],[2,1,2,5],[2,9,2,13],[4,0,4,14],[5,4,5,5],[5,12,5,13],[6,4,6,5],[6,12,6,13],[7,4,7,5],[7,12,7,13],[8,4,8,5],[8,12,8,13],[9,0,9,5],[9,8,9,13],[11,4,11,5],[11,12,11,13],[12,4,12,5],[12,12,12,13],[13,4,13,5],[13,12,13,13],[14,4,14,5],[14,12,14,13],[15,0,15,5],[15,8,15,13],[17,4,17,5],[17,12,17,13],[18,4,18,5],[18,12,18,13],[19,4,19,5],[19,12,19,13],[20,4,20,5],[20,12,20,13],[21,0,21,5],[21,8,21,13],[23,0,23,14],[24,4,24,5],[24,12,24,13],[25,4,25,5],[25,12,25,13],[26,4,26,5],[26,12,26,13],[27,0,27,5],[27,8,27,13],[29,4,29,5],[29,12,29,13],[30,4,30,5],[30,12,30,13],[31,4,31,5],[31,12,31,13],[32,0,32,5],[32,8,32,13],[34,4,34,5],[34,12,34,13],[35,4,35,5],[35,12,35,13],[36,4,36,5],[36,12,36,13],[37,0,37,5],[37,8,37,13]]}
[{"$f":"invullijst!F1","v":"Organistatie"},{"$nulls":4},{"$f":"invullijst!H2","v":"2025 - 2026"},null,null,{"$f":"invullijst!F3","v":"Sint Ambrosius Baardwijk"}]
["Datum: ",{"$nulls":11},"2026-02-22"]
[4,{"$f":"IF(VLOOKUP(A3,invullijst!A1:F5,2,FALSE)=\"\",\"\",VLOOKUP(A3,invullijst!A1:F5,2,FALSE))","v":"Sint Ambrosius Haarsteeg"},{"$nulls":4},"k",null,1,{"$f":"IF(VLOOKUP(I3,invullijst!A1:C5,2,FALSE)=\"\",\"\",VLOOKUP(I3,invullijst!A1:C5,2,FALSE))","v":"Sint Ambrosius Baardwijk"},{"$nulls":4},"k"]
[]
["vrijehand"]
[1,{"$f":"IF($G$3=\"k\",IF(VLOOKUP($D6,invullijst!$A$11:$M$196,11,FALSE)=0,\" \",VLOOKUP($D6,invullijst!$A$11:$M$196,11,FALSE)),\"\")","v":" "},{"$f":"IF(VLOOKUP(D6,invullijst!A$11:F$237,4,FALSE)=\"\",\"\",VLOOKUP(D6,invullijst!A$11:D$237,4,FALSE))","v":0},null,{"$f":"IF(VLOOKUP($D6,invullijst!$A$11:$M$196,2,FALSE)=\"\",\"\",VLOOKUP($D6,invullijst!$A$11:$M$196,2,FALSE))","v":0},null,{"$f":"IF(VLOOKUP($D6,invullijst!$A$11:$M$196,9,FALSE)=0,\"\",VLOOKUP($D6,invullijst!$A$11:$M$196,9,FALSE))","v":""},null,1,{"$f":"IF($O$3=\"k\",IF(VLOOKUP($L6,invullijst!$A$11:$M$196,11,FALSE)=0,\" \",VLOOKUP($L6,invullijst!$A$11:$M$196,11,FALSE)),\"\")","v":" "},{"$f":"IF(VLOOKUP($L6,invullijst!$A$11:$M$237,4,FALSE)=\"\",\"\",VLOOKUP($L6,invullijst!$A$11:$M$237,4,FALSE))","v":0},null,{"$f":"IF(VLOOKUP($L6,invullijst!$A$11:$M$196,2,FALSE)=\"\",\"\",VLOOKUP($L6,invullijst!$A$11:$M$196,2,FALSE))","v":0},null,{"$f":"IF(VLOOKUP($L6,invullijst!$A$11:$M$196,9,FALSE)=0,\"\",VLOOKUP($L6,invullijst!$A$11:$M$196,9,FALSE))","v":""}]
[2,{"$f":"IF($G$3=\"k\",IF(VLOOKUP($D7,invullijst!$A$11:$M$196,11,FALSE)=0,\" \",VLOOKUP($D7,invullijst!$A$11:$M$196,11,FALSE)),\"\")","v":" "},{"$f":"IF(VLOOKUP(D7,invullijst!A$11:F$237,4,FALSE)=\"\",\"\",VLOOKUP(D7,invullijst!A$11:D$237,4,FALSE))","v":0},null,{"$f":"IF(VLOOKUP($D7,invullijst!$A$11:$M$196,2,FALSE)=\"\",\"\",VLOOKUP($D7,invullijst!$A$11:$M$196,2,FALSE))","v":0},null,{"$f":"IF(VLOOKUP($D7,invullijst!$A$11:$M$196,9,FALSE)=0,\"\",VLOOKUP($D7,invullijst!$A$11:$M$196,9,FALSE))","v":""},null,2,{"$f":"IF($O$3=\"k\",IF(VLOOKUP($L7,invullijst!$A$11:$M$196,11,FALSE)=0,\" \",VLOOKUP($L7,invullijst!$A$11:$M$196,11,FALSE)),\"\")","v":" "},{"$f":"IF(VLOOKUP($L7,invullijst!$A$11:$M$237,4,FALSE)=\"\",\"\",VLOOKUP($L7,invullijst!$A$11:$M$237,4,FALSE))","v":0},null,{"$f":"IF(VLOOKUP($L7,invullijst!$A$11:$M$196,2,FALSE)=\"\",\"\",VLOOKUP($L7,invullijst!$A$11:$M$196,2,FALSE))","v":0},null,{"$f":"IF(VLOOKUP($L7,invullijst!$A$11:$M$196,9,FALSE)=0,\"\",VLOOKUP($L7,invullijst!$A$11:$M$196,9,FALSE))","v":""}]
[3,{"$f":"IF($G$3=\"k\",IF(VLOOKUP($D8,invullijst!$A$11:$M$196,11,FALSE)=0,\" \",VLOOKUP($D8,invullijst!$A$11:$M$196,11,FALSE)),\"\")","v":" "},{"$f":"IF(VLOOKUP(D8,invullijst!A$11:F$237,4,FALSE)=\"\",\"\",VLOOKUP(D8,invullijst!A$11:D$237,4,FALSE))","v":0},null,{"$f":"IF(VLOOKUP($D8,invullijst!$A$11:$M$196,2,FALSE)=\"\",\"\",VLOOKUP($D8,invullijst!$A$11:$M$196,2,FALSE))","v":0},null,{"$f":"IF(VLOOKUP($D8,invullijst!$A$11:$M$196,9,FALSE)=0,\"\",VLOOKUP($D8,invullijst!$A$11:$M$196,9,FALSE))","v":""},null,3,{"$f":"IF($O$3=\"k\",IF(VLOOKUP($L8,invullijst!$A$11:$M$196,11,FALSE)=0,\" \",VLOOKUP($L8,invullijst!$A$11:$M$196,11,FALSE)),\"\")","v":" "},{"$f":"IF(VLOOKUP($L8,invullijst!$A$11:$M$237,4,FALSE)=\"\",\"\",VLOOKUP($L8,invullijst!$A$11:$M$237,4,FALSE))","v":0},null,{"$f":"IF(VLOOKUP($L8,invullijst!$A$11:$M$196,2,FALSE)=\"\",\"\",VLOOKUP($L8,invullijst!$A$11:$M$196,2,FALSE))","v":0},null,{"$f":"IF(VLOOKUP($L8,invullijst!$A$11:$M$196,9,FALSE)=0,\"\",VLOOKUP($L8,invullijst!$A$11:$M$196,9,FALSE))","v":""}]
[4,{"$f":"IF($G$3=\"k\",IF(VLOOKUP($D9,invullijst!$A$11:$M$196,11,FALSE)=0,\" \",VLOOKUP($D9,invullijst!$A$11:$M$196,11,FALSE)),\"\")","v":" "},{"$f":"IF(VLOOKUP(D9,invullijst!A$11:F$237,4,FALSE)=\"\",\"\",VLOOKUP(D9,invullijst!A$11:D$237,4,FALSE))","v":0},null,{"$f":"IF(VLOOKUP($D9,invullijst!$A$11:$M$196,2,FALSE)=\"\",\"\",VLOOKUP($D9,invullijst!$A$11:$M$196,2,FALSE))","v":0},null,{"$f":"IF(VLOOKUP($D9,invullijst!$A$11:$M$196,9,FALSE)=0,\"\",VLOOKUP($D9,invullijst!$A$11:$M$196,9,FALSE))","v":""},null,4,{"$f":"IF($O$3=\"k\",IF(VLOOKUP($L9,invullijst!$A$11:$M$196,11,FALSE)=0,\" \",VLOOKUP($L9,invullijst!$A$11:$M$196,11,FALSE)),\"\")","v":" "},{"$f":"IF(VLOOKUP($L9,invullijst!$A$11:$M$237,4,FALSE)=\"\",\"\",VLOOKUP($L9,invullijst!$A$11:$M$237,4,FALSE))","v":0},null,{"$f":"IF(VLOOKUP($L9,invullijst!$A$11:$M$196,2,FALSE)=\"\",\"\",VLOOKUP($L9,invullijst!$A$11:$M$196,2,FALSE))","v":0},null,{"$f":"IF(VLOOKUP($L9,invullijst!$A$11:$M$196,9,FALSE)=0,\"\",VLOOKUP($L9,invullijst!$A$11:$M$196,9,FALSE))","v":""}]
["Totaal A korps",{"$nulls":5},{"$f":"SUM(G6:G9)","v":0},null,"Totaal A korps",{"$nulls":5},{"$f":"SUM(O6:O9)","v":0}]
[]
[1,{"$f":"IF($G$3=\"k\",IF(VLOOKUP($D12,invullijst!$A$11:$M$196,11,FALSE)=0,\" \",VLOOKUP($D12,invullijst!$A$11:$M$196,11,FALSE)),\"\")","v":" "},{"$f":"IF(VLOOKUP(D12,invullijst!A$11:F$237,4,FALSE)=\"\",\"\",VLOOKUP(D12,invullijst!A$11:D$237,4,FALSE))","v":0},null,{"$f":"IF(VLOOKUP($D12,invullijst!$A$11:$M$196,2,FALSE)=\"\",\"\",VLOOKUP($D12,invullijst!$A$11:$M$196,2,FALSE))","v":0},null,{"$f":"IF(VLOOKUP($D12,invullijst!$A$11:$M$196,9,FALSE)=0,\"\",VLOOKUP($D12,invullijst!$A$11:$M$196,9,FALSE))","v":""},null,1,{"$f":"IF($O$3=\"k\",IF(VLOOKUP($L12,invullijst!$A$11:$M$196,11,FALSE)=0,\" \",VLOOKUP($L12,invullijst!$A$11:$M$196,11,FALSE)),\"\")","v":" "},{"$f":"IF(VLOOKUP($L12,invullijst!$A$11:$M$237,4,FALSE)=\"\",\"\",VLOOKUP($L12,invullijst!$A$11:$M$237,4,FALSE))","v":0},null,{"$f":"IF(VLOOKUP($L12,invullijst!$A$11:$M$196,2,FALSE)=\"\",\"\",VLOOKUP($L12,invullijst!$A$11:$M$196,2,FALSE))","v":0},null,{"$f":"IF(VLOOKUP($L12,invullijst!$A$11:$M$196,9,FALSE)=0,\"\",VLOOKUP($L12,invullijst!$A$11:$M$196,9,FALSE))","v":""}]
[2,{"$f":"IF($G$3=\"k\",IF(VLOOKUP($D13,invullijst!$A$11:$M$196,11,FALSE)=0,\" \",VLOOKUP($D13,invullijst!$A$11:$M$196,11,FALSE)),\"\")","v":" "},{"$f":"IF(VLOOKUP(D13,invullijst!A$11:F$237,4,FALSE)=\"\",\"\",VLOOKUP(D13,invullijst!A$11:D$237,4,FALSE))","v":0},null,{"$f":"IF(VLOOKUP($D13,invullijst!$A$11:$M$196,2,FALSE)=\"\",\"\",VLOOKUP($D13,invullijst!$A$11:$M$196,2,FALSE))","v":0},null,{"$f":"IF(VLOOKUP($D13,invullijst!$A$11:$M$196,9,FALSE)=0,\"\",VLOOKUP($D13,invullijst!$A$11:$M$196,9,FALSE))","v":""},null,2,{"$f":"IF($O$3=\"k\",IF(VLOOKUP($L13,invullijst!$A$11:$M$196,11,FALSE)=0,\" \",VLOOKUP($L13,invullijst!$A$11:$M$196,11,FALSE)),\"\")","v":" "},{"$f":"IF(VLOOKUP($L13,invullijst!$A$11:$M$237,4,FALSE)=\"\",\"\",VLOOKUP($L13,invullijst!$A$11:$M$237,4,FALSE))","v":0},null,{"$f":"IF(VLOOKUP($L13,invullijst!$A$11:$M$196,2,FALSE)=\"\",\"\",VLOOKUP($L13,invullijst!$A$11:$M$196,2,FALSE))","v":0},null,{"$f":"IF(VLOOKUP($L13,invullijst!$A$11:$M$196,9,FALSE)=0,\"\",VLOOKUP($L13,invullijst!$A$11:$M$196,9,FALSE))","v":""}]
[3,{"$f":"IF($G$3=\"k\",IF(VLOOKUP($D14,invullijst!$A$11:$M$196,11,FALSE)=0,\" \",VLOOKUP($D14,invullijst!$A$11:$M$196,11,FALSE)),\"\")","v":" "},{"$f":"IF(VLOOKUP(D14,invullijst!A$11:F$237,4,FALSE)=\"\",\"\",VLOOKUP(D14,invullijst!A$11:D$237,4,FALSE))","v":0},null,{"$f":"IF(VLOOKUP($D14,invullijst!$A$11:$M$196,2,FALSE)=\"\",\"\",VLOOKUP($D14,invullijst!$A$11:$M$196,2,FALSE))","v":0},null,{"$f":"IF(VLOOKUP($D14,invullijst!$A$11:$M$196,9,FALSE)=0,\"\",VLOOKUP($D14,invullijst!$A$11:$M$196,9,FALSE))","v":""},null,3,{"$f":"IF($O$3=\"k\",IF(VLOOKUP($L14,invullijst!$A$11:$M$196,11,FALSE)=0,\" \",VLOOKUP($L14,invullijst!$A$11:$M$196,11,FALSE)),\"\")","v":" "},{"$f":"IF(VLOOKUP($L14,invullijst!$A$11:$M$237,4,FALSE)=\"\",\"\",VLOOKUP($L14,invullijst!$A$11:$M$237,4,FALSE))","v":0},null,{"$f":"IF(VLOOKUP($L14,invullijst!$A$11:$M$196,2,FALSE)=\"\",\"\",VLOOKUP($L14,invullijst!$A$11:$M$196,2,FALSE))","v":0},null,{"$f":"IF(VLOOKUP($L14,invullijst!$A$11:$M$196,9,FALSE)=0,\"\",VLOOKUP($L14,invullijst!$A$11:$M$196,9,FALSE))","v":""}]
[4,{"$f":"IF($G$3=\"k\",IF(VLOOKUP($D15,invullijst!$A$11:$M$196,11,FALSE)=0,\" \",VLOOKUP($D15,invullijst!$A$11:$M$196,11,FALSE)),\"\")","v":" "},{"$f":"IF(VLOOKUP(D15,invullijst!A$11:F$237,4,FALSE)=\"\",\"\",VLOOKUP(D15,invullijst!A$11:D$237,4,FALSE))","v":0},null,{"$f":"IF(VLOOKUP($D15,invullijst!$A$11:$M$196,2,FALSE)=\"\",\"\",VLOOKUP($D15,invullijst!$A$11:$M$196,2,FALSE))","v":0},null,{"$f":"IF(VLOOKUP($D15,invullijst!$A$11:$M$196,9,FALSE)=0,\"\",VLOOKUP($D15,invullijst!$A$11:$M$196,9,FALSE))","v":""},null,4,{"$f":"IF($O$3=\"k\",IF(VLOOKUP($L15,invullijst!$A$11:$M$196,11,FALSE)=0,\" \",VLOOKUP($L15,invullijst!$A$11:$M$196,11,FALSE)),\"\")","v":" "},{"$f":"IF(VLOOKUP($L15,invullijst!$A$11:$M$237,4,FALSE)=\"\",\"\",VLOOKUP($L15,invullijst!$A$11:$M$237,4,FALSE))","v":0},null,{"$f":"IF(VLOOKUP($L15,invullijst!$A$11:$M$196,2,FALSE)=\"\",\"\",VLOOKUP($L15,invullijst!$A$11:$M$196,2,FALSE))","v":0},null,{"$f":"IF(VLOOKUP($L15,invullijst!$A$11:$M$196,9,FALSE)=0,\"\",VLOOKUP($L15,invullijst!$A$11:$M$196,9,FALSE))","v":""}]
["Totaal B1 korps",{"$nulls":5},{"$f":"SUM(G12:G15)","v":0},null,"Totaal B1 korps",{"$nulls":5},{"$f":"SUM(O12:O15)","v":0}]
[]
[1,{"$f":"IF($G$3=\"k\",IF(VLOOKUP($D18,invullijst!$A$11:$M$196,11,FALSE)=0,\" \",VLOOKUP($D18,invullijst!$A$11:$M$196,11,FALSE)),\"\")","v":" "},{"$f":"IF(VLOOKUP(D18,invullijst!A$11:F$237,4,FALSE)=\"\",\"\",VLOOKUP(D18,invullijst!A$11:D$237,4,FALSE))","v":0},null,{"$f":"IF(VLOOKUP($D18,invullijst!$A$11:$M$196,2,FALSE)=\"\",\"\",VLOOKUP($D18,invullijst!$A$11:$M$196,2,FALSE))","v":0},null,{"$f":"IF(VLOOKUP($D18,invullijst!$A$11:$M$196,9,FALSE)=0,\"\",VLOOKUP($D18,invullijst!$A$11:$M$196,9,FALSE))","v":""},null,1,{"$f":"IF($O$3=\"k\",IF(VLOOKUP($L18,invullijst!$A$11:$M$196,11,FALSE)=0,\" \",VLOOKUP($L18,invullijst!$A$11:$M$196,11,FALSE)),\"\")","v":" "},{"$f":"IF(VLOOKUP($L18,invullijst!$A$11:$M$237,4,FALSE)=\"\",\"\",VLOOKUP($L18,invullijst!$A$11:$M$237,4,FALSE))","v":0},null,{"$f":"IF(VLOOKUP($L18,invullijst!$A$11:$M$196,2,FALSE)=\"\",\"\",VLOOKUP($L18,invullijst!$A$11:$M$196,2,FALSE))","v":0},null,{"$f":"IF(VLOOKUP($L18,invullijst!$A$11:$M$196,9,FALSE)=0,\"\",VLOOKUP($L18,invullijst!$A$11:$M$196,9,FALSE))","v":""}]
[2,{"$f":"IF($G$3=\"k\",IF(VLOOKUP($D19,invullijst!$A$11:$M$196,11,FALSE)=0,\" \",VLOOKUP($D19,invullijst!$A$11:$M$196,11,FALSE)),\"\")","v":" "},{"$f":"IF(VLOOKUP(D19,invullijst!A$11:F$237,4,FALSE)=\"\",\"\",VLOOKUP(D19,invullijst!A$11:D$237,4,FALSE))","v":0},null,{"$f":"IF(VLOOKUP($D19,invullijst!$A$11:$M$196,2,FALSE)=\"\",\"\",VLOOKUP($D19,invullijst!$A$11:$M$196,2,FALSE))","v":0},null,{"$f":"IF(VLOOKUP($D19,invullijst!$A$11:$M$196,9,FALSE)=0,\"\",VLOOKUP($D19,invullijst!$A$11:$M$196,9,FALSE))","v":""},null,2,{"$f":"IF($O$3=\"k\",IF(VLOOKUP($L19,invullijst!$A$11:$M$196,11,FALSE)=0,\" \",VLOOKUP($L19,invullijst!$A$11:$M$196,11,FALSE)),\"\")","v":" "},{"$f":"IF(VLOOKUP($L19,invullijst!$A$11:$M$237,4,FALSE)=\"\",\"\",VLOOKUP($L19,invullijst!$A$11:$M$237,4,FALSE))","v":0},null,{"$f":"IF(VLOOKUP($L19,invullijst!$A$11:$M$196,2,FALSE)=\"\",\"\",VLOOKUP($L19,invullijst!$A$11:$M$196,2,FALSE))","v":0},null,{"$f":"IF(VLOOKUP($L19,invullijst!$A$11:$M$196,9,FALSE)=0,\"\",VLOOKUP($L19,invullijst!$A$11:$M$196,9,FALSE))","v":""}]
[3,{"$f":"IF($G$3=\"k\",IF(VLOOKUP($D20,invullijst!$A$11:$M$196,11,FALSE)=0,\" \",VLOOKUP($D20,invullijst!$A$11:$M$196,11,FALSE)),\"\")","v":" "},{"$f":"IF(VLOOKUP(D20,invullijst!A$11:F$237,4,FALSE)=\"\",\"\",VLOOKUP(D20,invullijst!A$11:D$237,4,FALSE))","v":0},null,{"$f":"IF(VLOOKUP($D20,invullijst!$A$11:$M$196,2,FALSE)=\"\",\"\",VLOOKUP($D20,invullijst!$A$11:$M$196,2,FALSE))","v":0},null,{"$f":"IF(VLOOKUP($D20,invullijst!$A$11:$M$196,9,FALSE)=0,\"\",VLOOKUP($D20,invullijst!$A$11:$M$196,9,FALSE))","v":""},null,3,{"$f":"IF($O$3=\"k\",IF(VLOOKUP($L20,invullijst!$A$11:$M$196,11,FALSE)=0,\" \",VLOOKUP($L20,invullijst!$A$11:$M$196,11,FALSE)),\"\")","v":" "},{"$f":"IF(VLOOKUP($L20,invullijst!$A$11:$M$237,4,FALSE)=\"\",\"\",VLOOKUP($L20,invullijst!$A$11:$M$237,4,FALSE))","v":0},null,{"$f":"IF(VLOOKUP($L20,invullijst!$A$11:$M$196,2,FALSE)=\"\",\"\",VLOOKUP($L20,invullijst!$A$11:$M$196,2,FALSE))","v":0},null,{"$f":"IF(VLOOKUP($L20,invullijst!$A$11:$M$196,9,FALSE)=0,\"\",VLOOKUP($L20,invullijst!$A$11:$M$196,9,FALSE))","v":""}]
[4,{"$f":"IF($G$3=\"k\",IF(VLOOKUP($D21,invullijst!$A$11:$M$196,11,FALSE)=0,\" \",VLOOKUP($D21,invullijst!$A$11:$M$196,11,FALSE)),\"\")","v":" "},{"$f":"IF(VLOOKUP(D21,invullijst!A$11:F$237,4,FALSE)=\"\",\"\",VLOOKUP(D21,invullijst!A$11:D$237,4,FALSE))","v":0},null,{"$f":"IF(VLOOKUP($D21,invullijst!$A$11:$M$196,2,FALSE)=\"\",\"\",VLOOKUP($D21,invullijst!$A$11:$M$196,2,FALSE))","v":0},null,{"$f":"IF(VLOOKUP($D21,invullijst!$A$11:$M$196,9,FALSE)=0,\"\",VLOOKUP($D21,invullijst!$A$11:$M$196,9,FALSE))","v":""},null,4,{"$f":"IF($O$3=\"k\",IF(VLOOKUP($L21,invullijst!$A$11:$M$196,11,FALSE)=0,\" \",VLOOKUP($L21,invullijst!$A$11:$M$196,11,FALSE)),\"\")","v":" "},{"$f":"IF(VLOOKUP($L21,invullijst!$A$11:$M$237,4,FALSE)=\"\",\"\",VLOOKUP($L21,invullijst!$A$11:$M$237,4,FALSE))","v":0},null,{"$f":"IF(VLOOKUP($L21,invullijst!$A$11:$M$196,2,FALSE)=\"\",\"\",VLOOKUP($L21,invullijst!$A$11:$M$196,2,FALSE))","v":0},null,{"$f":"IF(VLOOKUP($L21,invullijst!$A$11:$M$196,9,FALSE)=0,\"\",VLOOKUP($L21,invullijst!$A$11:$M$196,9,FALSE))","v":""}]
["DIVERSEN / INHAAL",{"$nulls":5},{"$f":"SUM(G18:G21)","v":0},null,"DIVERSEN / INHAAL",{"$nulls":5},{"$f":"SUM(O18:O21)","v":0}]
[]
["OPGELEGD (Jeugd <16 en 65+)"]
[1,{"$f":"IF($G$3=\"k\",IF(VLOOKUP($D25,invullijst!$A$11:$M$196,11,FALSE)=0,\" \",VLOOKUP($D25,invullijst!$A$11:$M$196,11,FALSE)),\"\")","v":" "},{"$f":"IF(VLOOKUP(D25,invullijst!A$11:F$237,4,FALSE)=\"\",\"\",VLOOKUP(D25,invullijst!A$11:D$237,4,FALSE))","v":0},null,{"$f":"IF(VLOOKUP($D25,invullijst!$A$11:$M$196,2,FALSE)=\"\",\"\",VLOOKUP($D25,invullijst!$A$11:$M$196,2,FALSE))","v":0},null,{"$f":"IF(VLOOKUP($D25,invullijst!$A$11:$M$196,9,FALSE)=0,\"\",VLOOKUP($D25,invullijst!$A$11:$M$196,9,FALSE))","v":""},null,1,{"$f":"IF($O$3=\"k\",IF(VLOOKUP($L25,invullijst!$A$11:$M$196,11,FALSE)=0,\" \",VLOOKUP($L25,invullijst!$A$11:$M$196,11,FALSE)),\"\")","v":" "},{"$f":"IF(VLOOKUP($L25,invullijst!$A$11:$M$237,4,FALSE)=\"\",\"\",VLOOKUP($L25,invullijst!$A$11:$M$237,4,FALSE))","v":0},null,{"$f":"IF(VLOOKUP($L25,invullijst!$A$11:$M$196,2,FALSE)=\"\",\"\",VLOOKUP($L25,invullijst!$A$11:$M$196,2,FALSE))","v":0},null,{"$f":"IF(VLOOKUP($L25,invullijst!$A$11:$M$196,9,FALSE)=0,\"\",VLOOKUP($L25,invullijst!$A$11:$M$196,9,FALSE))","v":""}]
[2,{"$f":"IF($G$3=\"k\",IF(VLOOKUP($D26,invullijst!$A$11:$M$196,11,FALSE)=0,\" \",VLOOKUP($D26,invullijst!$A$11:$M$196,11,FALSE)),\"\")","v":" "},{"$f":"IF(VLOOKUP(D26,invullijst!A$11:F$237,4,FALSE)=\"\",\"\",VLOOKUP(D26,invullijst!A$11:D$237,4,FALSE))","v":0},null,{"$f":"IF(VLOOKUP($D26,invullijst!$A$11:$M$196,2,FALSE)=\"\",\"\",VLOOKUP($D26,invullijst!$A$11:$M$196,2,FALSE))","v":0},null,{"$f":"IF(VLOOKUP($D26,invullijst!$A$11:$M$196,9,FALSE)=0,\"\",VLOOKUP($D26,invullijst!$A$11:$M$196,9,FALSE))","v":""},null,2,{"$f":"IF($O$3=\"k\",IF(VLOOKUP($L26,invullijst!$A$11:$M$196,11,FALSE)=0,\" \",VLOOKUP($L26,invullijst!$A$11:$M$196,11,FALSE)),\"\")","v":" "},{"$f":"IF(VLOOKUP($L26,invullijst!$A$11:$M$237,4,FALSE)=\"\",\"\",VLOOKUP($L26,invullijst!$A$11:$M$237,4,FALSE))","v":0},null,{"$f":"IF(VLOOKUP($L26,invullijst!$A$11:$M$196,2,FALSE)=\"\",\"\",VLOOKUP($L26,invullijst!$A$11:$M$196,2,FALSE))","v":0},null,{"$f":"IF(VLOOKUP($L26,invullijst!$A$11:$M$196,9,FALSE)=0,\"\",VLOOKUP($L26,invullijst!$A$11:$M$196,9,FALSE))","v":""}]
[3,{"$f":"IF($G$3=\"k\",IF(VLOOKUP($D27,invullijst!$A$11:$M$196,11,FALSE)=0,\" \",VLOOKUP($D27,invullijst!$A$11:$M$196,11,FALSE)),\"\")","v":" "},{"$f":"IF(VLOOKUP(D27,invullijst!A$11:F$237,4,FALSE)=\"\",\"\",VLOOKUP(D27,invullijst!A$11:D$237,4,FALSE))","v":0},null,{"$f":"IF(VLOOKUP($D27,invullijst!$A$11:$M$196,2,FALSE)=\"\",\"\",VLOOKUP($D27,invullijst!$A$11:$M$196,2,FALSE))","v":0},null,{"$f":"IF(VLOOKUP($D27,invullijst!$A$11:$M$196,9,FALSE)=0,\"\",VLOOKUP($D27,invullijst!$A$11:$M$196,9,FALSE))","v":""},null,3,{"$f":"IF($O$3=\"k\",IF(VLOOKUP($L27,invullijst!$A$11:$M$196,11,FALSE)=0,\" \",VLOOKUP($L27,invullijst!$A$11:$M$196,11,FALSE)),\"\")","v":" "},{"$f":"IF(VLOOKUP($L27,invullijst!$A$11:$M$237,4,FALSE)=\"\",\"\",VLOOKUP($L27,invullijst!$A$11:$M$237,4,FALSE))","v":0},null,{"$f":"IF(VLOOKUP($L27,invullijst!$A$11:$M$196,2,FALSE)=\"\",\"\",VLOOKUP($L27,invullijst!$A$11:$M$196,2,FALSE))","v":0},null,{"$f":"IF(VLOOKUP($L27,invullijst!$A$11:$M$196,9,FALSE)=0,\"\",VLOOKUP($L27,invullijst!$A$11:$M$196,9,FALSE))","v":""}]
["Totaal korps opgelegd A1",{"$nulls":5},{"$f":"SUM(G25:G27)","v":0},null,"Totaal korps opgelegd A1",{"$nulls":5},{"$f":"SUM(O25:O27)","v":0}]
[]
[1,{"$f":"IF($G$3=\"k\",IF(VLOOKUP($D30,invullijst!$A$11:$M$196,11,FALSE)=0,\" \",VLOOKUP($D30,invullijst!$A$11:$M$196,11,FALSE)),\"\")","v":" "},{"$f":"IF(VLOOKUP(D30,invullijst!A$11:F$237,4,FALSE)=\"\",\"\",VLOOKUP(D30,invullijst!A$11:D$237,4,FALSE))","v":0},null,{"$f":"IF(VLOOKUP($D30,invullijst!$A$11:$M$196,2,FALSE)=\"\",\"\",VLOOKUP($D30,invullijst!$A$11:$M$196,2,FALSE))","v":0},null,{"$f":"IF(VLOOKUP($D30,invullijst!$A$11:$M$196,9,FALSE)=0,\"\",VLOOKUP($D30,invullijst!$A$11:$M$196,9,FALSE))","v":""},null,1,{"$f":"IF($O$3=\"k\",IF(VLOOKUP($L30,invullijst!$A$11:$M$196,11,FALSE)=0,\" \",VLOOKUP($L30,invullijst!$A$11:$M$196,11,FALSE)),\"\")","v":" "},{"$f":"IF(VLOOKUP($L30,invullijst!$A$11:$M$237,4,FALSE)=\"\",\"\",VLOOKUP($L30,invullijst!$A$11:$M$237,4,FALSE))","v":0},null,{"$f":"IF(VLOOKUP($L30,invullijst!$A$11:$M$196,2,FALSE)=\"\",\"\",VLOOKUP($L30,invullijst!$A$11:$M$196,2,FALSE))","v":0},null,{"$f":"IF(VLOOKUP($L30,invullijst!$A$11:$M$196,9,FALSE)=0,\"\",VLOOKUP($L30,invullijst!$A$11:$M$196,9,FALSE))","v":""}]
[2,{"$f":"IF($G$3=\"k\",IF(VLOOKUP($D31,invullijst!$A$11:$M$196,11,FALSE)=0,\" \",VLOOKUP($D31,invullijst!$A$11:$M$196,11,FALSE)),\"\")","v":" "},{"$f":"IF(VLOOKUP(D31,invullijst!A$11:F$237,4,FALSE)=\"\",\"\",VLOOKUP(D31,invullijst!A$11:D$237,4,FALSE))","v":0},null,{"$f":"IF(VLOOKUP($D31,invullijst!$A$11:$M$196,2,FALSE)=\"\",\"\",VLOOKUP($D31,invullijst!$A$11:$M$196,2,FALSE))","v":0},null,{"$f":"IF(VLOOKUP($D31,invullijst!$A$11:$M$196,9,FALSE)=0,\"\",VLOOKUP($D31,invullijst!$A$11:$M$196,9,FALSE))","v":""},null,2,{"$f":"IF($O$3=\"k\",IF(VLOOKUP($L31,invullijst!$A$11:$M$196,11,FALSE)=0,\" \",VLOOKUP($L31,invullijst!$A$11:$M$196,11,FALSE)),\"\")","v":" "},{"$f":"IF(VLOOKUP($L31,invullijst!$A$11:$M$237,4,FALSE)=\"\",\"\",VLOOKUP($L31,invullijst!$A$11:$M$237,4,FALSE))","v":0},null,{"$f":"IF(VLOOKUP($L31,invullijst!$A$11:$M$196,2,FALSE)=\"\",\"\",VLOOKUP($L31,invullijst!$A$11:$M$196,2,FALSE))","v":0},null,{"$f":"IF(VLOOKUP($L31,invullijst!$A$11:$M$196,9,FALSE)=0,\"\",VLOOKUP($L31,invullijst!$A$11:$M$196,9,FALSE))","v":""}]
[3,{"$f":"IF($G$3=\"k\",IF(VLOOKUP($D32,invullijst!$A$11:$M$196,11,FALSE)=0,\" \",VLOOKUP($D32,invullijst!$A$11:$M$196,11,FALSE)),\"\")","v":" "},{"$f":"IF(VLOOKUP(D32,invullijst!A$11:F$237,4,FALSE)=\"\",\"\",VLOOKUP(D32,invullijst!A$11:D$237,4,FALSE))","v":0},null,{"$f":"IF(VLOOKUP($D32,invullijst!$A$11:$M$196,2,FALSE)=\"\",\"\",VLOOKUP($D32,invullijst!$A$11:$M$196,2,FALSE))","v":0},null,{"$f":"IF(VLOOKUP($D32,invullijst!$A$11:$M$196,9,FALSE)=0,\"\",VLOOKUP($D32,invullijst!$A$11:$M$196,9,FALSE))","v":""},null,3,{"$f":"IF($O$3=\"k\",IF(VLOOKUP($L32,invullijst!$A$11:$M$196,11,FALSE)=0,\" \",VLOOKUP($L32,invullijst!$A$11:$M$196,11,FALSE)),\"\")","v":" "},{"$f":"IF(VLOOKUP($L32,invullijst!$A$11:$M$237,4,FALSE)=\"\",\"\",VLOOKUP($L32,invullijst!$A$11:$M$237,4,FALSE))","v":0},null,{"$f":"IF(VLOOKUP($L32,invullijst!$A$11:$M$196,2,FALSE)=\"\",\"\",VLOOKUP($L32,invullijst!$A$11:$M$196,2,FALSE))","v":0},null,{"$f":"IF(VLOOKUP($L32,invullijst!$A$11:$M$196,9,FALSE)=0,\"\",VLOOKUP($L32,invullijst!$A$11:$M$196,9,FALSE))","v":""}]
["Totaal korps opgelegd A2",{"$nulls":5},{"$f":"SUM(G30:G32)","v":0},null,"Totaal korps opgelegd A2",{"$nulls":5},{"$f":"SUM(O30:O32)","v":0}]
[]
[1,{"$f":"IF($G$3=\"k\",IF(VLOOKUP($D35,invullijst!$A$11:$M$196,11,FALSE)=0,\" \",VLOOKUP($D35,invullijst!$A$11:$M$196,11,FALSE)),\"\")","v":" "},{"$f":"IF(VLOOKUP(D35,invullijst!A$11:F$237,4,FALSE)=\"\",\"\",VLOOKUP(D35,invullijst!A$11:D$237,4,FALSE))","v":0},null,{"$f":"IF(VLOOKUP($D35,invullijst!$A$11:$M$196,2,FALSE)=\"\",\"\",VLOOKUP($D35,invullijst!$A$11:$M$196,2,FALSE))","v":0},null,{"$f":"IF(VLOOKUP($D35,invullijst!$A$11:$M$196,9,FALSE)=0,\"\",VLOOKUP($D35,invullijst!$A$11:$M$196,9,FALSE))","v":""},null,1,{"$f":"IF($O$3=\"k\",IF(VLOOKUP($L35,invullijst!$A$11:$M$196,11,FALSE)=0,\" \",VLOOKUP($L35,invullijst!$A$11:$M$196,11,FALSE)),\"\")","v":" "},{"$f":"IF(VLOOKUP($L35,invullijst!$A$11:$M$237,4,FALSE)=\"\",\"\",VLOOKUP($L35,invullijst!$A$11:$M$237,4,FALSE))","v":0},null,{"$f":"IF(VLOOKUP($L35,invullijst!$A$11:$M$196,2,FALSE)=\"\",\"\",VLOOKUP($L35,invullijst!$A$11:$M$196,2,FALSE))","v":0},null,{"$f":"IF(VLOOKUP($L35,invullijst!$A$11:$M$196,9,FALSE)=0,\"\",VLOOKUP($L35,invullijst!$A$11:$M$196,9,FALSE))","v":""}]
[2,{"$f":"IF($G$3=\"k\",IF(VLOOKUP($D36,invullijst!$A$11:$M$196,11,FALSE)=0,\" \",VLOOKUP($D36,invullijst!$A$11:$M$196,11,FALSE)),\"\")","v":" "},{"$f":"IF(VLOOKUP(D36,invullijst!A$11:F$237,4,FALSE)=\"\",\"\",VLOOKUP(D36,invullijst!A$11:D$237,4,FALSE))","v":0},null,{"$f":"IF(VLOOKUP($D36,invullijst!$A$11:$M$196,2,FALSE)=\"\",\"\",VLOOKUP($D36,invullijst!$A$11:$M$196,2,FALSE))","v":0},null,{"$f":"IF(VLOOKUP($D36,invullijst!$A$11:$M$196,9,FALSE)=0,\"\",VLOOKUP($D36,invullijst!$A$11:$M$196,9,FALSE))","v":""},null,2,{"$f":"IF($O$3=\"k\",IF(VLOOKUP($L36,invullijst!$A$11:$M$196,11,FALSE)=0,\" \",VLOOKUP($L36,invullijst!$A$11:$M$196,11,FALSE)),\"\")","v":" "},{"$f":"IF(VLOOKUP($L36,invullijst!$A$11:$M$237,4,FALSE)=\"\",\"\",VLOOKUP($L36,invullijst!$A$11:$M$237,4,FALSE))","v":0},null,{"$f":"IF(VLOOKUP($L36,invullijst!$A$11:$M$196,2,FALSE)=\"\",\"\",VLOOKUP($L36,invullijst!$A$11:$M$196,2,FALSE))","v":0},null,{"$f":"IF(VLOOKUP($L36,invullijst!$A$11:$M$196,9,FALSE)=0,\"\",VLOOKUP($L36,invullijst!$A$11:$M$196,9,FALSE))","v":""}]
[3,{"$f":"IF($G$3=\"k\",IF(VLOOKUP($D37,invullijst!$A$11:$M$196,11,FALSE)=0,\" \",VLOOKUP($D37,invullijst!$A$11:$M$196,11,FALSE)),\"\")","v":" "},{"$f":"IF(VLOOKUP(D37,invullijst!A$11:F$237,4,FALSE)=\"\",\"\",VLOOKUP(D37,invullijst!A$11:D$237,4,FALSE))","v":0},null,{"$f":"IF(VLOOKUP($D37,invullijst!$A$11:$M$196,2,FALSE)=\"\",\"\",VLOOKUP($D37,invullijst!$A$11:$M$196,2,FALSE))","v":0},null,{"$f":"IF(VLOOKUP($D37,invullijst!$A$11:$M$196,9,FALSE)=0,\"\",VLOOKUP($D37,invullijst!$A$11:$M$196,9,FALSE))","v":""},null,3,{"$f":"IF($O$3=\"k\",IF(VLOOKUP($L37,invullijst!$A$11:$M$196,11,FALSE)=0,\" \",VLOOKUP($L37,invullijst!$A$11:$M$196,11,FALSE)),\"\")","v":" "},{"$f":"IF(VLOOKUP($L37,invullijst!$A$11:$M$237,4,FALSE)=\"\",\"\",VLOOKUP($L37,invullijst!$A$11:$M$237,4,FALSE))","v":0},null,{"$f":"IF(VLOOKUP($L37,invullijst!$A$11:$M$196,2,FALSE)=\"\",\"\",VLOOKUP($L37,invullijst!$A$11:$M$196,2,FALSE))","v":0},null,{"$f":"IF(VLOOKUP($L37,invullijst!$A$11:$M$196,9,FALSE)=0,\"\",VLOOKUP($L37,invullijst!$A$11:$M$196,9,FALSE))","v":""}]
["Totaal korps opgelegd A3",{"$nulls":5},{"$f":"SUM(G35:G37)","v":0},null,"Totaal korps opgelegd A3",{"$nulls":5},{"$f":"SUM(O35:O37)","v":0}]

{"sheet":"wedstrijd 4B","index":12,"n_rows":38,"n_cols":15,"rows_kept":38,"merged":[[0,0,0,4],[0,5,0,7],[0,8,0,14],[1,0,1,11],[1,12,1,14],[2,1,2,5],[2,9,2,13],[4,0,4,14],[5,4,5,5],[5,12,5,13],[6,4,6,5],[6,12,6,13],[7,4,7,5],[7,12,7,13],[8,4,8,5],[8,12,8,13],[9,0,9,5],[9,8,9,13],[11,4,11,5],[11,12,11,13],[12,4,12,5],[12,12,12,13],[13,4,13,5],[13,12,13,13],[14,4,14,5],[14,12,14,13],[15,0,15,5],[15,8,15,13],[17,4,17,5],[17,12,17,13],[18,4,18,5],[18,12,18,13],[19,4,19,5],[19,12,19,13],[20,4,20,5],[20,12,20,13],[21,0,21,5],[21,8,21,13],[23,0,23,14],[24,4,24,5],[24,12,24,13],[25,4,25,5],[25,12,25,13],[26,4,26,5],[26,12,26,13],[27,0,27,5],[27,8,27,13],[29,4,29,5],[29,12,29,13],[30,4,30,5],[30,12,30,13],[31,4,31,5],[31,12,31,13],[32,0,32,5],[32,8,32,13],[34,4,34,5],[34,12,34,13],[35,4,35,5],[35,12,35,13],[36,4,36,5],[36,12,36,13],[37,0,37,5],[37,8,37,13]]}
[{"$f":"invullijst!F1","v":"Organistatie"},{"$nulls":4},{"$f":"invullijst!H2","v":"2025 - 2026"},null,null,{"$f":"invullijst!F3","v":"Sint Ambrosius Baardwijk"}]
["Datum: ",{"$nulls":11},"2026-02-22"]
[3,{"$f":"IF(VLOOKUP(A3,invullijst!A1:F5,2,FALSE)=\"\",\"\",VLOOKUP(A3,invullijst!A1:F5,2,FALSE))","v":"O.L.V. Schuts Elshout"},{"$nulls":4},"k",null,5,{"$f":"IF(VLOOKUP(I3,invullijst!A1:C5,2,FALSE)=\"\",\"\",VLOOKUP(I3,invullijst!A1:C5,2,FALSE))","v":"Sint Jan Baptist Kaatsheuvel"},{"$nulls":4},"k"]
[]
["vrijehand"]
[1,{"$f":"IF($G$3=\"k\",IF(VLOOKUP($D6,invullijst!$A$11:$M$196,11,FALSE)=0,\" \",VLOOKUP($D6,invullijst!$A$11:$M$196,11,FALSE)),\"\")","v":" "},{"$f":"IF(VLOOKUP(D6,invullijst!A$11:F$237,4,FALSE)=\"\",\"\",VLOOKUP(D6,invullijst!A$11:D$237,4,FALSE))","v":0},null,{"$f":"IF(VLOOKUP($D6,invullijst!$A$11:$M$196,2,FALSE)=\"\",\"\",VLOOKUP($D6,invullijst!$A$11:$M$196,2,FALSE))","v":0},null,{"$f":"IF(VLOOKUP($D6,invullijst!$A$11:$M$196,9,FALSE)=0,\"\",VLOOKUP($D6,invullijst!$A$11:$M$196,9,FALSE))","v":""},null,1,{"$f":"IF($O$3=\"k\",IF(VLOOKUP($L6,invullijst!$A$11:$M$196,11,FALSE)=0,\" \",VLOOKUP($L6,invullijst!$A$11:$M$196,11,FALSE)),\"\")","v":" "},{"$f":"IF(VLOOKUP($L6,invullijst!$A$11:$M$237,4,FALSE)=\"\",\"\",VLOOKUP($L6,invullijst!$A$11:$M$237,4,FALSE))","v":0},null,{"$f":"IF(VLOOKUP($L6,invullijst!$A$11:$M$196,2,FALSE)=\"\",\"\",VLOOKUP($L6,invullijst!$A$11:$M$196,2,FALSE))","v":0},null,{"$f":"IF(VLOOKUP($L6,invullijst!$A$11:$M$196,9,FALSE)=0,\"\",VLOOKUP($L6,invullijst!$A$11:$M$196,9,FALSE))","v":""}]
[2,{"$f":"IF($G$3=\"k\",IF(VLOOKUP($D7,invullijst!$A$11:$M$196,11,FALSE)=0,\" \",VLOOKUP($D7,invullijst!$A$11:$M$196,11,FALSE)),\"\")","v":" "},{"$f":"IF(VLOOKUP(D7,invullijst!A$11:F$237,4,FALSE)=\"\",\"\",VLOOKUP(D7,invullijst!A$11:D$237,4,FALSE))","v":0},null,{"$f":"IF(VLOOKUP($D7,invullijst!$A$11:$M$196,2,FALSE)=\"\",\"\",VLOOKUP($D7,invullijst!$A$11:$M$196,2,FALSE))","v":0},null,{"$f":"IF(VLOOKUP($D7,invullijst!$A$11:$M$196,9,FALSE)=0,\"\",VLOOKUP($D7,invullijst!$A$11:$M$196,9,FALSE))","v":""},null,2,{"$f":"IF($O$3=\"k\",IF(VLOOKUP($L7,invullijst!$A$11:$M$196,11,FALSE)=0,\" \",VLOOKUP($L7,invullijst!$A$11:$M$196,11,FALSE)),\"\")","v":" "},{"$f":"IF(VLOOKUP($L7,invullijst!$A$11:$M$237,4,FALSE)=\"\",\"\",VLOOKUP($L7,invullijst!$A$11:$M$237,4,FALSE))","v":0},null,{"$f":"IF(VLOOKUP($L7,invullijst!$A$11:$M$196,2,FALSE)=\"\",\"\",VLOOKUP($L7,invullijst!$A$11:$M$196,2,FALSE))","v":0},null,{"$f":"IF(VLOOKUP($L7,invullijst!$A$11:$M$196,9,FALSE)=0,\"\",VLOOKUP($L7,invullijst!$A$11:$M$196,9,FALSE))","v":""}]
[3,{"$f":"IF($G$3=\"k\",IF(VLOOKUP($D8,invullijst!$A$11:$M$196,11,FALSE)=0,\" \",VLOOKUP($D8,invullijst!$A$11:$M$196,11,FALSE)),\"\")","v":" "},{"$f":"IF(VLOOKUP(D8,invullijst!A$11:F$237,4,FALSE)=\"\",\"\",VLOOKUP(D8,invullijst!A$11:D$237,4,FALSE))","v":0},null,{"$f":"IF(VLOOKUP($D8,invullijst!$A$11:$M$196,2,FALSE)=\"\",\"\",VLOOKUP($D8,invullijst!$A$11:$M$196,2,FALSE))","v":0},null,{"$f":"IF(VLOOKUP($D8,invullijst!$A$11:$M$196,9,FALSE)=0,\"\",VLOOKUP($D8,invullijst!$A$11:$M$196,9,FALSE))","v":""},null,3,{"$f":"IF($O$3=\"k\",IF(VLOOKUP($L8,invullijst!$A$11:$M$196,11,FALSE)=0,\" \",VLOOKUP($L8,invullijst!$A$11:$M$196,11,FALSE)),\"\")","v":" "},{"$f":"IF(VLOOKUP($L8,invullijst!$A$11:$M$237,4,FALSE)=\"\",\"\",VLOOKUP($L8,invullijst!$A$11:$M$237,4,FALSE))","v":0},null,{"$f":"IF(VLOOKUP($L8,invullijst!$A$11:$M$196,2,FALSE)=\"\",\"\",VLOOKUP($L8,invullijst!$A$11:$M$196,2,FALSE))","v":0},null,{"$f":"IF(VLOOKUP($L8,invullijst!$A$11:$M$196,9,FALSE)=0,\"\",VLOOKUP($L8,invullijst!$A$11:$M$196,9,FALSE))","v":""}]
[4,{"$f":"IF($G$3=\"k\",IF(VLOOKUP($D9,invullijst!$A$11:$M$196,11,FALSE)=0,\" \",VLOOKUP($D9,invullijst!$A$11:$M$196,11,FALSE)),\"\")","v":" "},{"$f":"IF(VLOOKUP(D9,invullijst!A$11:F$237,4,FALSE)=\"\",\"\",VLOOKUP(D9,invullijst!A$11:D$237,4,FALSE))","v":0},null,{"$f":"IF(VLOOKUP($D9,invullijst!$A$11:$M$196,2,FALSE)=\"\",\"\",VLOOKUP($D9,invullijst!$A$11:$M$196,2,FALSE))","v":0},null,{"$f":"IF(VLOOKUP($D9,invullijst!$A$11:$M$196,9,FALSE)=0,\"\",VLOOKUP($D9,invullijst!$A$11:$M$196,9,FALSE))","v":""},null,4,{"$f":"IF($O$3=\"k\",IF(VLOOKUP($L9,invullijst!$A$11:$M$196,11,FALSE)=0,\" \",VLOOKUP($L9,invullijst!$A$11:$M$196,11,FALSE)),\"\")","v":" "},{"$f":"IF(VLOOKUP($L9,invullijst!$A$11:$M$237,4,FALSE)=\"\",\"\",VLOOKUP($L9,invullijst!$A$11:$M$237,4,FALSE))","v":0},null,{"$f":"IF(VLOOKUP($L9,invullijst!$A$11:$M$196,2,FALSE)=\"\",\"\",VLOOKUP($L9,invullijst!$A$11:$M$196,2,FALSE))","v":0},null,{"$f":"IF(VLOOKUP($L9,invullijst!$A$11:$M$196,9,FALSE)=0,\"\",VLOOKUP($L9,invullijst!$A$11:$M$196,9,FALSE))","v":""}]
["Totaal A korps",{"$nulls":5},{"$f":"SUM(G6:G9)","v":0},null,"Totaal A korps",{"$nulls":5},{"$f":"SUM(O6:O9)","v":0}]
[]
[1,{"$f":"IF($G$3=\"k\",IF(VLOOKUP($D12,invullijst!$A$11:$M$196,11,FALSE)=0,\" \",VLOOKUP($D12,invullijst!$A$11:$M$196,11,FALSE)),\"\")","v":" "},{"$f":"IF(VLOOKUP(D12,invullijst!A$11:F$237,4,FALSE)=\"\",\"\",VLOOKUP(D12,invullijst!A$11:D$237,4,FALSE))","v":0},null,{"$f":"IF(VLOOKUP($D12,invullijst!$A$11:$M$196,2,FALSE)=\"\",\"\",VLOOKUP($D12,invullijst!$A$11:$M$196,2,FALSE))","v":0},null,{"$f":"IF(VLOOKUP($D12,invullijst!$A$11:$M$196,9,FALSE)=0,\"\",VLOOKUP($D12,invullijst!$A$11:$M$196,9,FALSE))","v":""},null,1,{"$f":"IF($O$3=\"k\",IF(VLOOKUP($L12,invullijst!$A$11:$M$196,11,FALSE)=0,\" \",VLOOKUP($L12,invullijst!$A$11:$M$196,11,FALSE)),\"\")","v":" "},{"$f":"IF(VLOOKUP($L12,invullijst!$A$11:$M$237,4,FALSE)=\"\",\"\",VLOOKUP($L12,invullijst!$A$11:$M$237,4,FALSE))","v":0},null,{"$f":"IF(VLOOKUP($L12,invullijst!$A$11:$M$196,2,FALSE)=\"\",\"\",VLOOKUP($L12,invullijst!$A$11:$M$196,2,FALSE))","v":0},null,{"$f":"IF(VLOOKUP($L12,invullijst!$A$11:$M$196,9,FALSE)=0,\"\",VLOOKUP($L12,invullijst!$A$11:$M$196,9,FALSE))","v":""}]
[2,{"$f":"IF($G$3=\"k\",IF(VLOOKUP($D13,invullijst!$A$11:$M$196,11,FALSE)=0,\" \",VLOOKUP($D13,invullijst!$A$11:$M$196,11,FALSE)),\"\")","v":" "},{"$f":"IF(VLOOKUP(D13,invullijst!A$11:F$237,4,FALSE)=\"\",\"\",VLOOKUP(D13,invullijst!A$11:D$237,4,FALSE))","v":0},null,{"$f":"IF(VLOOKUP($D13,invullijst!$A$11:$M$196,2,FALSE)=\"\",\"\",VLOOKUP($D13,invullijst!$A$11:$M$196,2,FALSE))","v":0},null,{"$f":"IF(VLOOKUP($D13,invullijst!$A$11:$M$196,9,FALSE)=0,\"\",VLOOKUP($D13,invullijst!$A$11:$M$196,9,FALSE))","v":""},null,2,{"$f":"IF($O$3=\"k\",IF(VLOOKUP($L13,invullijst!$A$11:$M$196,11,FALSE)=0,\" \",VLOOKUP($L13,invullijst!$A$11:$M$196,11,FALSE)),\"\")","v":" "},{"$f":"IF(VLOOKUP($L13,invullijst!$A$11:$M$237,4,FALSE)=\"\",\"\",VLOOKUP($L13,invullijst!$A$11:$M$237,4,FALSE))","v":0},null,{"$f":"IF(VLOOKUP($L13,invullijst!$A$11:$M$196,2,FALSE)=\"\",\"\",VLOOKUP($L13,invullijst!$A$11:$M$196,2,FALSE))","v":0},null,{"$f":"IF(VLOOKUP($L13,invullijst!$A$11:$M$196,9,FALSE)=0,\"\",VLOOKUP($L13,invullijst!$A$11:$M$196,9,FALSE))","v":""}]
[3,{"$f":"IF($G$3=\"k\",IF(VLOOKUP($D14,invullijst!$A$11:$M$196,11,FALSE)=0,\" \",VLOOKUP($D14,invullijst!$A$11:$M$196,11,FALSE)),\"\")","v":" "},{"$f":"IF(VLOOKUP(D14,invullijst!A$11:F$237,4,FALSE)=\"\",\"\",VLOOKUP(D14,invullijst!A$11:D$237,4,FALSE))","v":0},null,{"$f":"IF(VLOOKUP($D14,invullijst!$A$11:$M$196,2,FALSE)=\"\",\"\",VLOOKUP($D14,invullijst!$A$11:$M$196,2,FALSE))","v":0},null,{"$f":"IF(VLOOKUP($D14,invullijst!$A$11:$M$196,9,FALSE)=0,\"\",VLOOKUP($D14,invullijst!$A$11:$M$196,9,FALSE))","v":""},null,3,{"$f":"IF($O$3=\"k\",IF(VLOOKUP($L14,invullijst!$A$11:$M$196,11,FALSE)=0,\" \",VLOOKUP($L14,invullijst!$A$11:$M$196,11,FALSE)),\"\")","v":" "},{"$f":"IF(VLOOKUP($L14,invullijst!$A$11:$M$237,4,FALSE)=\"\",\"\",VLOOKUP($L14,invullijst!$A$11:$M$237,4,FALSE))","v":0},null,{"$f":"IF(VLOOKUP($L14,invullijst!$A$11:$M$196,2,FALSE)=\"\",\"\",VLOOKUP($L14,invullijst!$A$11:$M$196,2,FALSE))","v":0},null,{"$f":"IF(VLOOKUP($L14,invullijst!$A$11:$M$196,9,FALSE)=0,\"\",VLOOKUP($L14,invullijst!$A$11:$M$196,9,FALSE))","v":""}]
[4,{"$f":"IF($G$3=\"k\",IF(VLOOKUP($D15,invullijst!$A$11:$M$196,11,FALSE)=0,\" \",VLOOKUP($D15,invullijst!$A$11:$M$196,11,FALSE)),\"\")","v":" "},{"$f":"IF(VLOOKUP(D15,invullijst!A$11:F$237,4,FALSE)=\"\",\"\",VLOOKUP(D15,invullijst!A$11:D$237,4,FALSE))","v":0},null,{"$f":"IF(VLOOKUP($D15,invullijst!$A$11:$M$196,2,FALSE)=\"\",\"\",VLOOKUP($D15,invullijst!$A$11:$M$196,2,FALSE))","v":0},null,{"$f":"IF(VLOOKUP($D15,invullijst!$A$11:$M$196,9,FALSE)=0,\"\",VLOOKUP($D15,invullijst!$A$11:$M$196,9,FALSE))","v":""},null,4,{"$f":"IF($O$3=\"k\",IF(VLOOKUP($L15,invullijst!$A$11:$M$196,11,FALSE)=0,\" \",VLOOKUP($L15,invullijst!$A$11:$M$196,11,FALSE)),\"\")","v":" "},{"$f":"IF(VLOOKUP($L15,invullijst!$A$11:$M$237,4,FALSE)=\"\",\"\",VLOOKUP($L15,invullijst!$A$11:$M$237,4,FALSE))","v":0},null,{"$f":"IF(VLOOKUP($L15,invullijst!$A$11:$M$196,2,FALSE)=\"\",\"\",VLOOKUP($L15,invullijst!$A$11:$M$196,2,FALSE))","v":0},null,{"$f":"IF(VLOOKUP($L15,invullijst!$A$11:$M$196,9,FALSE)=0,\"\",VLOOKUP($L15,invullijst!$A$11:$M$196,9,FALSE))","v":""}]
["Totaal B1 korps",{"$nulls":5},{"$f":"SUM(G12:G15)","v":0},null,"Totaal B1 korps",{"$nulls":5},{"$f":"SUM(O12:O15)","v":0}]
[]
[1,{"$f":"IF($G$3=\"k\",IF(VLOOKUP($D18,invullijst!$A$11:$M$196,11,FALSE)=0,\" \",VLOOKUP($D18,invullijst!$A$11:$M$196,11,FALSE)),\"\")","v":" "},{"$f":"IF(VLOOKUP(D18,invullijst!A$11:F$237,4,FALSE)=\"\",\"\",VLOOKUP(D18,invullijst!A$11:D$237,4,FALSE))","v":0},null,{"$f":"IF(VLOOKUP($D18,invullijst!$A$11:$M$196,2,FALSE)=\"\",\"\",VLOOKUP($D18,invullijst!$A$11:$M$196,2,FALSE))","v":0},null,{"$f":"IF(VLOOKUP($D18,invullijst!$A$11:$M$196,9,FALSE)=0,\"\",VLOOKUP($D18,invullijst!$A$11:$M$196,9,FALSE))","v":""},null,1,{"$f":"IF($O$3=\"k\",IF(VLOOKUP($L18,invullijst!$A$11:$M$196,11,FALSE)=0,\" \",VLOOKUP($L18,invullijst!$A$11:$M$196,11,FALSE)),\"\")","v":" "},{"$f":"IF(VLOOKUP($L18,invullijst!$A$11:$M$237,4,FALSE)=\"\",\"\",VLOOKUP($L18,invullijst!$A$11:$M$237,4,FALSE))","v":0},null,{"$f":"IF(VLOOKUP($L18,invullijst!$A$11:$M$196,2,FALSE)=\"\",\"\",VLOOKUP($L18,invullijst!$A$11:$M$196,2,FALSE))","v":0},null,{"$f":"IF(VLOOKUP($L18,invullijst!$A$11:$M$196,9,FALSE)=0,\"\",VLOOKUP($L18,invullijst!$A$11:$M$196,9,FALSE))","v":""}]
[2,{"$f":"IF($G$3=\"k\",IF(VLOOKUP($D19,invullijst!$A$11:$M$196,11,FALSE)=0,\" \",VLOOKUP($D19,invullijst!$A$11:$M$196,11,FALSE)),\"\")","v":" "},{"$f":"IF(VLOOKUP(D19,invullijst!A$11:F$237,4,FALSE)=\"\",\"\",VLOOKUP(D19,invullijst!A$11:D$237,4,FALSE))","v":0},null,{"$f":"IF(VLOOKUP($D19,invullijst!$A$11:$M$196,2,FALSE)=\"\",\"\",VLOOKUP($D19,invullijst!$A$11:$M$196,2,FALSE))","v":0},null,{"$f":"IF(VLOOKUP($D19,invullijst!$A$11:$M$196,9,FALSE)=0,\"\",VLOOKUP($D19,invullijst!$A$11:$M$196,9,FALSE))","v":""},null,2,{"$f":"IF($O$3=\"k\",IF(VLOOKUP($L19,invullijst!$A$11:$M$196,11,FALSE)=0,\" \",VLOOKUP($L19,invullijst!$A$11:$M$196,11,FALSE)),\"\")","v":" "},{"$f":"IF(VLOOKUP($L19,invullijst!$A$11:$M$237,4,FALSE)=\"\",\"\",VLOOKUP($L19,invullijst!$A$11:$M$237,4,FALSE))","v":0},null,{"$f":"IF(VLOOKUP($L19,invullijst!$A$11:$M$196,2,FALSE)=\"\",\"\",VLOOKUP($L19,invullijst!$A$11:$M$196,2,FALSE))","v":0},null,{"$f":"IF(VLOOKUP($L19,invullijst!$A$11:$M$196,9,FALSE)=0,\"\",VLOOKUP($L19,invullijst!$A$11:$M$196,9,FALSE))","v":""}]
[3,{"$f":"IF($G$3=\"k\",IF(VLOOKUP($D20,invullijst!$A$11:$M$196,11,FALSE)=0,\" \",VLOOKUP($D20,invullijst!$A$11:$M$196,11,FALSE)),\"\")","v":" "},{"$f":"IF(VLOOKUP(D20,invullijst!A$11:F$237,4,FALSE)=\"\",\"\",VLOOKUP(D20,invullijst!A$11:D$237,4,FALSE))","v":0},null,{"$f":"IF(VLOOKUP($D20,invullijst!$A$11:$M$196,2,FALSE)=\"\",\"\",VLOOKUP($D20,invullijst!$A$11:$M$196,2,FALSE))","v":0},null,{"$f":"IF(VLOOKUP($D20,invullijst!$A$11:$M$196,9,FALSE)=0,\"\",VLOOKUP($D20,invullijst!$A$11:$M$196,9,FALSE))","v":""},null,3,{"$f":"IF($O$3=\"k\",IF(VLOOKUP($L20,invullijst!$A$11:$M$196,11,FALSE)=0,\" \",VLOOKUP($L20,invullijst!$A$11:$M$196,11,FALSE)),\"\")","v":" "},{"$f":"IF(VLOOKUP($L20,invullijst!$A$11:$M$237,4,FALSE)=\"\",\"\",VLOOKUP($L20,invullijst!$A$11:$M$237,4,FALSE))","v":0},null,{"$f":"IF(VLOOKUP($L20,invullijst!$A$11:$M$196,2,FALSE)=\"\",\"\",VLOOKUP($L20,invullijst!$A$11:$M$196,2,FALSE))","v":0},null,{"$f":"IF(VLOOKUP($L20,invullijst!$A$11:$M$196,9,FALSE)=0,\"\",VLOOKUP($L20,invullijst!$A$11:$M$196,9,FALSE))","v":""}]
[4,{"$f":"IF($G$3=\"k\",IF(VLOOKUP($D21,invullijst!$A$11:$M$196,11,FALSE)=0,\" \",VLOOKUP($D21,invullijst!$A$11:$M$196,11,FALSE)),\"\")","v":" "},{"$f":"IF(VLOOKUP(D21,invullijst!A$11:F$237,4,FALSE)=\"\",\"\",VLOOKUP(D21,invullijst!A$11:D$237,4,FALSE))","v":0},null,{"$f":"IF(VLOOKUP($D21,invullijst!$A$11:$M$196,2,FALSE)=\"\",\"\",VLOOKUP($D21,invullijst!$A$11:$M$196,2,FALSE))","v":0},null,{"$f":"IF(VLOOKUP($D21,invullijst!$A$11:$M$196,9,FALSE)=0,\"\",VLOOKUP($D21,invullijst!$A$11:$M$196,9,FALSE))","v":""},null,4,{"$f":"IF($O$3=\"k\",IF(VLOOKUP($L21,invullijst!$A$11:$M$196,11,FALSE)=0,\" \",VLOOKUP($L21,invullijst!$A$11:$M$196,11,FALSE)),\"\")","v":" "},{"$f":"IF(VLOOKUP($L21,invullijst!$A$11:$M$237,4,FALSE)=\"\",\"\",VLOOKUP($L21,invullijst!$A$11:$M$237,4,FALSE))","v":0},null,{"$f":"IF(VLOOKUP($L21,invullijst!$A$11:$M$196,2,FALSE)=\"\",\"\",VLOOKUP($L21,invullijst!$A$11:$M$196,2,FALSE))","v":0},null,{"$f":"IF(VLOOKUP($L21,invullijst!$A$11:$M$196,9,FALSE)=0,\"\",VLOOKUP($L21,invullijst!$A$11:$M$196,9,FALSE))","v":""}]
["DIVERSEN / INHAAL",{"$nulls":5},{"$f":"SUM(G18:G21)","v":0},null,"DIVERSEN / INHAAL",{"$nulls":5},{"$f":"SUM(O18:O21)","v":0}]
[]
["OPGELEGD (Jeugd <16 en 65+)"]
[1,{"$f":"IF($G$3=\"k\",IF(VLOOKUP($D25,invullijst!$A$11:$M$196,11,FALSE)=0,\" \",VLOOKUP($D25,invullijst!$A$11:$M$196,11,FALSE)),\"\")","v":" "},{"$f":"IF(VLOOKUP(D25,invullijst!A$11:F$237,4,FALSE)=\"\",\"\",VLOOKUP(D25,invullijst!A$11:D$237,4,FALSE))","v":0},null,{"$f":"IF(VLOOKUP($D25,invullijst!$A$11:$M$196,2,FALSE)=\"\",\"\",VLOOKUP($D25,invullijst!$A$11:$M$196,2,FALSE))","v":0},null,{"$f":"IF(VLOOKUP($D25,invullijst!$A$11:$M$196,9,FALSE)=0,\"\",VLOOKUP($D25,invullijst!$A$11:$M$196,9,FALSE))","v":""},null,1,{"$f":"IF($O$3=\"k\",IF(VLOOKUP($L25,invullijst!$A$11:$M$196,11,FALSE)=0,\" \",VLOOKUP($L25,invullijst!$A$11:$M$196,11,FALSE)),\"\")","v":" "},{"$f":"IF(VLOOKUP($L25,invullijst!$A$11:$M$237,4,FALSE)=\"\",\"\",VLOOKUP($L25,invullijst!$A$11:$M$237,4,FALSE))","v":0},null,{"$f":"IF(VLOOKUP($L25,invullijst!$A$11:$M$196,2,FALSE)=\"\",\"\",VLOOKUP($L25,invullijst!$A$11:$M$196,2,FALSE))","v":0},null,{"$f":"IF(VLOOKUP($L25,invullijst!$A$11:$M$196,9,FALSE)=0,\"\",VLOOKUP($L25,invullijst!$A$11:$M$196,9,FALSE))","v":""}]
[2,{"$f":"IF($G$3=\"k\",IF(VLOOKUP($D26,invullijst!$A$11:$M$196,11,FALSE)=0,\" \",VLOOKUP($D26,invullijst!$A$11:$M$196,11,FALSE)),\"\")","v":" "},{"$f":"IF(VLOOKUP(D26,invullijst!A$11:F$237,4,FALSE)=\"\",\"\",VLOOKUP(D26,invullijst!A$11:D$237,4,FALSE))","v":0},null,{"$f":"IF(VLOOKUP($D26,invullijst!$A$11:$M$196,2,FALSE)=\"\",\"\",VLOOKUP($D26,invullijst!$A$11:$M$196,2,FALSE))","v":0},null,{"$f":"IF(VLOOKUP($D26,invullijst!$A$11:$M$196,9,FALSE)=0,\"\",VLOOKUP($D26,invullijst!$A$11:$M$196,9,FALSE))","v":""},null,2,{"$f":"IF($O$3=\"k\",IF(VLOOKUP($L26,invullijst!$A$11:$M$196,11,FALSE)=0,\" \",VLOOKUP($L26,invullijst!$A$11:$M$196,11,FALSE)),\"\")","v":" "},{"$f":"IF(VLOOKUP($L26,invullijst!$A$11:$M$237,4,FALSE)=\"\",\"\",VLOOKUP($L26,invullijst!$A$11:$M$237,4,FALSE))","v":0},null,{"$f":"IF(VLOOKUP($L26,invullijst!$A$11:$M$196,2,FALSE)=\"\",\"\",VLOOKUP($L26,invullijst!$A$11:$M$196,2,FALSE))","v":0},null,{"$f":"IF(VLOOKUP($L26,invullijst!$A$11:$M$196,9,FALSE)=0,\"\",VLOOKUP($L26,invullijst!$A$11:$M$196,9,FALSE))","v":""}]
[3,{"$f":"IF($G$3=\"k\",IF(VLOOKUP($D27,invullijst!$A$11:$M$196,11,FALSE)=0,\" \",VLOOKUP($D27,invullijst!$A$11:$M$196,11,FALSE)),\"\")","v":" "},{"$f":"IF(VLOOKUP(D27,invullijst!A$11:F$237,4,FALSE)=\"\",\"\",VLOOKUP(D27,invullijst!A$11:D$237,4,FALSE))","v":0},null,{"$f":"IF(VLOOKUP($D27,invullijst!$A$11:$M$196,2,FALSE)=\"\",\"\",VLOOKUP($D27,invullijst!$A$11:$M$196,2,FALSE))","v":0},null,{"$f":"IF(VLOOKUP($D27,invullijst!$A$11:$M$196,9,FALSE)=0,\"\",VLOOKUP($D27,invullijst!$A$11:$M$196,9,FALSE))","v":""},null,3,{"$f":"IF($O$3=\"k\",IF(VLOOKUP($L27,invullijst!$A$11:$M$196,11,FALSE)=0,\" \",VLOOKUP($L27,invullijst!$A$11:$M$196,11,FALSE)),\"\")","v":" "},{"$f":"IF(VLOOKUP($L27,invullijst!$A$11:$M$237,4,FALSE)=\"\",\"\",VLOOKUP($L27,invullijst!$A$11:$M$237,4,FALSE))","v":0},null,{"$f":"IF(VLOOKUP($L27,invullijst!$A$11:$M$196,2,FALSE)=\"\",\"\",VLOOKUP($L27,invullijst!$A$11:$M$196,2,FALSE))","v":0},null,{"$f":"IF(VLOOKUP($L27,invullijst!$A$11:$M$196,9,FALSE)=0,\"\",VLOOKUP($L27,invullijst!$A$11:$M$196,9,FALSE))","v":""}]
["Totaal korps opgelegd A1",{"$nulls":5},{"$f":"SUM(G25:G27)","v":0},null,"Totaal korps opgelegd A1",{"$nulls":5},{"$f":"SUM(O25:O27)","v":0}]
[]
[1,{"$f":"IF($G$3=\"k\",IF(VLOOKUP($D30,invullijst!$A$11:$M$196,11,FALSE)=0,\" \",VLOOKUP($D30,invullijst!$A$11:$M$196,11,FALSE)),\"\")","v":" "},{"$f":"IF(VLOOKUP(D30,invullijst!A$11:F$237,4,FALSE)=\"\",\"\",VLOOKUP(D30,invullijst!A$11:D$237,4,FALSE))","v":0},null,{"$f":"IF(VLOOKUP($D30,invullijst!$A$11:$M$196,2,FALSE)=\"\",\"\",VLOOKUP($D30,invullijst!$A$11:$M$196,2,FALSE))","v":0},null,{"$f":"IF(VLOOKUP($D30,invullijst!$A$11:$M$196,9,FALSE)=0,\"\",VLOOKUP($D30,invullijst!$A$11:$M$196,9,FALSE))","v":""},null,1,{"$f":"IF($O$3=\"k\",IF(VLOOKUP($L30,invullijst!$A$11:$M$196,11,FALSE)=0,\" \",VLOOKUP($L30,invullijst!$A$11:$M$196,11,FALSE)),\"\")","v":" "},{"$f":"IF(VLOOKUP($L30,invullijst!$A$11:$M$237,4,FALSE)=\"\",\"\",VLOOKUP($L30,invullijst!$A$11:$M$237,4,FALSE))","v":0},null,{"$f":"IF(VLOOKUP($L30,invullijst!$A$11:$M$196,2,FALSE)=\"\",\"\",VLOOKUP($L30,invullijst!$A$11:$M$196,2,FALSE))","v":0},null,{"$f":"IF(VLOOKUP($L30,invullijst!$A$11:$M$196,9,FALSE)=0,\"\",VLOOKUP($L30,invullijst!$A$11:$M$196,9,FALSE))","v":""}]
[2,{"$f":"IF($G$3=\"k\",IF(VLOOKUP($D31,invullijst!$A$11:$M$196,11,FALSE)=0,\" \",VLOOKUP($D31,invullijst!$A$11:$M$196,11,FALSE)),\"\")","v":" "},{"$f":"IF(VLOOKUP(D31,invullijst!A$11:F$237,4,FALSE)=\"\",\"\",VLOOKUP(D31,invullijst!A$11:D$237,4,FALSE))","v":0},null,{"$f":"IF(VLOOKUP($D31,invullijst!$A$11:$M$196,2,FALSE)=\"\",\"\",VLOOKUP($D31,invullijst!$A$11:$M$196,2,FALSE))","v":0},null,{"$f":"IF(VLOOKUP($D31,invullijst!$A$11:$M$196,9,FALSE)=0,\"\",VLOOKUP($D31,invullijst!$A$11:$M$196,9,FALSE))","v":""},null,2,{"$f":"IF($O$3=\"k\",IF(VLOOKUP($L31,invullijst!$A$11:$M$196,11,FALSE)=0,\" \",VLOOKUP($L31,invullijst!$A$11:$M$196,11,FALSE)),\"\")","v":" "},{"$f":"IF(VLOOKUP($L31,invullijst!$A$11:$M$237,4,FALSE)=\"\",\"\",VLOOKUP($L31,invullijst!$A$11:$M$237,4,FALSE))","v":0},null,{"$f":"IF(VLOOKUP($L31,invullijst!$A$11:$M$196,2,FALSE)=\"\",\"\",VLOOKUP($L31,invullijst!$A$11:$M$196,2,FALSE))","v":0},null,{"$f":"IF(VLOOKUP($L31,invullijst!$A$11:$M$196,9,FALSE)=0,\"\",VLOOKUP($L31,invullijst!$A$11:$M$196,9,FALSE))","v":""}]
[3,{"$f":"IF($G$3=\"k\",IF(VLOOKUP($D32,invullijst!$A$11:$M$196,11,FALSE)=0,\" \",VLOOKUP($D32,invullijst!$A$11:$M$196,11,FALSE)),\"\")","v":" "},{"$f":"IF(VLOOKUP(D32,invullijst!A$11:F$237,4,FALSE)=\"\",\"\",VLOOKUP(D32,invullijst!A$11:D$237,4,FALSE))","v":0},null,{"$f":"IF(VLOOKUP($D32,invullijst!$A$11:$M$196,2,FALSE)=\"\",\"\",VLOOKUP($D32,invullijst!$A$11:$M$196,2,FALSE))","v":0},null,{"$f":"IF(VLOOKUP($D32,invullijst!$A$11:$M$196,9,FALSE)=0,\"\",VLOOKUP($D32,invullijst!$A$11:$M$196,9,FALSE))","v":""},null,3,{"$f":"IF($O$3=\"k\",IF(VLOOKUP($L32,invullijst!$A$11:$M$196,11,FALSE)=0,\" \",VLOOKUP($L32,invullijst!$A$11:$M$196,11,FALSE)),\"\")","v":" "},{"$f":"IF(VLOOKUP($L32,invullijst!$A$11:$M$237,4,FALSE)=\"\",\"\",VLOOKUP($L32,invullijst!$A$11:$M$237,4,FALSE))","v":0},null,{"$f":"IF(VLOOKUP($L32,invullijst!$A$11:$M$196,2,FALSE)=\"\",\"\",VLOOKUP($L32,invullijst!$A$11:$M$196,2,FALSE))","v":0},null,{"$f":"IF(VLOOKUP($L32,invullijst!$A$11:$M$196,9,FALSE)=0,\"\",VLOOKUP($L32,invullijst!$A$11:$M$196,9,FALSE))","v":""}]
["Totaal korps opgelegd A2",{"$nulls":5},{"$f":"SUM(G30:G32)","v":0},null,"Totaal korps opgelegd A2",{"$nulls":5},{"$f":"SUM(O30:O32)","v":0}]
[]
[1,{"$f":"IF($G$3=\"k\",IF(VLOOKUP($D35,invullijst!$A$11:$M$196,11,FALSE)=0,\" \",VLOOKUP($D35,invullijst!$A$11:$M$196,11,FALSE)),\"\")","v":" "},{"$f":"IF(VLOOKUP(D35,invullijst!A$11:F$237,4,FALSE)=\"\",\"\",VLOOKUP(D35,invullijst!A$11:D$237,4,FALSE))","v":0},null,{"$f":"IF(VLOOKUP($D35,invullijst!$A$11:$M$196,2,FALSE)=\"\",\"\",VLOOKUP($D35,invullijst!$A$11:$M$196,2,FALSE))","v":0},null,{"$f":"IF(VLOOKUP($D35,invullijst!$A$11:$M$196,9,FALSE)=0,\"\",VLOOKUP($D35,invullijst!$A$11:$M$196,9,FALSE))","v":""},null,1,{"$f":"IF($O$3=\"k\",IF(VLOOKUP($L35,invullijst!$A$11:$M$196,11,FALSE)=0,\" \",VLOOKUP($L35,invullijst!$A$11:$M$196,11,FALSE)),\"\")","v":" "},{"$f":"IF(VLOOKUP($L35,invullijst!$A$11:$M$237,4,FALSE)=\"\",\"\",VLOOKUP($L35,invullijst!$A$11:$M$237,4,FALSE))","v":0},null,{"$f":"IF(VLOOKUP($L35,invullijst!$A$11:$M$196,2,FALSE)=\"\",\"\",VLOOKUP($L35,invullijst!$A$11:$M$196,2,FALSE))","v":0},null,{"$f":"IF(VLOOKUP($L35,invullijst!$A$11:$M$196,9,FALSE)=0,\"\",VLOOKUP($L35,invullijst!$A$11:$M$196,9,FALSE))","v":""}]
[2,{"$f":"IF($G$3=\"k\",IF(VLOOKUP($D36,invullijst!$A$11:$M$196,11,FALSE)=0,\" \",VLOOKUP($D36,invullijst!$A$11:$M$196,11,FALSE)),\"\")","v":" "},{"$f":"IF(VLOOKUP(D36,invullijst!A$11:F$237,4,FALSE)=\"\",\"\",VLOOKUP(D36,invullijst!A$11:D$237,4,FALSE))","v":0},null,{"$f":"IF(VLOOKUP($D36,invullijst!$A$11:$M$196,2,FALSE)=\"\",\"\",VLOOKUP($D36,invullijst!$A$11:$M$196,2,FALSE))","v":0},null,{"$f":"IF(VLOOKUP($D36,invullijst!$A$11:$M$196,9,FALSE)=0,\"\",VLOOKUP($D36,invullijst!$A$11:$M$196,9,FALSE))","v":""},null,2,{"$f":"IF($O$3=\"k\",IF(VLOOKUP($L36,invullijst!$A$11:$M$196,11,FALSE)=0,\" \",VLOOKUP($L36,invullijst!$A$11:$M$196,11,FALSE)),\"\")","v":" "},{"$f":"IF(VLOOKUP($L36,invullijst!$A$11:$M$237,4,FALSE)=\"\",\"\",VLOOKUP($L36,invullijst!$A$11:$M$237,4,FALSE))","v":0},null,{"$f":"IF(VLOOKUP($L36,invullijst!$A$11:$M$196,2,FALSE)=\"\",\"\",VLOOKUP($L36,invullijst!$A$11:$M$196,2,FALSE))","v":0},null,{"$f":"IF(VLOOKUP($L36,invullijst!$A$11:$M$196,9,FALSE)=0,\"\",VLOOKUP($L36,invullijst!$A$11:$M$196,9,FALSE))","v":""}]
[3,{"$f":"IF($G$3=\"k\",IF(VLOOKUP($D37,invullijst!$A$11:$M$196,11,FALSE)=0,\" \",VLOOKUP($D37,invullijst!$A$11:$M$196,11,FALSE)),\"\")","v":" "},{"$f":"IF(VLOOKUP(D37,invullijst!A$11:F$237,4,FALSE)=\"\",\"\",VLOOKUP(D37,invullijst!A$11:D$237,4,FALSE))","v":0},null,{"$f":"IF(VLOOKUP($D37,invullijst!$A$11:$M$196,2,FALSE)=\"\",\"\",VLOOKUP($D37,invullijst!$A$11:$M$196,2,FALSE))","v":0},null,{"$f":"IF(VLOOKUP($D37,invullijst!$A$11:$M$196,9,FALSE)=0,\"\",VLOOKUP($D37,invullijst!$A$11:$M$196,9,FALSE))","v":""},null,3,{"$f":"IF($O$3=\"k\",IF(VLOOKUP($L37,invullijst!$A$11:$M$196,11,FALSE)=0,\" \",VLOOKUP($L37,invullijst!$A$11:$M$196,11,FALSE)),\"\")","v":" "},{"$f":"IF(VLOOKUP($L37,invullijst!$A$11:$M$237,4,FALSE)=\"\",\"\",VLOOKUP($L37,invullijst!$A$11:$M$237,4,FALSE))","v":0},null,{"$f":"IF(VLOOKUP($L37,invullijst!$A$11:$M$196,2,FALSE)=\"\",\"\",VLOOKUP($L37,invullijst!$A$11:$M$196,2,FALSE))","v":0},null,{"$f":"IF(VLOOKUP($L37,invullijst!$A$11:$M$196,9,FALSE)=0,\"\",VLOOKUP($L37,invullijst!$A$11:$M$196,9,FALSE))","v":""}]
["Totaal korps opgelegd A3",{"$nulls":5},{"$f":"SUM(G35:G37)","v":0},null,"Totaal korps opgelegd A3",{"$nulls":5},{"$f":"SUM(O35:O37)","v":0}]

{"sheet":"wedstrijd 5A","index":13,"n_rows":38,"n_cols":15,"rows_kept":38,"merged":[[0,0,0,4],[0,5,0,7],[0,8,0,14],[1,0,1,11],[1,12,1,14],[2,1,2,5],[2,9,2,13],[4,0,4,14],[5,4,5,5],[5,12,5,13],[6,4,6,5],[6,12,6,13],[7,4,7,5],[7,12,7,13],[8,4,8,5],[8,12,8,13],[9,0,9,5],[9,8,9,13],[11,4,11,5],[11,12,11,13],[12,4,12,5],[12,12,12,13],[13,4,13,5],[13,12,13,13],[14,4,14,5],[14,12,14,13],[15,0,15,5],[15,8,15,13],[17,4,17,5],[17,12,17,13],[18,4,18,5],[18,12,18,13],[19,4,19,5],[19,12,19,13],[20,4,20,5],[20,12,20,13],[21,0,21,5],[21,8,21,13],[23,0,23,14],[24,4,24,5],[24,12,24,13],[25,4,25,5],[25,12,25,13],[26,4,26,5],[26,12,26,13],[27,0,27,5],[27,8,27,13],[29,4,29,5],[29,12,29,13],[30,4,30,5],[30,12,30,13],[31,4,31,5],[31,12,31,13],[32,0,32,5],[32,8,32,13],[34,4,34,5],[34,12,34,13],[35,4,35,5],[35,12,35,13],[36,4,36,5],[36,12,36,13],[37,0,37,5],[37,8,37,13]]}
[{"$f":"invullijst!F1","v":"Organistatie"},{"$nulls":4},{"$f":"invullijst!H2","v":"2025 - 2026"},null,null,{"$f":"invullijst!F3","v":"Sint Ambrosius Baardwijk"}]
["Datum: ",{"$nulls":11},"2026-03-15"]
[3,{"$f":"IF(VLOOKUP(A3,invullijst!A1:F5,2,FALSE)=\"\",\"\",VLOOKUP(A3,invullijst!A1:F5,2,FALSE))","v":"O.L.V. Schuts Elshout"},{"$nulls":6},2,{"$f":"IF(VLOOKUP(I3,invullijst!A1:C5,2,FALSE)=\"\",\"\",VLOOKUP(I3,invullijst!A1:C5,2,FALSE))","v":"St. Crispinus & Crispinianus Besoijen"}]
[]
["vrijehand"]
[1,{"$f":"IF($G$3=\"k\",IF(VLOOKUP($D6,invullijst!$A$11:$M$196,11,FALSE)=0,\" \",VLOOKUP($D6,invullijst!$A$11:$M$196,11,FALSE)),\"\")","v":""},{"$f":"IF(VLOOKUP(D6,invullijst!A$11:F$237,4,FALSE)=\"\",\"\",VLOOKUP(D6,invullijst!A$11:D$237,4,FALSE))","v":0},null,{"$f":"IF(VLOOKUP($D6,invullijst!$A$11:$M$196,2,FALSE)=\"\",\"\",VLOOKUP($D6,invullijst!$A$11:$M$196,2,FALSE))","v":0},null,{"$f":"IF(VLOOKUP($D6,invullijst!$A$11:$M$196,10,FALSE)=0,\"\",VLOOKUP($D6,invullijst!$A$11:$M$196,10,FALSE))","v":""},null,1,{"$f":"IF($O$3=\"k\",IF(VLOOKUP($L6,invullijst!$A$11:$M$196,11,FALSE)=0,\" \",VLOOKUP($L6,invullijst!$A$11:$M$196,11,FALSE)),\"\")","v":""},{"$f":"IF(VLOOKUP($L6,invullijst!$A$11:$M$237,4,FALSE)=\"\",\"\",VLOOKUP($L6,invullijst!$A$11:$M$237,4,FALSE))","v":0},null,{"$f":"IF(VLOOKUP($L6,invullijst!$A$11:$M$196,2,FALSE)=\"\",\"\",VLOOKUP($L6,invullijst!$A$11:$M$196,2,FALSE))","v":0},null,{"$f":"IF(VLOOKUP($L6,invullijst!$A$11:$M$196,10,FALSE)=0,\"\",VLOOKUP($L6,invullijst!$A$11:$M$196,10,FALSE))","v":""}]
[2,{"$f":"IF($G$3=\"k\",IF(VLOOKUP($D7,invullijst!$A$11:$M$196,11,FALSE)=0,\" \",VLOOKUP($D7,invullijst!$A$11:$M$196,11,FALSE)),\"\")","v":""},{"$f":"IF(VLOOKUP(D7,invullijst!A$11:F$237,4,FALSE)=\"\",\"\",VLOOKUP(D7,invullijst!A$11:D$237,4,FALSE))","v":0},null,{"$f":"IF(VLOOKUP($D7,invullijst!$A$11:$M$196,2,FALSE)=\"\",\"\",VLOOKUP($D7,invullijst!$A$11:$M$196,2,FALSE))","v":0},null,{"$f":"IF(VLOOKUP($D7,invullijst!$A$11:$M$196,10,FALSE)=0,\"\",VLOOKUP($D7,invullijst!$A$11:$M$196,10,FALSE))","v":""},null,2,{"$f":"IF($O$3=\"k\",IF(VLOOKUP($L7,invullijst!$A$11:$M$196,11,FALSE)=0,\" \",VLOOKUP($L7,invullijst!$A$11:$M$196,11,FALSE)),\"\")","v":""},{"$f":"IF(VLOOKUP($L7,invullijst!$A$11:$M$237,4,FALSE)=\"\",\"\",VLOOKUP($L7,invullijst!$A$11:$M$237,4,FALSE))","v":0},null,{"$f":"IF(VLOOKUP($L7,invullijst!$A$11:$M$196,2,FALSE)=\"\",\"\",VLOOKUP($L7,invullijst!$A$11:$M$196,2,FALSE))","v":0},null,{"$f":"IF(VLOOKUP($L7,invullijst!$A$11:$M$196,10,FALSE)=0,\"\",VLOOKUP($L7,invullijst!$A$11:$M$196,10,FALSE))","v":""}]
[3,{"$f":"IF($G$3=\"k\",IF(VLOOKUP($D8,invullijst!$A$11:$M$196,11,FALSE)=0,\" \",VLOOKUP($D8,invullijst!$A$11:$M$196,11,FALSE)),\"\")","v":""},{"$f":"IF(VLOOKUP(D8,invullijst!A$11:F$237,4,FALSE)=\"\",\"\",VLOOKUP(D8,invullijst!A$11:D$237,4,FALSE))","v":0},null,{"$f":"IF(VLOOKUP($D8,invullijst!$A$11:$M$196,2,FALSE)=\"\",\"\",VLOOKUP($D8,invullijst!$A$11:$M$196,2,FALSE))","v":0},null,{"$f":"IF(VLOOKUP($D8,invullijst!$A$11:$M$196,10,FALSE)=0,\"\",VLOOKUP($D8,invullijst!$A$11:$M$196,10,FALSE))","v":""},null,3,{"$f":"IF($O$3=\"k\",IF(VLOOKUP($L8,invullijst!$A$11:$M$196,11,FALSE)=0,\" \",VLOOKUP($L8,invullijst!$A$11:$M$196,11,FALSE)),\"\")","v":""},{"$f":"IF(VLOOKUP($L8,invullijst!$A$11:$M$237,4,FALSE)=\"\",\"\",VLOOKUP($L8,invullijst!$A$11:$M$237,4,FALSE))","v":0},null,{"$f":"IF(VLOOKUP($L8,invullijst!$A$11:$M$196,2,FALSE)=\"\",\"\",VLOOKUP($L8,invullijst!$A$11:$M$196,2,FALSE))","v":0},null,{"$f":"IF(VLOOKUP($L8,invullijst!$A$11:$M$196,10,FALSE)=0,\"\",VLOOKUP($L8,invullijst!$A$11:$M$196,10,FALSE))","v":""}]
[4,{"$f":"IF($G$3=\"k\",IF(VLOOKUP($D9,invullijst!$A$11:$M$196,11,FALSE)=0,\" \",VLOOKUP($D9,invullijst!$A$11:$M$196,11,FALSE)),\"\")","v":""},{"$f":"IF(VLOOKUP(D9,invullijst!A$11:F$237,4,FALSE)=\"\",\"\",VLOOKUP(D9,invullijst!A$11:D$237,4,FALSE))","v":0},null,{"$f":"IF(VLOOKUP($D9,invullijst!$A$11:$M$196,2,FALSE)=\"\",\"\",VLOOKUP($D9,invullijst!$A$11:$M$196,2,FALSE))","v":0},null,{"$f":"IF(VLOOKUP($D9,invullijst!$A$11:$M$196,10,FALSE)=0,\"\",VLOOKUP($D9,invullijst!$A$11:$M$196,10,FALSE))","v":""},null,4,{"$f":"IF($O$3=\"k\",IF(VLOOKUP($L9,invullijst!$A$11:$M$196,11,FALSE)=0,\" \",VLOOKUP($L9,invullijst!$A$11:$M$196,11,FALSE)),\"\")","v":""},{"$f":"IF(VLOOKUP($L9,invullijst!$A$11:$M$237,4,FALSE)=\"\",\"\",VLOOKUP($L9,invullijst!$A$11:$M$237,4,FALSE))","v":0},null,{"$f":"IF(VLOOKUP($L9,invullijst!$A$11:$M$196,2,FALSE)=\"\",\"\",VLOOKUP($L9,invullijst!$A$11:$M$196,2,FALSE))","v":0},null,{"$f":"IF(VLOOKUP($L9,invullijst!$A$11:$M$196,10,FALSE)=0,\"\",VLOOKUP($L9,invullijst!$A$11:$M$196,10,FALSE))","v":""}]
["Totaal A korps",{"$nulls":5},{"$f":"SUM(G6:G9)","v":0},null,"Totaal A korps",{"$nulls":5},{"$f":"SUM(O6:O9)","v":0}]
[]
[1,{"$f":"IF($G$3=\"k\",IF(VLOOKUP($D12,invullijst!$A$11:$M$196,11,FALSE)=0,\" \",VLOOKUP($D12,invullijst!$A$11:$M$196,11,FALSE)),\"\")","v":""},{"$f":"IF(VLOOKUP(D12,invullijst!A$11:F$237,4,FALSE)=\"\",\"\",VLOOKUP(D12,invullijst!A$11:D$237,4,FALSE))","v":0},null,{"$f":"IF(VLOOKUP($D12,invullijst!$A$11:$M$196,2,FALSE)=\"\",\"\",VLOOKUP($D12,invullijst!$A$11:$M$196,2,FALSE))","v":0},null,{"$f":"IF(VLOOKUP($D12,invullijst!$A$11:$M$196,10,FALSE)=0,\"\",VLOOKUP($D12,invullijst!$A$11:$M$196,10,FALSE))","v":""},null,1,{"$f":"IF($O$3=\"k\",IF(VLOOKUP($L12,invullijst!$A$11:$M$196,11,FALSE)=0,\" \",VLOOKUP($L12,invullijst!$A$11:$M$196,11,FALSE)),\"\")","v":""},{"$f":"IF(VLOOKUP($L12,invullijst!$A$11:$M$237,4,FALSE)=\"\",\"\",VLOOKUP($L12,invullijst!$A$11:$M$237,4,FALSE))","v":0},null,{"$f":"IF(VLOOKUP($L12,invullijst!$A$11:$M$196,2,FALSE)=\"\",\"\",VLOOKUP($L12,invullijst!$A$11:$M$196,2,FALSE))","v":0},null,{"$f":"IF(VLOOKUP($L12,invullijst!$A$11:$M$196,10,FALSE)=0,\"\",VLOOKUP($L12,invullijst!$A$11:$M$196,10,FALSE))","v":""}]
[2,{"$f":"IF($G$3=\"k\",IF(VLOOKUP($D13,invullijst!$A$11:$M$196,11,FALSE)=0,\" \",VLOOKUP($D13,invullijst!$A$11:$M$196,11,FALSE)),\"\")","v":""},{"$f":"IF(VLOOKUP(D13,invullijst!A$11:F$237,4,FALSE)=\"\",\"\",VLOOKUP(D13,invullijst!A$11:D$237,4,FALSE))","v":0},null,{"$f":"IF(VLOOKUP($D13,invullijst!$A$11:$M$196,2,FALSE)=\"\",\"\",VLOOKUP($D13,invullijst!$A$11:$M$196,2,FALSE))","v":0},null,{"$f":"IF(VLOOKUP($D13,invullijst!$A$11:$M$196,10,FALSE)=0,\"\",VLOOKUP($D13,invullijst!$A$11:$M$196,10,FALSE))","v":""},null,2,{"$f":"IF($O$3=\"k\",IF(VLOOKUP($L13,invullijst!$A$11:$M$196,11,FALSE)=0,\" \",VLOOKUP($L13,invullijst!$A$11:$M$196,11,FALSE)),\"\")","v":""},{"$f":"IF(VLOOKUP($L13,invullijst!$A$11:$M$237,4,FALSE)=\"\",\"\",VLOOKUP($L13,invullijst!$A$11:$M$237,4,FALSE))","v":0},null,{"$f":"IF(VLOOKUP($L13,invullijst!$A$11:$M$196,2,FALSE)=\"\",\"\",VLOOKUP($L13,invullijst!$A$11:$M$196,2,FALSE))","v":0},null,{"$f":"IF(VLOOKUP($L13,invullijst!$A$11:$M$196,10,FALSE)=0,\"\",VLOOKUP($L13,invullijst!$A$11:$M$196,10,FALSE))","v":""}]
[3,{"$f":"IF($G$3=\"k\",IF(VLOOKUP($D14,invullijst!$A$11:$M$196,11,FALSE)=0,\" \",VLOOKUP($D14,invullijst!$A$11:$M$196,11,FALSE)),\"\")","v":""},{"$f":"IF(VLOOKUP(D14,invullijst!A$11:F$237,4,FALSE)=\"\",\"\",VLOOKUP(D14,invullijst!A$11:D$237,4,FALSE))","v":0},null,{"$f":"IF(VLOOKUP($D14,invullijst!$A$11:$M$196,2,FALSE)=\"\",\"\",VLOOKUP($D14,invullijst!$A$11:$M$196,2,FALSE))","v":0},null,{"$f":"IF(VLOOKUP($D14,invullijst!$A$11:$M$196,10,FALSE)=0,\"\",VLOOKUP($D14,invullijst!$A$11:$M$196,10,FALSE))","v":""},null,3,{"$f":"IF($O$3=\"k\",IF(VLOOKUP($L14,invullijst!$A$11:$M$196,11,FALSE)=0,\" \",VLOOKUP($L14,invullijst!$A$11:$M$196,11,FALSE)),\"\")","v":""},{"$f":"IF(VLOOKUP($L14,invullijst!$A$11:$M$237,4,FALSE)=\"\",\"\",VLOOKUP($L14,invullijst!$A$11:$M$237,4,FALSE))","v":0},null,{"$f":"IF(VLOOKUP($L14,invullijst!$A$11:$M$196,2,FALSE)=\"\",\"\",VLOOKUP($L14,invullijst!$A$11:$M$196,2,FALSE))","v":0},null,{"$f":"IF(VLOOKUP($L14,invullijst!$A$11:$M$196,10,FALSE)=0,\"\",VLOOKUP($L14,invullijst!$A$11:$M$196,10,FALSE))","v":""}]
[4,{"$f":"IF($G$3=\"k\",IF(VLOOKUP($D15,invullijst!$A$11:$M$196,11,FALSE)=0,\" \",VLOOKUP($D15,invullijst!$A$11:$M$196,11,FALSE)),\"\")","v":""},{"$f":"IF(VLOOKUP(D15,invullijst!A$11:F$237,4,FALSE)=\"\",\"\",VLOOKUP(D15,invullijst!A$11:D$237,4,FALSE))","v":0},null,{"$f":"IF(VLOOKUP($D15,invullijst!$A$11:$M$196,2,FALSE)=\"\",\"\",VLOOKUP($D15,invullijst!$A$11:$M$196,2,FALSE))","v":0},null,{"$f":"IF(VLOOKUP($D15,invullijst!$A$11:$M$196,10,FALSE)=0,\"\",VLOOKUP($D15,invullijst!$A$11:$M$196,10,FALSE))","v":""},null,4,{"$f":"IF($O$3=\"k\",IF(VLOOKUP($L15,invullijst!$A$11:$M$196,11,FALSE)=0,\" \",VLOOKUP($L15,invullijst!$A$11:$M$196,11,FALSE)),\"\")","v":""},{"$f":"IF(VLOOKUP($L15,invullijst!$A$11:$M$237,4,FALSE)=\"\",\"\",VLOOKUP($L15,invullijst!$A$11:$M$237,4,FALSE))","v":0},null,{"$f":"IF(VLOOKUP($L15,invullijst!$A$11:$M$196,2,FALSE)=\"\",\"\",VLOOKUP($L15,invullijst!$A$11:$M$196,2,FALSE))","v":0},null,{"$f":"IF(VLOOKUP($L15,invullijst!$A$11:$M$196,10,FALSE)=0,\"\",VLOOKUP($L15,invullijst!$A$11:$M$196,10,FALSE))","v":""}]
["Totaal B1 korps",{"$nulls":5},{"$f":"SUM(G12:G15)","v":0},null,"Totaal B1 korps",{"$nulls":5},{"$f":"SUM(O12:O15)","v":0}]
[]
[1,{"$f":"IF($G$3=\"k\",IF(VLOOKUP($D18,invullijst!$A$11:$M$196,11,FALSE)=0,\" \",VLOOKUP($D18,invullijst!$A$11:$M$196,11,FALSE)),\"\")","v":""},{"$f":"IF(VLOOKUP(D18,invullijst!A$11:F$237,4,FALSE)=\"\",\"\",VLOOKUP(D18,invullijst!A$11:D$237,4,FALSE))","v":0},null,{"$f":"IF(VLOOKUP($D18,invullijst!$A$11:$M$196,2,FALSE)=\"\",\"\",VLOOKUP($D18,invullijst!$A$11:$M$196,2,FALSE))","v":0},null,{"$f":"IF(VLOOKUP($D18,invullijst!$A$11:$M$196,10,FALSE)=0,\"\",VLOOKUP($D18,invullijst!$A$11:$M$196,10,FALSE))","v":""},null,1,{"$f":"IF($O$3=\"k\",IF(VLOOKUP($L18,invullijst!$A$11:$M$196,11,FALSE)=0,\" \",VLOOKUP($L18,invullijst!$A$11:$M$196,11,FALSE)),\"\")","v":""},{"$f":"IF(VLOOKUP($L18,invullijst!$A$11:$M$237,4,FALSE)=\"\",\"\",VLOOKUP($L18,invullijst!$A$11:$M$237,4,FALSE))","v":0},null,{"$f":"IF(VLOOKUP($L18,invullijst!$A$11:$M$196,2,FALSE)=\"\",\"\",VLOOKUP($L18,invullijst!$A$11:$M$196,2,FALSE))","v":0},null,{"$f":"IF(VLOOKUP($L18,invullijst!$A$11:$M$196,10,FALSE)=0,\"\",VLOOKUP($L18,invullijst!$A$11:$M$196,10,FALSE))","v":""}]
[2,{"$f":"IF($G$3=\"k\",IF(VLOOKUP($D19,invullijst!$A$11:$M$196,11,FALSE)=0,\" \",VLOOKUP($D19,invullijst!$A$11:$M$196,11,FALSE)),\"\")","v":""},{"$f":"IF(VLOOKUP(D19,invullijst!A$11:F$237,4,FALSE)=\"\",\"\",VLOOKUP(D19,invullijst!A$11:D$237,4,FALSE))","v":0},null,{"$f":"IF(VLOOKUP($D19,invullijst!$A$11:$M$196,2,FALSE)=\"\",\"\",VLOOKUP($D19,invullijst!$A$11:$M$196,2,FALSE))","v":0},null,{"$f":"IF(VLOOKUP($D19,invullijst!$A$11:$M$196,10,FALSE)=0,\"\",VLOOKUP($D19,invullijst!$A$11:$M$196,10,FALSE))","v":""},null,2,{"$f":"IF($O$3=\"k\",IF(VLOOKUP($L19,invullijst!$A$11:$M$196,11,FALSE)=0,\" \",VLOOKUP($L19,invullijst!$A$11:$M$196,11,FALSE)),\"\")","v":""},{"$f":"IF(VLOOKUP($L19,invullijst!$A$11:$M$237,4,FALSE)=\"\",\"\",VLOOKUP($L19,invullijst!$A$11:$M$237,4,FALSE))","v":0},null,{"$f":"IF(VLOOKUP($L19,invullijst!$A$11:$M$196,2,FALSE)=\"\",\"\",VLOOKUP($L19,invullijst!$A$11:$M$196,2,FALSE))","v":0},null,{"$f":"IF(VLOOKUP($L19,invullijst!$A$11:$M$196,10,FALSE)=0,\"\",VLOOKUP($L19,invullijst!$A$11:$M$196,10,FALSE))","v":""}]
[3,{"$f":"IF($G$3=\"k\",IF(VLOOKUP($D20,invullijst!$A$11:$M$196,11,FALSE)=0,\" \",VLOOKUP($D20,invullijst!$A$11:$M$196,11,FALSE)),\"\")","v":""},{"$f":"IF(VLOOKUP(D20,invullijst!A$11:F$237,4,FALSE)=\"\",\"\",VLOOKUP(D20,invullijst!A$11:D$237,4,FALSE))","v":0},null,{"$f":"IF(VLOOKUP($D20,invullijst!$A$11:$M$196,2,FALSE)=\"\",\"\",VLOOKUP($D20,invullijst!$A$11:$M$196,2,FALSE))","v":0},null,{"$f":"IF(VLOOKUP($D20,invullijst!$A$11:$M$196,10,FALSE)=0,\"\",VLOOKUP($D20,invullijst!$A$11:$M$196,10,FALSE))","v":""},null,3,{"$f":"IF($O$3=\"k\",IF(VLOOKUP($L20,invullijst!$A$11:$M$196,11,FALSE)=0,\" \",VLOOKUP($L20,invullijst!$A$11:$M$196,11,FALSE)),\"\")","v":""},{"$f":"IF(VLOOKUP($L20,invullijst!$A$11:$M$237,4,FALSE)=\"\",\"\",VLOOKUP($L20,invullijst!$A$11:$M$237,4,FALSE))","v":0},null,{"$f":"IF(VLOOKUP($L20,invullijst!$A$11:$M$196,2,FALSE)=\"\",\"\",VLOOKUP($L20,invullijst!$A$11:$M$196,2,FALSE))","v":0},null,{"$f":"IF(VLOOKUP($L20,invullijst!$A$11:$M$196,10,FALSE)=0,\"\",VLOOKUP($L20,invullijst!$A$11:$M$196,10,FALSE))","v":""}]
[4,{"$f":"IF($G$3=\"k\",IF(VLOOKUP($D21,invullijst!$A$11:$M$196,11,FALSE)=0,\" \",VLOOKUP($D21,invullijst!$A$11:$M$196,11,FALSE)),\"\")","v":""},{"$f":"IF(VLOOKUP(D21,invullijst!A$11:F$237,4,FALSE)=\"\",\"\",VLOOKUP(D21,invullijst!A$11:D$237,4,FALSE))","v":0},null,{"$f":"IF(VLOOKUP($D21,invullijst!$A$11:$M$196,2,FALSE)=\"\",\"\",VLOOKUP($D21,invullijst!$A$11:$M$196,2,FALSE))","v":0},null,{"$f":"IF(VLOOKUP($D21,invullijst!$A$11:$M$196,10,FALSE)=0,\"\",VLOOKUP($D21,invullijst!$A$11:$M$196,10,FALSE))","v":""},null,4,{"$f":"IF($O$3=\"k\",IF(VLOOKUP($L21,invullijst!$A$11:$M$196,11,FALSE)=0,\" \",VLOOKUP($L21,invullijst!$A$11:$M$196,11,FALSE)),\"\")","v":""},{"$f":"IF(VLOOKUP($L21,invullijst!$A$11:$M$237,4,FALSE)=\"\",\"\",VLOOKUP($L21,invullijst!$A$11:$M$237,4,FALSE))","v":0},null,{"$f":"IF(VLOOKUP($L21,invullijst!$A$11:$M$196,2,FALSE)=\"\",\"\",VLOOKUP($L21,invullijst!$A$11:$M$196,2,FALSE))","v":0},null,{"$f":"IF(VLOOKUP($L21,invullijst!$A$11:$M$196,10,FALSE)=0,\"\",VLOOKUP($L21,invullijst!$A$11:$M$196,10,FALSE))","v":""}]
["DIVERSEN / INHAAL",{"$nulls":5},{"$f":"SUM(G18:G21)","v":0},null,"DIVERSEN / INHAAL",{"$nulls":5},{"$f":"SUM(O18:O21)","v":0}]
[]
["OPGELEGD (Jeugd <16 en 65+)"]
[1,{"$f":"IF($G$3=\"k\",IF(VLOOKUP($D25,invullijst!$A$11:$M$196,11,FALSE)=0,\" \",VLOOKUP($D25,invullijst!$A$11:$M$196,11,FALSE)),\"\")","v":""},{"$f":"IF(VLOOKUP(D25,invullijst!A$11:F$237,4,FALSE)=\"\",\"\",VLOOKUP(D25,invullijst!A$11:D$237,4,FALSE))","v":0},null,{"$f":"IF(VLOOKUP($D25,invullijst!$A$11:$M$196,2,FALSE)=\"\",\"\",VLOOKUP($D25,invullijst!$A$11:$M$196,2,FALSE))","v":0},null,{"$f":"IF(VLOOKUP($D25,invullijst!$A$11:$M$196,10,FALSE)=0,\"\",VLOOKUP($D25,invullijst!$A$11:$M$196,10,FALSE))","v":""},null,1,{"$f":"IF($O$3=\"k\",IF(VLOOKUP($L25,invullijst!$A$11:$M$196,11,FALSE)=0,\" \",VLOOKUP($L25,invullijst!$A$11:$M$196,11,FALSE)),\"\")","v":""},{"$f":"IF(VLOOKUP($L25,invullijst!$A$11:$M$237,4,FALSE)=\"\",\"\",VLOOKUP($L25,invullijst!$A$11:$M$237,4,FALSE))","v":0},null,{"$f":"IF(VLOOKUP($L25,invullijst!$A$11:$M$196,2,FALSE)=\"\",\"\",VLOOKUP($L25,invullijst!$A$11:$M$196,2,FALSE))","v":0},null,{"$f":"IF(VLOOKUP($L25,invullijst!$A$11:$M$196,10,FALSE)=0,\"\",VLOOKUP($L25,invullijst!$A$11:$M$196,10,FALSE))","v":""}]
[2,{"$f":"IF($G$3=\"k\",IF(VLOOKUP($D26,invullijst!$A$11:$M$196,11,FALSE)=0,\" \",VLOOKUP($D26,invullijst!$A$11:$M$196,11,FALSE)),\"\")","v":""},{"$f":"IF(VLOOKUP(D26,invullijst!A$11:F$237,4,FALSE)=\"\",\"\",VLOOKUP(D26,invullijst!A$11:D$237,4,FALSE))","v":0},null,{"$f":"IF(VLOOKUP($D26,invullijst!$A$11:$M$196,2,FALSE)=\"\",\"\",VLOOKUP($D26,invullijst!$A$11:$M$196,2,FALSE))","v":0},null,{"$f":"IF(VLOOKUP($D26,invullijst!$A$11:$M$196,10,FALSE)=0,\"\",VLOOKUP($D26,invullijst!$A$11:$M$196,10,FALSE))","v":""},null,2,{"$f":"IF($O$3=\"k\",IF(VLOOKUP($L26,invullijst!$A$11:$M$196,11,FALSE)=0,\" \",VLOOKUP($L26,invullijst!$A$11:$M$196,11,FALSE)),\"\")","v":""},{"$f":"IF(VLOOKUP($L26,invullijst!$A$11:$M$237,4,FALSE)=\"\",\"\",VLOOKUP($L26,invullijst!$A$11:$M$237,4,FALSE))","v":0},null,{"$f":"IF(VLOOKUP($L26,invullijst!$A$11:$M$196,2,FALSE)=\"\",\"\",VLOOKUP($L26,invullijst!$A$11:$M$196,2,FALSE))","v":0},null,{"$f":"IF(VLOOKUP($L26,invullijst!$A$11:$M$196,10,FALSE)=0,\"\",VLOOKUP($L26,invullijst!$A$11:$M$196,10,FALSE))","v":""}]
[3,{"$f":"IF($G$3=\"k\",IF(VLOOKUP($D27,invullijst!$A$11:$M$196,11,FALSE)=0,\" \",VLOOKUP($D27,invullijst!$A$11:$M$196,11,FALSE)),\"\")","v":""},{"$f":"IF(VLOOKUP(D27,invullijst!A$11:F$237,4,FALSE)=\"\",\"\",VLOOKUP(D27,invullijst!A$11:D$237,4,FALSE))","v":0},null,{"$f":"IF(VLOOKUP($D27,invullijst!$A$11:$M$196,2,FALSE)=\"\",\"\",VLOOKUP($D27,invullijst!$A$11:$M$196,2,FALSE))","v":0},null,{"$f":"IF(VLOOKUP($D27,invullijst!$A$11:$M$196,10,FALSE)=0,\"\",VLOOKUP($D27,invullijst!$A$11:$M$196,10,FALSE))","v":""},null,3,{"$f":"IF($O$3=\"k\",IF(VLOOKUP($L27,invullijst!$A$11:$M$196,11,FALSE)=0,\" \",VLOOKUP($L27,invullijst!$A$11:$M$196,11,FALSE)),\"\")","v":""},{"$f":"IF(VLOOKUP($L27,invullijst!$A$11:$M$237,4,FALSE)=\"\",\"\",VLOOKUP($L27,invullijst!$A$11:$M$237,4,FALSE))","v":0},null,{"$f":"IF(VLOOKUP($L27,invullijst!$A$11:$M$196,2,FALSE)=\"\",\"\",VLOOKUP($L27,invullijst!$A$11:$M$196,2,FALSE))","v":0},null,{"$f":"IF(VLOOKUP($L27,invullijst!$A$11:$M$196,10,FALSE)=0,\"\",VLOOKUP($L27,invullijst!$A$11:$M$196,10,FALSE))","v":""}]
["Totaal korps opgelegd A1",{"$nulls":5},{"$f":"SUM(G25:G27)","v":0},null,"Totaal korps opgelegd A1",{"$nulls":5},{"$f":"SUM(O25:O27)","v":0}]
[]
[1,{"$f":"IF($G$3=\"k\",IF(VLOOKUP($D30,invullijst!$A$11:$M$196,11,FALSE)=0,\" \",VLOOKUP($D30,invullijst!$A$11:$M$196,11,FALSE)),\"\")","v":""},{"$f":"IF(VLOOKUP(D30,invullijst!A$11:F$237,4,FALSE)=\"\",\"\",VLOOKUP(D30,invullijst!A$11:D$237,4,FALSE))","v":0},null,{"$f":"IF(VLOOKUP($D30,invullijst!$A$11:$M$196,2,FALSE)=\"\",\"\",VLOOKUP($D30,invullijst!$A$11:$M$196,2,FALSE))","v":0},null,{"$f":"IF(VLOOKUP($D30,invullijst!$A$11:$M$196,10,FALSE)=0,\"\",VLOOKUP($D30,invullijst!$A$11:$M$196,10,FALSE))","v":""},null,1,{"$f":"IF($O$3=\"k\",IF(VLOOKUP($L30,invullijst!$A$11:$M$196,11,FALSE)=0,\" \",VLOOKUP($L30,invullijst!$A$11:$M$196,11,FALSE)),\"\")","v":""},{"$f":"IF(VLOOKUP($L30,invullijst!$A$11:$M$237,4,FALSE)=\"\",\"\",VLOOKUP($L30,invullijst!$A$11:$M$237,4,FALSE))","v":0},null,{"$f":"IF(VLOOKUP($L30,invullijst!$A$11:$M$196,2,FALSE)=\"\",\"\",VLOOKUP($L30,invullijst!$A$11:$M$196,2,FALSE))","v":0},null,{"$f":"IF(VLOOKUP($L30,invullijst!$A$11:$M$196,10,FALSE)=0,\"\",VLOOKUP($L30,invullijst!$A$11:$M$196,10,FALSE))","v":""}]
[2,{"$f":"IF($G$3=\"k\",IF(VLOOKUP($D31,invullijst!$A$11:$M$196,11,FALSE)=0,\" \",VLOOKUP($D31,invullijst!$A$11:$M$196,11,FALSE)),\"\")","v":""},{"$f":"IF(VLOOKUP(D31,invullijst!A$11:F$237,4,FALSE)=\"\",\"\",VLOOKUP(D31,invullijst!A$11:D$237,4,FALSE))","v":0},null,{"$f":"IF(VLOOKUP($D31,invullijst!$A$11:$M$196,2,FALSE)=\"\",\"\",VLOOKUP($D31,invullijst!$A$11:$M$196,2,FALSE))","v":0},null,{"$f":"IF(VLOOKUP($D31,invullijst!$A$11:$M$196,10,FALSE)=0,\"\",VLOOKUP($D31,invullijst!$A$11:$M$196,10,FALSE))","v":""},null,2,{"$f":"IF($O$3=\"k\",IF(VLOOKUP($L31,invullijst!$A$11:$M$196,11,FALSE)=0,\" \",VLOOKUP($L31,invullijst!$A$11:$M$196,11,FALSE)),\"\")","v":""},{"$f":"IF(VLOOKUP($L31,invullijst!$A$11:$M$237,4,FALSE)=\"\",\"\",VLOOKUP($L31,invullijst!$A$11:$M$237,4,FALSE))","v":0},null,{"$f":"IF(VLOOKUP($L31,invullijst!$A$11:$M$196,2,FALSE)=\"\",\"\",VLOOKUP($L31,invullijst!$A$11:$M$196,2,FALSE))","v":0},null,{"$f":"IF(VLOOKUP($L31,invullijst!$A$11:$M$196,10,FALSE)=0,\"\",VLOOKUP($L31,invullijst!$A$11:$M$196,10,FALSE))","v":""}]
[3,{"$f":"IF($G$3=\"k\",IF(VLOOKUP($D32,invullijst!$A$11:$M$196,11,FALSE)=0,\" \",VLOOKUP($D32,invullijst!$A$11:$M$196,11,FALSE)),\"\")","v":""},{"$f":"IF(VLOOKUP(D32,invullijst!A$11:F$237,4,FALSE)=\"\",\"\",VLOOKUP(D32,invullijst!A$11:D$237,4,FALSE))","v":0},null,{"$f":"IF(VLOOKUP($D32,invullijst!$A$11:$M$196,2,FALSE)=\"\",\"\",VLOOKUP($D32,invullijst!$A$11:$M$196,2,FALSE))","v":0},null,{"$f":"IF(VLOOKUP($D32,invullijst!$A$11:$M$196,10,FALSE)=0,\"\",VLOOKUP($D32,invullijst!$A$11:$M$196,10,FALSE))","v":""},null,3,{"$f":"IF($O$3=\"k\",IF(VLOOKUP($L32,invullijst!$A$11:$M$196,11,FALSE)=0,\" \",VLOOKUP($L32,invullijst!$A$11:$M$196,11,FALSE)),\"\")","v":""},{"$f":"IF(VLOOKUP($L32,invullijst!$A$11:$M$237,4,FALSE)=\"\",\"\",VLOOKUP($L32,invullijst!$A$11:$M$237,4,FALSE))","v":0},null,{"$f":"IF(VLOOKUP($L32,invullijst!$A$11:$M$196,2,FALSE)=\"\",\"\",VLOOKUP($L32,invullijst!$A$11:$M$196,2,FALSE))","v":0},null,{"$f":"IF(VLOOKUP($L32,invullijst!$A$11:$M$196,10,FALSE)=0,\"\",VLOOKUP($L32,invullijst!$A$11:$M$196,10,FALSE))","v":""}]
["Totaal korps opgelegd A2",{"$nulls":5},{"$f":"SUM(G30:G32)","v":0},null,"Totaal korps opgelegd A2",{"$nulls":5},{"$f":"SUM(O30:O32)","v":0}]
[]
[1,{"$f":"IF($G$3=\"k\",IF(VLOOKUP($D35,invullijst!$A$11:$M$196,11,FALSE)=0,\" \",VLOOKUP($D35,invullijst!$A$11:$M$196,11,FALSE)),\"\")","v":""},{"$f":"IF(VLOOKUP(D35,invullijst!A$11:F$237,4,FALSE)=\"\",\"\",VLOOKUP(D35,invullijst!A$11:D$237,4,FALSE))","v":0},null,{"$f":"IF(VLOOKUP($D35,invullijst!$A$11:$M$196,2,FALSE)=\"\",\"\",VLOOKUP($D35,invullijst!$A$11:$M$196,2,FALSE))","v":0},null,{"$f":"IF(VLOOKUP($D35,invullijst!$A$11:$M$196,10,FALSE)=0,\"\",VLOOKUP($D35,invullijst!$A$11:$M$196,10,FALSE))","v":""},null,1,{"$f":"IF($O$3=\"k\",IF(VLOOKUP($L35,invullijst!$A$11:$M$196,11,FALSE)=0,\" \",VLOOKUP($L35,invullijst!$A$11:$M$196,11,FALSE)),\"\")","v":""},{"$f":"IF(VLOOKUP($L35,invullijst!$A$11:$M$237,4,FALSE)=\"\",\"\",VLOOKUP($L35,invullijst!$A$11:$M$237,4,FALSE))","v":0},null,{"$f":"IF(VLOOKUP($L35,invullijst!$A$11:$M$196,2,FALSE)=\"\",\"\",VLOOKUP($L35,invullijst!$A$11:$M$196,2,FALSE))","v":0},null,{"$f":"IF(VLOOKUP($L35,invullijst!$A$11:$M$196,10,FALSE)=0,\"\",VLOOKUP($L35,invullijst!$A$11:$M$196,10,FALSE))","v":""}]
[2,{"$f":"IF($G$3=\"k\",IF(VLOOKUP($D36,invullijst!$A$11:$M$196,11,FALSE)=0,\" \",VLOOKUP($D36,invullijst!$A$11:$M$196,11,FALSE)),\"\")","v":""},{"$f":"IF(VLOOKUP(D36,invullijst!A$11:F$237,4,FALSE)=\"\",\"\",VLOOKUP(D36,invullijst!A$11:D$237,4,FALSE))","v":0},null,{"$f":"IF(VLOOKUP($D36,invullijst!$A$11:$M$196,2,FALSE)=\"\",\"\",VLOOKUP($D36,invullijst!$A$11:$M$196,2,FALSE))","v":0},null,{"$f":"IF(VLOOKUP($D36,invullijst!$A$11:$M$196,10,FALSE)=0,\"\",VLOOKUP($D36,invullijst!$A$11:$M$196,10,FALSE))","v":""},null,2,{"$f":"IF($O$3=\"k\",IF(VLOOKUP($L36,invullijst!$A$11:$M$196,11,FALSE)=0,\" \",VLOOKUP($L36,invullijst!$A$11:$M$196,11,FALSE)),\"\")","v":""},{"$f":"IF(VLOOKUP($L36,invullijst!$A$11:$M$237,4,FALSE)=\"\",\"\",VLOOKUP($L36,invullijst!$A$11:$M$237,4,FALSE))","v":0},null,{"$f":"IF(VLOOKUP($L36,invullijst!$A$11:$M$196,2,FALSE)=\"\",\"\",VLOOKUP($L36,invullijst!$A$11:$M$196,2,FALSE))","v":0},null,{"$f":"IF(VLOOKUP($L36,invullijst!$A$11:$M$196,10,FALSE)=0,\"\",VLOOKUP($L36,invullijst!$A$11:$M$196,10,FALSE))","v":""}]
[3,{"$f":"IF($G$3=\"k\",IF(VLOOKUP($D37,invullijst!$A$11:$M$196,11,FALSE)=0,\" \",VLOOKUP($D37,invullijst!$A$11:$M$196,11,FALSE)),\"\")","v":""},{"$f":"IF(VLOOKUP(D37,invullijst!A$11:F$237,4,FALSE)=\"\",\"\",VLOOKUP(D37,invullijst!A$11:D$237,4,FALSE))","v":0},null,{"$f":"IF(VLOOKUP($D37,invullijst!$A$11:$M$196,2,FALSE)=\"\",\"\",VLOOKUP($D37,invullijst!$A$11:$M$196,2,FALSE))","v":0},null,{"$f":"IF(VLOOKUP($D37,invullijst!$A$11:$M$196,10,FALSE)=0,\"\",VLOOKUP($D37,invullijst!$A$11:$M$196,10,FALSE))","v":""},null,3,{"$f":"IF($O$3=\"k\",IF(VLOOKUP($L37,invullijst!$A$11:$M$196,11,FALSE)=0,\" \",VLOOKUP($L37,invullijst!$A$11:$M$196,11,FALSE)),\"\")","v":""},{"$f":"IF(VLOOKUP($L37,invullijst!$A$11:$M$237,4,FALSE)=\"\",\"\",VLOOKUP($L37,invullijst!$A$11:$M$237,4,FALSE))","v":0},null,{"$f":"IF(VLOOKUP($L37,invullijst!$A$11:$M$196,2,FALSE)=\"\",\"\",VLOOKUP($L37,invullijst!$A$11:$M$196,2,FALSE))","v":0},null,{"$f":"IF(VLOOKUP($L37,invullijst!$A$11:$M$196,10,FALSE)=0,\"\",VLOOKUP($L37,invullijst!$A$11:$M$196,10,FALSE))","v":""}]
["Totaal korps opgelegd A3",{"$nulls":5},{"$f":"SUM(G35:G37)","v":0},null,"Totaal korps opgelegd A3",{"$nulls":5},{"$f":"SUM(O35:O37)","v":0}]

{"sheet":"wedstrijd 5B","index":14,"n_rows":38,"n_cols":15,"rows_kept":38,"merged":[[0,0,0,4],[0,5,0,7],[0,8,0,14],[1,0,1,11],[1,12,1,14],[2,1,2,5],[2,9,2,13],[4,0,4,14],[5,4,5,5],[5,12,5,13],[6,4,6,5],[6,12,6,13],[7,4,7,5],[7,12,7,13],[8,4,8,5],[8,12,8,13],[9,0,9,5],[9,8,9,13],[11,4,11,5],[11,12,11,13],[12,4,12,5],[12,12,12,13],[13,4,13,5],[13,12,13,13],[14,4,14,5],[14,12,14,13],[15,0,15,5],[15,8,15,13],[17,4,17,5],[17,12,17,13],[18,4,18,5],[18,12,18,13],[19,4,19,5],[19,12,19,13],[20,4,20,5],[20,12,20,13],[21,0,21,5],[21,8,21,13],[23,0,23,14],[24,4,24,5],[24,12,24,13],[25,4,25,5],[25,12,25,13],[26,4,26,5],[26,12,26,13],[27,0,27,5],[27,8,27,13],[29,4,29,5],[29,12,29,13],[30,4,30,5],[30,12,30,13],[31,4,31,5],[31,12,31,13],[32,0,32,5],[32,8,32,13],[34,4,34,5],[34,12,34,13],[35,4,35,5],[35,12,35,13],[36,4,36,5],[36,12,36,13],[37,0,37,5],[37,8,37,13]]}
[{"$f":"invullijst!F1","v":"Organistatie"},{"$nulls":4},{"$f":"invullijst!H2","v":"2025 - 2026"},null,null,{"$f":"invullijst!F3","v":"Sint Ambrosius Baardwijk"}]
["Datum: ",{"$nulls":11},"2026-03-15"]
[4,{"$f":"IF(VLOOKUP(A3,invullijst!A1:F5,2,FALSE)=\"\",\"\",VLOOKUP(A3,invullijst!A1:F5,2,FALSE))","v":"Sint Ambrosius Haarsteeg"},{"$nulls":6},5,{"$f":"IF(VLOOKUP(I3,invullijst!A1:C5,2,FALSE)=\"\",\"\",VLOOKUP(I3,invullijst!A1:C5,2,FALSE))","v":"Sint Jan Baptist Kaatsheuvel"}]
[]
["vrijehand"]
[1,{"$f":"IF($G$3=\"k\",IF(VLOOKUP($D6,invullijst!$A$11:$M$196,11,FALSE)=0,\" \",VLOOKUP($D6,invullijst!$A$11:$M$196,11,FALSE)),\"\")","v":""},{"$f":"IF(VLOOKUP(D6,invullijst!A$11:F$237,4,FALSE)=\"\",\"\",VLOOKUP(D6,invullijst!A$11:D$237,4,FALSE))","v":0},null,{"$f":"IF(VLOOKUP($D6,invullijst!$A$11:$M$196,2,FALSE)=\"\",\"\",VLOOKUP($D6,invullijst!$A$11:$M$196,2,FALSE))","v":0},null,{"$f":"IF(VLOOKUP($D6,invullijst!$A$11:$M$196,10,FALSE)=0,\"\",VLOOKUP($D6,invullijst!$A$11:$M$196,10,FALSE))","v":""},null,1,{"$f":"IF($O$3=\"k\",IF(VLOOKUP($L6,invullijst!$A$11:$M$196,11,FALSE)=0,\" \",VLOOKUP($L6,invullijst!$A$11:$M$196,11,FALSE)),\"\")","v":""},{"$f":"IF(VLOOKUP($L6,invullijst!$A$11:$M$237,4,FALSE)=\"\",\"\",VLOOKUP($L6,invullijst!$A$11:$M$237,4,FALSE))","v":0},null,{"$f":"IF(VLOOKUP($L6,invullijst!$A$11:$M$196,2,FALSE)=\"\",\"\",VLOOKUP($L6,invullijst!$A$11:$M$196,2,FALSE))","v":0},null,{"$f":"IF(VLOOKUP($L6,invullijst!$A$11:$M$196,10,FALSE)=0,\"\",VLOOKUP($L6,invullijst!$A$11:$M$196,10,FALSE))","v":""}]
[2,{"$f":"IF($G$3=\"k\",IF(VLOOKUP($D7,invullijst!$A$11:$M$196,11,FALSE)=0,\" \",VLOOKUP($D7,invullijst!$A$11:$M$196,11,FALSE)),\"\")","v":""},{"$f":"IF(VLOOKUP(D7,invullijst!A$11:F$237,4,FALSE)=\"\",\"\",VLOOKUP(D7,invullijst!A$11:D$237,4,FALSE))","v":0},null,{"$f":"IF(VLOOKUP($D7,invullijst!$A$11:$M$196,2,FALSE)=\"\",\"\",VLOOKUP($D7,invullijst!$A$11:$M$196,2,FALSE))","v":0},null,{"$f":"IF(VLOOKUP($D7,invullijst!$A$11:$M$196,10,FALSE)=0,\"\",VLOOKUP($D7,invullijst!$A$11:$M$196,10,FALSE))","v":""},null,2,{"$f":"IF($O$3=\"k\",IF(VLOOKUP($L7,invullijst!$A$11:$M$196,11,FALSE)=0,\" \",VLOOKUP($L7,invullijst!$A$11:$M$196,11,FALSE)),\"\")","v":""},{"$f":"IF(VLOOKUP($L7,invullijst!$A$11:$M$237,4,FALSE)=\"\",\"\",VLOOKUP($L7,invullijst!$A$11:$M$237,4,FALSE))","v":0},null,{"$f":"IF(VLOOKUP($L7,invullijst!$A$11:$M$196,2,FALSE)=\"\",\"\",VLOOKUP($L7,invullijst!$A$11:$M$196,2,FALSE))","v":0},null,{"$f":"IF(VLOOKUP($L7,invullijst!$A$11:$M$196,10,FALSE)=0,\"\",VLOOKUP($L7,invullijst!$A$11:$M$196,10,FALSE))","v":""}]
[3,{"$f":"IF($G$3=\"k\",IF(VLOOKUP($D8,invullijst!$A$11:$M$196,11,FALSE)=0,\" \",VLOOKUP($D8,invullijst!$A$11:$M$196,11,FALSE)),\"\")","v":""},{"$f":"IF(VLOOKUP(D8,invullijst!A$11:F$237,4,FALSE)=\"\",\"\",VLOOKUP(D8,invullijst!A$11:D$237,4,FALSE))","v":0},null,{"$f":"IF(VLOOKUP($D8,invullijst!$A$11:$M$196,2,FALSE)=\"\",\"\",VLOOKUP($D8,invullijst!$A$11:$M$196,2,FALSE))","v":0},null,{"$f":"IF(VLOOKUP($D8,invullijst!$A$11:$M$196,10,FALSE)=0,\"\",VLOOKUP($D8,invullijst!$A$11:$M$196,10,FALSE))","v":""},null,3,{"$f":"IF($O$3=\"k\",IF(VLOOKUP($L8,invullijst!$A$11:$M$196,11,FALSE)=0,\" \",VLOOKUP($L8,invullijst!$A$11:$M$196,11,FALSE)),\"\")","v":""},{"$f":"IF(VLOOKUP($L8,invullijst!$A$11:$M$237,4,FALSE)=\"\",\"\",VLOOKUP($L8,invullijst!$A$11:$M$237,4,FALSE))","v":0},null,{"$f":"IF(VLOOKUP($L8,invullijst!$A$11:$M$196,2,FALSE)=\"\",\"\",VLOOKUP($L8,invullijst!$A$11:$M$196,2,FALSE))","v":0},null,{"$f":"IF(VLOOKUP($L8,invullijst!$A$11:$M$196,10,FALSE)=0,\"\",VLOOKUP($L8,invullijst!$A$11:$M$196,10,FALSE))","v":""}]
[4,{"$f":"IF($G$3=\"k\",IF(VLOOKUP($D9,invullijst!$A$11:$M$196,11,FALSE)=0,\" \",VLOOKUP($D9,invullijst!$A$11:$M$196,11,FALSE)),\"\")","v":""},{"$f":"IF(VLOOKUP(D9,invullijst!A$11:F$237,4,FALSE)=\"\",\"\",VLOOKUP(D9,invullijst!A$11:D$237,4,FALSE))","v":0},null,{"$f":"IF(VLOOKUP($D9,invullijst!$A$11:$M$196,2,FALSE)=\"\",\"\",VLOOKUP($D9,invullijst!$A$11:$M$196,2,FALSE))","v":0},null,{"$f":"IF(VLOOKUP($D9,invullijst!$A$11:$M$196,10,FALSE)=0,\"\",VLOOKUP($D9,invullijst!$A$11:$M$196,10,FALSE))","v":""},null,4,{"$f":"IF($O$3=\"k\",IF(VLOOKUP($L9,invullijst!$A$11:$M$196,11,FALSE)=0,\" \",VLOOKUP($L9,invullijst!$A$11:$M$196,11,FALSE)),\"\")","v":""},{"$f":"IF(VLOOKUP($L9,invullijst!$A$11:$M$237,4,FALSE)=\"\",\"\",VLOOKUP($L9,invullijst!$A$11:$M$237,4,FALSE))","v":0},null,{"$f":"IF(VLOOKUP($L9,invullijst!$A$11:$M$196,2,FALSE)=\"\",\"\",VLOOKUP($L9,invullijst!$A$11:$M$196,2,FALSE))","v":0},null,{"$f":"IF(VLOOKUP($L9,invullijst!$A$11:$M$196,10,FALSE)=0,\"\",VLOOKUP($L9,invullijst!$A$11:$M$196,10,FALSE))","v":""}]
["Totaal A korps",{"$nulls":5},{"$f":"SUM(G6:G9)","v":0},null,"Totaal A korps",{"$nulls":5},{"$f":"SUM(O6:O9)","v":0}]
[]
[1,{"$f":"IF($G$3=\"k\",IF(VLOOKUP($D12,invullijst!$A$11:$M$196,11,FALSE)=0,\" \",VLOOKUP($D12,invullijst!$A$11:$M$196,11,FALSE)),\"\")","v":""},{"$f":"IF(VLOOKUP(D12,invullijst!A$11:F$237,4,FALSE)=\"\",\"\",VLOOKUP(D12,invullijst!A$11:D$237,4,FALSE))","v":0},null,{"$f":"IF(VLOOKUP($D12,invullijst!$A$11:$M$196,2,FALSE)=\"\",\"\",VLOOKUP($D12,invullijst!$A$11:$M$196,2,FALSE))","v":0},null,{"$f":"IF(VLOOKUP($D12,invullijst!$A$11:$M$196,10,FALSE)=0,\"\",VLOOKUP($D12,invullijst!$A$11:$M$196,10,FALSE))","v":""},null,1,{"$f":"IF($O$3=\"k\",IF(VLOOKUP($L12,invullijst!$A$11:$M$196,11,FALSE)=0,\" \",VLOOKUP($L12,invullijst!$A$11:$M$196,11,FALSE)),\"\")","v":""},{"$f":"IF(VLOOKUP($L12,invullijst!$A$11:$M$237,4,FALSE)=\"\",\"\",VLOOKUP($L12,invullijst!$A$11:$M$237,4,FALSE))","v":0},null,{"$f":"IF(VLOOKUP($L12,invullijst!$A$11:$M$196,2,FALSE)=\"\",\"\",VLOOKUP($L12,invullijst!$A$11:$M$196,2,FALSE))","v":0},null,{"$f":"IF(VLOOKUP($L12,invullijst!$A$11:$M$196,10,FALSE)=0,\"\",VLOOKUP($L12,invullijst!$A$11:$M$196,10,FALSE))","v":""}]
[2,{"$f":"IF($G$3=\"k\",IF(VLOOKUP($D13,invullijst!$A$11:$M$196,11,FALSE)=0,\" \",VLOOKUP($D13,invullijst!$A$11:$M$196,11,FALSE)),\"\")","v":""},{"$f":"IF(VLOOKUP(D13,invullijst!A$11:F$237,4,FALSE)=\"\",\"\",VLOOKUP(D13,invullijst!A$11:D$237,4,FALSE))","v":0},null,{"$f":"IF(VLOOKUP($D13,invullijst!$A$11:$M$196,2,FALSE)=\"\",\"\",VLOOKUP($D13,invullijst!$A$11:$M$196,2,FALSE))","v":0},null,{"$f":"IF(VLOOKUP($D13,invullijst!$A$11:$M$196,10,FALSE)=0,\"\",VLOOKUP($D13,invullijst!$A$11:$M$196,10,FALSE))","v":""},null,2,{"$f":"IF($O$3=\"k\",IF(VLOOKUP($L13,invullijst!$A$11:$M$196,11,FALSE)=0,\" \",VLOOKUP($L13,invullijst!$A$11:$M$196,11,FALSE)),\"\")","v":""},{"$f":"IF(VLOOKUP($L13,invullijst!$A$11:$M$237,4,FALSE)=\"\",\"\",VLOOKUP($L13,invullijst!$A$11:$M$237,4,FALSE))","v":0},null,{"$f":"IF(VLOOKUP($L13,invullijst!$A$11:$M$196,2,FALSE)=\"\",\"\",VLOOKUP($L13,invullijst!$A$11:$M$196,2,FALSE))","v":0},null,{"$f":"IF(VLOOKUP($L13,invullijst!$A$11:$M$196,10,FALSE)=0,\"\",VLOOKUP($L13,invullijst!$A$11:$M$196,10,FALSE))","v":""}]
[3,{"$f":"IF($G$3=\"k\",IF(VLOOKUP($D14,invullijst!$A$11:$M$196,11,FALSE)=0,\" \",VLOOKUP($D14,invullijst!$A$11:$M$196,11,FALSE)),\"\")","v":""},{"$f":"IF(VLOOKUP(D14,invullijst!A$11:F$237,4,FALSE)=\"\",\"\",VLOOKUP(D14,invullijst!A$11:D$237,4,FALSE))","v":0},null,{"$f":"IF(VLOOKUP($D14,invullijst!$A$11:$M$196,2,FALSE)=\"\",\"\",VLOOKUP($D14,invullijst!$A$11:$M$196,2,FALSE))","v":0},null,{"$f":"IF(VLOOKUP($D14,invullijst!$A$11:$M$196,10,FALSE)=0,\"\",VLOOKUP($D14,invullijst!$A$11:$M$196,10,FALSE))","v":""},null,3,{"$f":"IF($O$3=\"k\",IF(VLOOKUP($L14,invullijst!$A$11:$M$196,11,FALSE)=0,\" \",VLOOKUP($L14,invullijst!$A$11:$M$196,11,FALSE)),\"\")","v":""},{"$f":"IF(VLOOKUP($L14,invullijst!$A$11:$M$237,4,FALSE)=\"\",\"\",VLOOKUP($L14,invullijst!$A$11:$M$237,4,FALSE))","v":0},null,{"$f":"IF(VLOOKUP($L14,invullijst!$A$11:$M$196,2,FALSE)=\"\",\"\",VLOOKUP($L14,invullijst!$A$11:$M$196,2,FALSE))","v":0},null,{"$f":"IF(VLOOKUP($L14,invullijst!$A$11:$M$196,10,FALSE)=0,\"\",VLOOKUP($L14,invullijst!$A$11:$M$196,10,FALSE))","v":""}]
[4,{"$f":"IF($G$3=\"k\",IF(VLOOKUP($D15,invullijst!$A$11:$M$196,11,FALSE)=0,\" \",VLOOKUP($D15,invullijst!$A$11:$M$196,11,FALSE)),\"\")","v":""},{"$f":"IF(VLOOKUP(D15,invullijst!A$11:F$237,4,FALSE)=\"\",\"\",VLOOKUP(D15,invullijst!A$11:D$237,4,FALSE))","v":0},null,{"$f":"IF(VLOOKUP($D15,invullijst!$A$11:$M$196,2,FALSE)=\"\",\"\",VLOOKUP($D15,invullijst!$A$11:$M$196,2,FALSE))","v":0},null,{"$f":"IF(VLOOKUP($D15,invullijst!$A$11:$M$196,10,FALSE)=0,\"\",VLOOKUP($D15,invullijst!$A$11:$M$196,10,FALSE))","v":""},null,4,{"$f":"IF($O$3=\"k\",IF(VLOOKUP($L15,invullijst!$A$11:$M$196,11,FALSE)=0,\" \",VLOOKUP($L15,invullijst!$A$11:$M$196,11,FALSE)),\"\")","v":""},{"$f":"IF(VLOOKUP($L15,invullijst!$A$11:$M$237,4,FALSE)=\"\",\"\",VLOOKUP($L15,invullijst!$A$11:$M$237,4,FALSE))","v":0},null,{"$f":"IF(VLOOKUP($L15,invullijst!$A$11:$M$196,2,FALSE)=\"\",\"\",VLOOKUP($L15,invullijst!$A$11:$M$196,2,FALSE))","v":0},null,{"$f":"IF(VLOOKUP($L15,invullijst!$A$11:$M$196,10,FALSE)=0,\"\",VLOOKUP($L15,invullijst!$A$11:$M$196,10,FALSE))","v":""}]
["Totaal B1 korps",{"$nulls":5},{"$f":"SUM(G12:G15)","v":0},null,"Totaal B1 korps",{"$nulls":5},{"$f":"SUM(O12:O15)","v":0}]
[]
[1,{"$f":"IF($G$3=\"k\",IF(VLOOKUP($D18,invullijst!$A$11:$M$196,11,FALSE)=0,\" \",VLOOKUP($D18,invullijst!$A$11:$M$196,11,FALSE)),\"\")","v":""},{"$f":"IF(VLOOKUP(D18,invullijst!A$11:F$237,4,FALSE)=\"\",\"\",VLOOKUP(D18,invullijst!A$11:D$237,4,FALSE))","v":0},null,{"$f":"IF(VLOOKUP($D18,invullijst!$A$11:$M$196,2,FALSE)=\"\",\"\",VLOOKUP($D18,invullijst!$A$11:$M$196,2,FALSE))","v":0},null,{"$f":"IF(VLOOKUP($D18,invullijst!$A$11:$M$196,10,FALSE)=0,\"\",VLOOKUP($D18,invullijst!$A$11:$M$196,10,FALSE))","v":""},null,1,{"$f":"IF($O$3=\"k\",IF(VLOOKUP($L18,invullijst!$A$11:$M$196,11,FALSE)=0,\" \",VLOOKUP($L18,invullijst!$A$11:$M$196,11,FALSE)),\"\")","v":""},{"$f":"IF(VLOOKUP($L18,invullijst!$A$11:$M$237,4,FALSE)=\"\",\"\",VLOOKUP($L18,invullijst!$A$11:$M$237,4,FALSE))","v":0},null,{"$f":"IF(VLOOKUP($L18,invullijst!$A$11:$M$196,2,FALSE)=\"\",\"\",VLOOKUP($L18,invullijst!$A$11:$M$196,2,FALSE))","v":0},null,{"$f":"IF(VLOOKUP($L18,invullijst!$A$11:$M$196,10,FALSE)=0,\"\",VLOOKUP($L18,invullijst!$A$11:$M$196,10,FALSE))","v":""}]
[2,{"$f":"IF($G$3=\"k\",IF(VLOOKUP($D19,invullijst!$A$11:$M$196,11,FALSE)=0,\" \",VLOOKUP($D19,invullijst!$A$11:$M$196,11,FALSE)),\"\")","v":""},{"$f":"IF(VLOOKUP(D19,invullijst!A$11:F$237,4,FALSE)=\"\",\"\",VLOOKUP(D19,invullijst!A$11:D$237,4,FALSE))","v":0},null,{"$f":"IF(VLOOKUP($D19,invullijst!$A$11:$M$196,2,FALSE)=\"\",\"\",VLOOKUP($D19,invullijst!$A$11:$M$196,2,FALSE))","v":0},null,{"$f":"IF(VLOOKUP($D19,invullijst!$A$11:$M$196,10,FALSE)=0,\"\",VLOOKUP($D19,invullijst!$A$11:$M$196,10,FALSE))","v":""},null,2,{"$f":"IF($O$3=\"k\",IF(VLOOKUP($L19,invullijst!$A$11:$M$196,11,FALSE)=0,\" \",VLOOKUP($L19,invullijst!$A$11:$M$196,11,FALSE)),\"\")","v":""},{"$f":"IF(VLOOKUP($L19,invullijst!$A$11:$M$237,4,FALSE)=\"\",\"\",VLOOKUP($L19,invullijst!$A$11:$M$237,4,FALSE))","v":0},null,{"$f":"IF(VLOOKUP($L19,invullijst!$A$11:$M$196,2,FALSE)=\"\",\"\",VLOOKUP($L19,invullijst!$A$11:$M$196,2,FALSE))","v":0},null,{"$f":"IF(VLOOKUP($L19,invullijst!$A$11:$M$196,10,FALSE)=0,\"\",VLOOKUP($L19,invullijst!$A$11:$M$196,10,FALSE))","v":""}]
[3,{"$f":"IF($G$3=\"k\",IF(VLOOKUP($D20,invullijst!$A$11:$M$196,11,FALSE)=0,\" \",VLOOKUP($D20,invullijst!$A$11:$M$196,11,FALSE)),\"\")","v":""},{"$f":"IF(VLOOKUP(D20,invullijst!A$11:F$237,4,FALSE)=\"\",\"\",VLOOKUP(D20,invullijst!A$11:D$237,4,FALSE))","v":0},null,{"$f":"IF(VLOOKUP($D20,invullijst!$A$11:$M$196,2,FALSE)=\"\",\"\",VLOOKUP($D20,invullijst!$A$11:$M$196,2,FALSE))","v":0},null,{"$f":"IF(VLOOKUP($D20,invullijst!$A$11:$M$196,10,FALSE)=0,\"\",VLOOKUP($D20,invullijst!$A$11:$M$196,10,FALSE))","v":""},null,3,{"$f":"IF($O$3=\"k\",IF(VLOOKUP($L20,invullijst!$A$11:$M$196,11,FALSE)=0,\" \",VLOOKUP($L20,invullijst!$A$11:$M$196,11,FALSE)),\"\")","v":""},{"$f":"IF(VLOOKUP($L20,invullijst!$A$11:$M$237,4,FALSE)=\"\",\"\",VLOOKUP($L20,invullijst!$A$11:$M$237,4,FALSE))","v":0},null,{"$f":"IF(VLOOKUP($L20,invullijst!$A$11:$M$196,2,FALSE)=\"\",\"\",VLOOKUP($L20,invullijst!$A$11:$M$196,2,FALSE))","v":0},null,{"$f":"IF(VLOOKUP($L20,invullijst!$A$11:$M$196,10,FALSE)=0,\"\",VLOOKUP($L20,invullijst!$A$11:$M$196,10,FALSE))","v":""}]
[4,{"$f":"IF($G$3=\"k\",IF(VLOOKUP($D21,invullijst!$A$11:$M$196,11,FALSE)=0,\" \",VLOOKUP($D21,invullijst!$A$11:$M$196,11,FALSE)),\"\")","v":""},{"$f":"IF(VLOOKUP(D21,invullijst!A$11:F$237,4,FALSE)=\"\",\"\",VLOOKUP(D21,invullijst!A$11:D$237,4,FALSE))","v":0},null,{"$f":"IF(VLOOKUP($D21,invullijst!$A$11:$M$196,2,FALSE)=\"\",\"\",VLOOKUP($D21,invullijst!$A$11:$M$196,2,FALSE))","v":0},null,{"$f":"IF(VLOOKUP($D21,invullijst!$A$11:$M$196,10,FALSE)=0,\"\",VLOOKUP($D21,invullijst!$A$11:$M$196,10,FALSE))","v":""},null,4,{"$f":"IF($O$3=\"k\",IF(VLOOKUP($L21,invullijst!$A$11:$M$196,11,FALSE)=0,\" \",VLOOKUP($L21,invullijst!$A$11:$M$196,11,FALSE)),\"\")","v":""},{"$f":"IF(VLOOKUP($L21,invullijst!$A$11:$M$237,4,FALSE)=\"\",\"\",VLOOKUP($L21,invullijst!$A$11:$M$237,4,FALSE))","v":0},null,{"$f":"IF(VLOOKUP($L21,invullijst!$A$11:$M$196,2,FALSE)=\"\",\"\",VLOOKUP($L21,invullijst!$A$11:$M$196,2,FALSE))","v":0},null,{"$f":"IF(VLOOKUP($L21,invullijst!$A$11:$M$196,10,FALSE)=0,\"\",VLOOKUP($L21,invullijst!$A$11:$M$196,10,FALSE))","v":""}]
["DIVERSEN / INHAAL",{"$nulls":5},{"$f":"SUM(G18:G21)","v":0},null,"DIVERSEN / INHAAL",{"$nulls":5},{"$f":"SUM(O18:O21)","v":0}]
[]
["OPGELEGD (Jeugd <16 en 65+)"]
[1,{"$f":"IF($G$3=\"k\",IF(VLOOKUP($D25,invullijst!$A$11:$M$196,11,FALSE)=0,\" \",VLOOKUP($D25,invullijst!$A$11:$M$196,11,FALSE)),\"\")","v":""},{"$f":"IF(VLOOKUP(D25,invullijst!A$11:F$237,4,FALSE)=\"\",\"\",VLOOKUP(D25,invullijst!A$11:D$237,4,FALSE))","v":0},null,{"$f":"IF(VLOOKUP($D25,invullijst!$A$11:$M$196,2,FALSE)=\"\",\"\",VLOOKUP($D25,invullijst!$A$11:$M$196,2,FALSE))","v":0},null,{"$f":"IF(VLOOKUP($D25,invullijst!$A$11:$M$196,10,FALSE)=0,\"\",VLOOKUP($D25,invullijst!$A$11:$M$196,10,FALSE))","v":""},null,1,{"$f":"IF($O$3=\"k\",IF(VLOOKUP($L25,invullijst!$A$11:$M$196,11,FALSE)=0,\" \",VLOOKUP($L25,invullijst!$A$11:$M$196,11,FALSE)),\"\")","v":""},{"$f":"IF(VLOOKUP($L25,invullijst!$A$11:$M$237,4,FALSE)=\"\",\"\",VLOOKUP($L25,invullijst!$A$11:$M$237,4,FALSE))","v":0},null,{"$f":"IF(VLOOKUP($L25,invullijst!$A$11:$M$196,2,FALSE)=\"\",\"\",VLOOKUP($L25,invullijst!$A$11:$M$196,2,FALSE))","v":0},null,{"$f":"IF(VLOOKUP($L25,invullijst!$A$11:$M$196,10,FALSE)=0,\"\",VLOOKUP($L25,invullijst!$A$11:$M$196,10,FALSE))","v":""}]
[2,{"$f":"IF($G$3=\"k\",IF(VLOOKUP($D26,invullijst!$A$11:$M$196,11,FALSE)=0,\" \",VLOOKUP($D26,invullijst!$A$11:$M$196,11,FALSE)),\"\")","v":""},{"$f":"IF(VLOOKUP(D26,invullijst!A$11:F$237,4,FALSE)=\"\",\"\",VLOOKUP(D26,invullijst!A$11:D$237,4,FALSE))","v":0},null,{"$f":"IF(VLOOKUP($D26,invullijst!$A$11:$M$196,2,FALSE)=\"\",\"\",VLOOKUP($D26,invullijst!$A$11:$M$196,2,FALSE))","v":0},null,{"$f":"IF(VLOOKUP($D26,invullijst!$A$11:$M$196,10,FALSE)=0,\"\",VLOOKUP($D26,invullijst!$A$11:$M$196,10,FALSE))","v":""},null,2,{"$f":"IF($O$3=\"k\",IF(VLOOKUP($L26,invullijst!$A$11:$M$196,11,FALSE)=0,\" \",VLOOKUP($L26,invullijst!$A$11:$M$196,11,FALSE)),\"\")","v":""},{"$f":"IF(VLOOKUP($L26,invullijst!$A$11:$M$237,4,FALSE)=\"\",\"\",VLOOKUP($L26,invullijst!$A$11:$M$237,4,FALSE))","v":0},null,{"$f":"IF(VLOOKUP($L26,invullijst!$A$11:$M$196,2,FALSE)=\"\",\"\",VLOOKUP($L26,invullijst!$A$11:$M$196,2,FALSE))","v":0},null,{"$f":"IF(VLOOKUP($L26,invullijst!$A$11:$M$196,10,FALSE)=0,\"\",VLOOKUP($L26,invullijst!$A$11:$M$196,10,FALSE))","v":""}]
[3,{"$f":"IF($G$3=\"k\",IF(VLOOKUP($D27,invullijst!$A$11:$M$196,11,FALSE)=0,\" \",VLOOKUP($D27,invullijst!$A$11:$M$196,11,FALSE)),\"\")","v":""},{"$f":"IF(VLOOKUP(D27,invullijst!A$11:F$237,4,FALSE)=\"\",\"\",VLOOKUP(D27,invullijst!A$11:D$237,4,FALSE))","v":0},null,{"$f":"IF(VLOOKUP($D27,invullijst!$A$11:$M$196,2,FALSE)=\"\",\"\",VLOOKUP($D27,invullijst!$A$11:$M$196,2,FALSE))","v":0},null,{"$f":"IF(VLOOKUP($D27,invullijst!$A$11:$M$196,10,FALSE)=0,\"\",VLOOKUP($D27,invullijst!$A$11:$M$196,10,FALSE))","v":""},null,3,{"$f":"IF($O$3=\"k\",IF(VLOOKUP($L27,invullijst!$A$11:$M$196,11,FALSE)=0,\" \",VLOOKUP($L27,invullijst!$A$11:$M$196,11,FALSE)),\"\")","v":""},{"$f":"IF(VLOOKUP($L27,invullijst!$A$11:$M$237,4,FALSE)=\"\",\"\",VLOOKUP($L27,invullijst!$A$11:$M$237,4,FALSE))","v":0},null,{"$f":"IF(VLOOKUP($L27,invullijst!$A$11:$M$196,2,FALSE)=\"\",\"\",VLOOKUP($L27,invullijst!$A$11:$M$196,2,FALSE))","v":0},null,{"$f":"IF(VLOOKUP($L27,invullijst!$A$11:$M$196,10,FALSE)=0,\"\",VLOOKUP($L27,invullijst!$A$11:$M$196,10,FALSE))","v":""}]
["Totaal korps opgelegd A1",{"$nulls":5},{"$f":"SUM(G25:G27)","v":0},null,"Totaal korps opgelegd A1",{"$nulls":5},{"$f":"SUM(O25:O27)","v":0}]
[]
[1,{"$f":"IF($G$3=\"k\",IF(VLOOKUP($D30,invullijst!$A$11:$M$196,11,FALSE)=0,\" \",VLOOKUP($D30,invullijst!$A$11:$M$196,11,FALSE)),\"\")","v":""},{"$f":"IF(VLOOKUP(D30,invullijst!A$11:F$237,4,FALSE)=\"\",\"\",VLOOKUP(D30,invullijst!A$11:D$237,4,FALSE))","v":0},null,{"$f":"IF(VLOOKUP($D30,invullijst!$A$11:$M$196,2,FALSE)=\"\",\"\",VLOOKUP($D30,invullijst!$A$11:$M$196,2,FALSE))","v":0},null,{"$f":"IF(VLOOKUP($D30,invullijst!$A$11:$M$196,10,FALSE)=0,\"\",VLOOKUP($D30,invullijst!$A$11:$M$196,10,FALSE))","v":""},null,1,{"$f":"IF($O$3=\"k\",IF(VLOOKUP($L30,invullijst!$A$11:$M$196,11,FALSE)=0,\" \",VLOOKUP($L30,invullijst!$A$11:$M$196,11,FALSE)),\"\")","v":""},{"$f":"IF(VLOOKUP($L30,invullijst!$A$11:$M$237,4,FALSE)=\"\",\"\",VLOOKUP($L30,invullijst!$A$11:$M$237,4,FALSE))","v":0},null,{"$f":"IF(VLOOKUP($L30,invullijst!$A$11:$M$196,2,FALSE)=\"\",\"\",VLOOKUP($L30,invullijst!$A$11:$M$196,2,FALSE))","v":0},null,{"$f":"IF(VLOOKUP($L30,invullijst!$A$11:$M$196,10,FALSE)=0,\"\",VLOOKUP($L30,invullijst!$A$11:$M$196,10,FALSE))","v":""}]
[2,{"$f":"IF($G$3=\"k\",IF(VLOOKUP($D31,invullijst!$A$11:$M$196,11,FALSE)=0,\" \",VLOOKUP($D31,invullijst!$A$11:$M$196,11,FALSE)),\"\")","v":""},{"$f":"IF(VLOOKUP(D31,invullijst!A$11:F$237,4,FALSE)=\"\",\"\",VLOOKUP(D31,invullijst!A$11:D$237,4,FALSE))","v":0},null,{"$f":"IF(VLOOKUP($D31,invullijst!$A$11:$M$196,2,FALSE)=\"\",\"\",VLOOKUP($D31,invullijst!$A$11:$M$196,2,FALSE))","v":0},null,{"$f":"IF(VLOOKUP($D31,invullijst!$A$11:$M$196,10,FALSE)=0,\"\",VLOOKUP($D31,invullijst!$A$11:$M$196,10,FALSE))","v":""},null,2,{"$f":"IF($O$3=\"k\",IF(VLOOKUP($L31,invullijst!$A$11:$M$196,11,FALSE)=0,\" \",VLOOKUP($L31,invullijst!$A$11:$M$196,11,FALSE)),\"\")","v":""},{"$f":"IF(VLOOKUP($L31,invullijst!$A$11:$M$237,4,FALSE)=\"\",\"\",VLOOKUP($L31,invullijst!$A$11:$M$237,4,FALSE))","v":0},null,{"$f":"IF(VLOOKUP($L31,invullijst!$A$11:$M$196,2,FALSE)=\"\",\"\",VLOOKUP($L31,invullijst!$A$11:$M$196,2,FALSE))","v":0},null,{"$f":"IF(VLOOKUP($L31,invullijst!$A$11:$M$196,10,FALSE)=0,\"\",VLOOKUP($L31,invullijst!$A$11:$M$196,10,FALSE))","v":""}]
[3,{"$f":"IF($G$3=\"k\",IF(VLOOKUP($D32,invullijst!$A$11:$M$196,11,FALSE)=0,\" \",VLOOKUP($D32,invullijst!$A$11:$M$196,11,FALSE)),\"\")","v":""},{"$f":"IF(VLOOKUP(D32,invullijst!A$11:F$237,4,FALSE)=\"\",\"\",VLOOKUP(D32,invullijst!A$11:D$237,4,FALSE))","v":0},null,{"$f":"IF(VLOOKUP($D32,invullijst!$A$11:$M$196,2,FALSE)=\"\",\"\",VLOOKUP($D32,invullijst!$A$11:$M$196,2,FALSE))","v":0},null,{"$f":"IF(VLOOKUP($D32,invullijst!$A$11:$M$196,10,FALSE)=0,\"\",VLOOKUP($D32,invullijst!$A$11:$M$196,10,FALSE))","v":""},null,3,{"$f":"IF($O$3=\"k\",IF(VLOOKUP($L32,invullijst!$A$11:$M$196,11,FALSE)=0,\" \",VLOOKUP($L32,invullijst!$A$11:$M$196,11,FALSE)),\"\")","v":""},{"$f":"IF(VLOOKUP($L32,invullijst!$A$11:$M$237,4,FALSE)=\"\",\"\",VLOOKUP($L32,invullijst!$A$11:$M$237,4,FALSE))","v":0},null,{"$f":"IF(VLOOKUP($L32,invullijst!$A$11:$M$196,2,FALSE)=\"\",\"\",VLOOKUP($L32,invullijst!$A$11:$M$196,2,FALSE))","v":0},null,{"$f":"IF(VLOOKUP($L32,invullijst!$A$11:$M$196,10,FALSE)=0,\"\",VLOOKUP($L32,invullijst!$A$11:$M$196,10,FALSE))","v":""}]
["Totaal korps opgelegd A2",{"$nulls":5},{"$f":"SUM(G30:G32)","v":0},null,"Totaal korps opgelegd A2",{"$nulls":5},{"$f":"SUM(O30:O32)","v":0}]
[]
[1,{"$f":"IF($G$3=\"k\",IF(VLOOKUP($D35,invullijst!$A$11:$M$196,11,FALSE)=0,\" \",VLOOKUP($D35,invullijst!$A$11:$M$196,11,FALSE)),\"\")","v":""},{"$f":"IF(VLOOKUP(D35,invullijst!A$11:F$237,4,FALSE)=\"\",\"\",VLOOKUP(D35,invullijst!A$11:D$237,4,FALSE))","v":0},null,{"$f":"IF(VLOOKUP($D35,invullijst!$A$11:$M$196,2,FALSE)=\"\",\"\",VLOOKUP($D35,invullijst!$A$11:$M$196,2,FALSE))","v":0},null,{"$f":"IF(VLOOKUP($D35,invullijst!$A$11:$M$196,10,FALSE)=0,\"\",VLOOKUP($D35,invullijst!$A$11:$M$196,10,FALSE))","v":""},null,1,{"$f":"IF($O$3=\"k\",IF(VLOOKUP($L35,invullijst!$A$11:$M$196,11,FALSE)=0,\" \",VLOOKUP($L35,invullijst!$A$11:$M$196,11,FALSE)),\"\")","v":""},{"$f":"IF(VLOOKUP($L35,invullijst!$A$11:$M$237,4,FALSE)=\"\",\"\",VLOOKUP($L35,invullijst!$A$11:$M$237,4,FALSE))","v":0},null,{"$f":"IF(VLOOKUP($L35,invullijst!$A$11:$M$196,2,FALSE)=\"\",\"\",VLOOKUP($L35,invullijst!$A$11:$M$196,2,FALSE))","v":0},null,{"$f":"IF(VLOOKUP($L35,invullijst!$A$11:$M$196,10,FALSE)=0,\"\",VLOOKUP($L35,invullijst!$A$11:$M$196,10,FALSE))","v":""}]
[2,{"$f":"IF($G$3=\"k\",IF(VLOOKUP($D36,invullijst!$A$11:$M$196,11,FALSE)=0,\" \",VLOOKUP($D36,invullijst!$A$11:$M$196,11,FALSE)),\"\")","v":""},{"$f":"IF(VLOOKUP(D36,invullijst!A$11:F$237,4,FALSE)=\"\",\"\",VLOOKUP(D36,invullijst!A$11:D$237,4,FALSE))","v":0},null,{"$f":"IF(VLOOKUP($D36,invullijst!$A$11:$M$196,2,FALSE)=\"\",\"\",VLOOKUP($D36,invullijst!$A$11:$M$196,2,FALSE))","v":0},null,{"$f":"IF(VLOOKUP($D36,invullijst!$A$11:$M$196,10,FALSE)=0,\"\",VLOOKUP($D36,invullijst!$A$11:$M$196,10,FALSE))","v":""},null,2,{"$f":"IF($O$3=\"k\",IF(VLOOKUP($L36,invullijst!$A$11:$M$196,11,FALSE)=0,\" \",VLOOKUP($L36,invullijst!$A$11:$M$196,11,FALSE)),\"\")","v":""},{"$f":"IF(VLOOKUP($L36,invullijst!$A$11:$M$237,4,FALSE)=\"\",\"\",VLOOKUP($L36,invullijst!$A$11:$M$237,4,FALSE))","v":0},null,{"$f":"IF(VLOOKUP($L36,invullijst!$A$11:$M$196,2,FALSE)=\"\",\"\",VLOOKUP($L36,invullijst!$A$11:$M$196,2,FALSE))","v":0},null,{"$f":"IF(VLOOKUP($L36,invullijst!$A$11:$M$196,10,FALSE)=0,\"\",VLOOKUP($L36,invullijst!$A$11:$M$196,10,FALSE))","v":""}]
[3,{"$f":"IF($G$3=\"k\",IF(VLOOKUP($D37,invullijst!$A$11:$M$196,11,FALSE)=0,\" \",VLOOKUP($D37,invullijst!$A$11:$M$196,11,FALSE)),\"\")","v":""},{"$f":"IF(VLOOKUP(D37,invullijst!A$11:F$237,4,FALSE)=\"\",\"\",VLOOKUP(D37,invullijst!A$11:D$237,4,FALSE))","v":0},null,{"$f":"IF(VLOOKUP($D37,invullijst!$A$11:$M$196,2,FALSE)=\"\",\"\",VLOOKUP($D37,invullijst!$A$11:$M$196,2,FALSE))","v":0},null,{"$f":"IF(VLOOKUP($D37,invullijst!$A$11:$M$196,10,FALSE)=0,\"\",VLOOKUP($D37,invullijst!$A$11:$M$196,10,FALSE))","v":""},null,3,{"$f":"IF($O$3=\"k\",IF(VLOOKUP($L37,invullijst!$A$11:$M$196,11,FALSE)=0,\" \",VLOOKUP($L37,invullijst!$A$11:$M$196,11,FALSE)),\"\")","v":""},{"$f":"IF(VLOOKUP($L37,invullijst!$A$11:$M$237,4,FALSE)=\"\",\"\",VLOOKUP($L37,invullijst!$A$11:$M$237,4,FALSE))","v":0},null,{"$f":"IF(VLOOKUP($L37,invullijst!$A$11:$M$196,2,FALSE)=\"\",\"\",VLOOKUP($L37,invullijst!$A$11:$M$196,2,FALSE))","v":0},null,{"$f":"IF(VLOOKUP($L37,invullijst!$A$11:$M$196,10,FALSE)=0,\"\",VLOOKUP($L37,invullijst!$A$11:$M$196,10,FALSE))","v":""}]
["Totaal korps opgelegd A3",{"$nulls":5},{"$f":"SUM(G35:G37)","v":0},null,"Totaal korps opgelegd A3",{"$nulls":5},{"$f":"SUM(O35:O37)","v":0}]

{"sheet":"blanco formulier","index":15,"n_rows":38,"n_cols":10,"rows_kept":38,"merged":[[0,0,0,4],[0,5,0,7],[0,8,0,14],[1,0,1,11],[1,12,1,14],[2,1,2,6],[2,9,2,14],[4,0,4,14],[5,4,5,5],[5,12,5,13],[6,4,6,5],[6,12,6,13],[7,4,7,5],[7,12,7,13],[8,4,8,5],[8,12,8,13],[9,0,9,5],[9,8,9,13],[11,4,11,5],[11,12,11,13],[12,4,12,5],[12,12,12,13],[13,4,13,5],[13,12,13,13],[14,4,14,5],[14,12,14,13],[15,0,15,5],[15,8,15,13],[17,4,17,5],[17,12,17,13],[18,4,18,5],[18,12,18,13],[19,4,19,5],[19,12,19,13],[20,4,20,5],[20,12,20,13],[21,0,21,5],[21,8,21,13],[23,0,23,14],[24,4,24,5],[24,12,24,13],[25,4,25,5],[25,12,25,13],[26,4,26,5],[26,12,26,13],[27,0,27,5],[27,8,27,13],[29,4,29,5],[29,12,29,13],[30,4,30,5],[30,12,30,13],[31,4,31,5],[31,12,31,13],[32,0,32,5],[32,8,32,13],[34,4,34,5],[34,12,34,13],[35,4,35,5],[35,12,35,13],[36,4,36,5],[36,12,36,13],[37,0,37,5],[37,8,37,13]]}
[{"$f":"invullijst!F1","v":"Organistatie"},{"$nulls":4},{"$f":"invullijst!H2","v":"2025 - 2026"},null,null,{"$f":"invullijst!F3","v":"Sint Ambrosius Baardwijk"}]
["Datum: "]
[null,{"$f":"IF(VLOOKUP(A3,invullijst!A1:F5,2,FALSE)=\"\",\"\",VLOOKUP(A3,invullijst!A1:F5,2,FALSE))","v":{"$error":"#N/A"}},{"$nulls":7},{"$f":"IF(VLOOKUP(I3,invullijst!A1:C5,2,FALSE)=\"\",\"\",VLOOKUP(I3,invullijst!A1:C5,2,FALSE))","v":{"$error":"#N/A"}}]
[]
["vrijehand"]
[1,{"$nulls":7},1]
[2,{"$nulls":7},2]
[3,{"$nulls":7},3]
[4,{"$nulls":7},4]
["Totaal A korps",{"$nulls":7},"Totaal A korps"]
[]
[1,{"$nulls":7},1]
[2,{"$nulls":7},2]
[3,{"$nulls":7},3]
[4,{"$nulls":7},4]
["Totaal B1 korps",{"$nulls":7},"Totaal B1 korps"]
[]
[1,{"$nulls":7},1]
[2,{"$nulls":7},2]
[3,{"$nulls":7},3]
[4,{"$nulls":7},4]
["Totaal B2 korps",{"$nulls":7},"Totaal B2 korps"]
[]
["OPGELEGD (Jeugd <16 en 65+)"]
[1,{"$nulls":7},1]
[2,{"$nulls":7},2]
[3,{"$nulls":7},3]
["Totaal korps opgelegd A1",{"$nulls":7},"Totaal korps opgelegd A1"]
[]
[1,{"$nulls":7},1]
[2,{"$nulls":7},2]
[3,{"$nulls":7},3]
["Totaal korps opgelegd A2",{"$nulls":7},"Totaal korps opgelegd A2"]
[]
[1,{"$nulls":7},1]
[2,{"$nulls":7},2]
[3,{"$nulls":7},3]
["Totaal korps opgelegd A3",{"$nulls":7},"Totaal korps opgelegd A3"]

{"sheet":"Blad3","index":16,"n_rows":0,"n_cols":0,"rows_kept":0}

{"sheet":"Blad1","index":17,"n_rows":0,"n_cols":0,"rows_kept":0,"hidden":true}

{"sheet":"schema","index":18,"n_rows":30,"n_cols":16,"rows_kept":30,"merged":[[0,0,0,10],[0,11,0,15],[1,0,1,8],[1,9,1,15],[3,0,3,8],[3,9,3,15],[5,0,5,7],[5,9,5,15],[7,9,7,15],[8,9,8,11],[8,12,8,14],[9,9,9,11],[9,12,9,14],[11,9,11,15],[12,9,12,11],[12,12,12,14],[13,9,13,11],[13,12,13,14],[15,9,15,15],[16,9,16,11],[16,12,16,14],[17,9,17,11],[17,12,17,14],[19,9,19,15],[20,9,20,11],[20,12,20,14],[21,9,21,11],[21,12,21,14],[23,9,23,15],[24,9,24,11],[24,12,24,14],[25,0,25,7],[25,9,25,11],[25,12,25,14],[27,0,27,15],[28,0,28,15],[29,0,29,15]]}
["Onderlinge vijf luchtbuks",{"$nulls":10},{"$f":"invullijst!H2","v":"2025 - 2026"}]
["organiserend Gilde :",{"$nulls":8},{"$f":"invullijst!F3","v":"Sint Ambrosius Baardwijk"}]
[]
["WEDSTRIJD FORMULIEREN OPSTUREN NAAR:",{"$nulls":8},"René Pullens / of  via whatsapp ovlb"]
[]
["WEDSTRIJD PLANNING",{"$nulls":8},"CONTACTGEGEVENS"]
["Dag","Maand","nr","Thuis","k","nr","Uit","k"]
["7","december",5,"Kaatsheuvel",null,2,"Baardwijk",null,null,"Baardwijk 1"]
[null,null,4,"Besoijen",null,3,"Haarsteeg",null,null,"René Pullens",null,null,"hoofdman.ambrosiusbaardwijk@gmail.com",null,null,"06-51427565"]
[null,null,1,"Elshout","vrij",{"$nulls":4},"Peter Brekelmans",null,null,"peterbrekelmans@ziggo.nl",null,null,"06-14670425"]
[]
["18","Januari",4,"Elshout",null,2,"Baardwijk",null,null,"Besoijen 2"]
[null,null,5,"Kaatsheuvel",null,1,"Besoijen",null,null,"Sander Oome",null,null,"soome@home.nl",null,null,"06-28123449"]
[null,null,3,"Haarsteeg","vrij",{"$nulls":4},"Rene van Kuijk",null,null,"rene.van.kuijk@kpnmail.nl",null,null,"06-53257760"]
[]
["1","februari",1,"Besoijen","K",2,"Baardwijk",null,null,"Elshout 3"]
[null,null,3,"Haarsteeg",null,5,"Elshout",null,null,"Johan Klerx",null,null,"johanklerx1960@gmail.com",null,null,"06-28920658"]
[null,null,4,"Kaatsheuvel","vrij",{"$nulls":4},"Freek de Jong",null,null,"freekdj@hotmail.com",null,null,"06-28417602"]
[]
["22","Februari",3,"Haarsteeg","K",2,"Baardwijk","K",null,"Haarsteeg 4"]
[null,null,1,"Elshout","K",4,"Kaatsheuvel","K",null,"Frans Mommersteeg",null,null,"f.l.mommersteeg@gmail.com",null,null,"06-23566537"]
[null,null,5,"Besoijen","vrij",{"$nulls":4},"Jan de Vaan",null,null,"jan.ambrosius@kpnmail.nl",null,null,"06-57005029"]
[]
["15","Maart",3,"Elshout",null,1,"Besoijen",null,null,"Kaatsheuvel 5"]
[null,null,4,"Haarsteeg",null,5,"Kaatsheuvel",null,null,"Diny Vos",null,null,"diny.voswesterlaken@gmail.com",null,null,"06-20297437"]
["Slotconcours te Baardwijk",{"$nulls":8},"Maikel Monden",null,null,"maikel@monden.co",null,null,"06-30302817"]
[]
["Alle wedstrijden vangen aan om 10:30 uur.      Aanvang slotwedstrijd om 10:00 uur"]
["organisatie volgorde"]
["Besoyen - Elshout - Baardwijk - Kaatsheuvel - Haarsteeg"]

{"sheet":"Blad2","index":19,"n_rows":0,"n_cols":0,"rows_kept":0,"hidden":true}